Implementation notes: amd64, gcc14, crypto_aead/aes256gcmv1

Computer: gcc14
Architecture: amd64
CPU ID: GenuineIntel-00010676-bfebfbff
SUPERCOP version: 20211108
Operation: crypto_aead
Primitive: aes256gcmv1
TimeObject sizeTest sizeImplementationCompilerBenchmark dateSUPERCOP version
90419850 0 020460 892 1008T:opensslnewclang_-march=native_-Os_-fomit-frame-pointer_-fwrapv_-Qunused-arguments_-fPIC_-fPIE2021011420210114
90513894 0 023020 916 1040T:opensslnewgcc_-march=native_-mtune=native_-O2_-fomit-frame-pointer_-fwrapv_-fPIC_-fPIE2021011420210114
90529894 0 024997 924 1040T:opensslnewgcc_-march=native_-mtune=native_-O3_-fomit-frame-pointer_-fwrapv_-fPIC_-fPIE2021011420210114
90560855 0 020888 900 1040T:opensslnewgcc_-march=native_-mtune=native_-Os_-fomit-frame-pointer_-fwrapv_-fPIC_-fPIE2021011420210114
90758889 0 021738 900 1008T:opensslnewclang_-march=native_-O_-fomit-frame-pointer_-fwrapv_-Qunused-arguments_-fPIC_-fPIE2021011420210114
90774889 0 022482 900 1008T:opensslnewclang_-mcpu=native_-O3_-fomit-frame-pointer_-fwrapv_-Qunused-arguments_-fPIC_-fPIE2021011420210114
90787940 0 022564 916 1040T:opensslnewgcc_-march=native_-mtune=native_-O_-fomit-frame-pointer_-fwrapv_-fPIC_-fPIE2021011420210114
90870889 0 022674 900 1008T:opensslnewclang_-march=native_-O3_-fomit-frame-pointer_-fwrapv_-Qunused-arguments_-fPIC_-fPIE2021011420210114
90930889 0 021738 900 1008T:opensslnewclang_-march=native_-O2_-fomit-frame-pointer_-fwrapv_-Qunused-arguments_-fPIC_-fPIE2021011420210114
12255914552 4072 01532504 149788 11056T:cryptoppg++_-march=native_-mtune=native_-Os_-fomit-frame-pointer_-fwrapv_-fPIC_-fPIE2021032420210323
12300922731 3040 01543896 148964 11088T:cryptoppg++_-march=native_-mtune=native_-O2_-fomit-frame-pointer_-fwrapv_-fPIC_-fPIE2021032420210323
12406923236 3040 01546276 148964 11088T:cryptoppg++_-march=native_-mtune=native_-O3_-fomit-frame-pointer_-fwrapv_-fPIC_-fPIE2021032420210323
12537422024 3040 01541753 148972 11088T:cryptoppg++_-march=native_-mtune=native_-O_-fomit-frame-pointer_-fwrapv_-fPIC_-fPIE2021032420210323
68154363251 0 1629531 820 1040T:refclang_-march=native_-O2_-fomit-frame-pointer_-fwrapv_-Qunused-arguments_-fPIC_-fPIE2021011420210114
68160753251 0 1630467 820 1040T:refclang_-march=native_-O3_-fomit-frame-pointer_-fwrapv_-Qunused-arguments_-fPIC_-fPIE2021011420210114
68696123171 0 1630195 820 1040T:refclang_-mcpu=native_-O3_-fomit-frame-pointer_-fwrapv_-Qunused-arguments_-fPIC_-fPIE2021011420210114
71944523251 0 1629531 820 1040T:refclang_-march=native_-O_-fomit-frame-pointer_-fwrapv_-Qunused-arguments_-fPIC_-fPIE2021011420210114
86002401782 0 1626917 812 1040T:refclang_-march=native_-Os_-fomit-frame-pointer_-fwrapv_-Qunused-arguments_-fPIC_-fPIE2021011420210114
209528602954 0 1632550 844 1072T:refgcc_-march=native_-mtune=native_-O3_-fomit-frame-pointer_-fwrapv_-fPIC_-fPIE2021011420210114
213300262276 0 1629933 836 1072T:refgcc_-march=native_-mtune=native_-O2_-fomit-frame-pointer_-fwrapv_-fPIC_-fPIE2021011420210114
216809961801 0 1627433 820 1072T:refgcc_-march=native_-mtune=native_-Os_-fomit-frame-pointer_-fwrapv_-fPIC_-fPIE2021011420210114
220672712197 0 1629381 836 1072T:refgcc_-march=native_-mtune=native_-O_-fomit-frame-pointer_-fwrapv_-fPIC_-fPIE2021011420210114
958880443251 0 1628243 820 1040refclang_-march=native_-O3_-fomit-frame-pointer_-fwrapv_-Qunused-arguments_-fPIC_-fPIE2021011420210114
958932973251 0 1627307 820 1040refclang_-march=native_-O_-fomit-frame-pointer_-fwrapv_-Qunused-arguments_-fPIC_-fPIE2021011420210114
958953503251 0 1627307 820 1040refclang_-march=native_-O2_-fomit-frame-pointer_-fwrapv_-Qunused-arguments_-fPIC_-fPIE2021011420210114
959190493171 0 1627971 820 1040refclang_-mcpu=native_-O3_-fomit-frame-pointer_-fwrapv_-Qunused-arguments_-fPIC_-fPIE2021011420210114
976733741782 0 1624693 812 1040refclang_-march=native_-Os_-fomit-frame-pointer_-fwrapv_-Qunused-arguments_-fPIC_-fPIE2021011420210114
1103855902276 0 1627709 836 1072refgcc_-march=native_-mtune=native_-O2_-fomit-frame-pointer_-fwrapv_-fPIC_-fPIE2021011420210114
1106717862954 0 1630358 844 1072refgcc_-march=native_-mtune=native_-O3_-fomit-frame-pointer_-fwrapv_-fPIC_-fPIE2021011420210114
1107395531801 0 1625209 820 1072refgcc_-march=native_-mtune=native_-Os_-fomit-frame-pointer_-fwrapv_-fPIC_-fPIE2021011420210114
1111486042197 0 1627157 836 1072refgcc_-march=native_-mtune=native_-O_-fomit-frame-pointer_-fwrapv_-fPIC_-fPIE2021011420210114

Compiler output

Implementation: T:cryptopp
Security model: timingleaks
Compiler: clang++ -march=native -O2 -fomit-frame-pointer -fwrapv -Qunused-arguments -fPIC -fPIE
try.cpp: libcrypto_aead_aes256gcmv1.a(stream.o):(.data.rel.ro._ZTVN8CryptoPP16BlockCipherFinalILNS_9CipherDirE0ENS_8Rijndael3EncEEE[_ZTVN8CryptoPP16BlockCipherFinalILNS_9CipherDirE0ENS_8Rijndael3EncEEE]+0x100): undefined reference to `non-virtual thunk to CryptoPP::Rijndael::Base::AlgorithmProvider[abi:cxx11]() const'
try.cpp: clang: error: linker command failed with exit code 1 (use -v to see invocation)

Number of similar (compiler,implementation) pairs: 4, namely:
CompilerImplementations
clang++ -march=native -O2 -fomit-frame-pointer -fwrapv -Qunused-arguments -fPIC -fPIE T:cryptopp
clang++ -march=native -O3 -fomit-frame-pointer -fwrapv -Qunused-arguments -fPIC -fPIE T:cryptopp
clang++ -march=native -O -fomit-frame-pointer -fwrapv -Qunused-arguments -fPIC -fPIE T:cryptopp
clang++ -march=native -Os -fomit-frame-pointer -fwrapv -Qunused-arguments -fPIC -fPIE T:cryptopp

Compiler output

Implementation: dolbeau/aesenc-int
Security model: constbranchindex
Compiler: clang -march=native -O2 -fomit-frame-pointer -fwrapv -Qunused-arguments -fPIC -fPIE
aesenc-int.c: aesenc-int.c:71:3: error: '__builtin_ia32_aeskeygenassist128' needs target feature aes
aesenc-int.c: BLOCK1(0x01);
aesenc-int.c: ^
aesenc-int.c: aesenc-int.c:52:11: note: expanded from macro 'BLOCK1'
aesenc-int.c: temp1 = _mm_aeskeygenassist_si128(temp2, IMM); \
aesenc-int.c: ^
aesenc-int.c: /usr/lib/llvm-3.8/bin/../lib/clang/3.8.1/include/__wmmintrin_aes.h:62:12: note: expanded from macro '_mm_aeskeygenassist_si128'
aesenc-int.c: (__m128i)__builtin_ia32_aeskeygenassist128((__v2di)(__m128i)(C), (int)(R))
aesenc-int.c: ^
aesenc-int.c: aesenc-int.c:72:3: error: '__builtin_ia32_aeskeygenassist128' needs target feature aes
aesenc-int.c: BLOCK2(0x01);
aesenc-int.c: ^
aesenc-int.c: aesenc-int.c:62:11: note: expanded from macro 'BLOCK2'
aesenc-int.c: temp1 = _mm_aeskeygenassist_si128(temp0, IMM); \
aesenc-int.c: ^
aesenc-int.c: /usr/lib/llvm-3.8/bin/../lib/clang/3.8.1/include/__wmmintrin_aes.h:62:12: note: expanded from macro '_mm_aeskeygenassist_si128'
aesenc-int.c: (__m128i)__builtin_ia32_aeskeygenassist128((__v2di)(__m128i)(C), (int)(R))
aesenc-int.c: ^
aesenc-int.c: aesenc-int.c:74:3: error: '__builtin_ia32_aeskeygenassist128' needs target feature aes
aesenc-int.c: BLOCK1(0x02);
aesenc-int.c: ^
aesenc-int.c: aesenc-int.c:52:11: note: expanded from macro 'BLOCK1'
aesenc-int.c: temp1 = _mm_aeskeygenassist_si128(temp2, IMM); \
aesenc-int.c: ^
aesenc-int.c: /usr/lib/llvm-3.8/bin/../lib/clang/3.8.1/include/__wmmintrin_aes.h:62:12: note: expanded from macro '_mm_aeskeygenassist_si128'
aesenc-int.c: ...

Number of similar (compiler,implementation) pairs: 4, namely:
CompilerImplementations
clang -march=native -O2 -fomit-frame-pointer -fwrapv -Qunused-arguments -fPIC -fPIE dolbeau/aesenc-int
clang -march=native -O3 -fomit-frame-pointer -fwrapv -Qunused-arguments -fPIC -fPIE dolbeau/aesenc-int
clang -march=native -O -fomit-frame-pointer -fwrapv -Qunused-arguments -fPIC -fPIE dolbeau/aesenc-int
clang -march=native -Os -fomit-frame-pointer -fwrapv -Qunused-arguments -fPIC -fPIE dolbeau/aesenc-int

Compiler output

Implementation: dolbeau/aesenc-int
Security model: constbranchindex
Compiler: clang -mcpu=native -O3 -fomit-frame-pointer -fwrapv -Qunused-arguments -fPIC -fPIE
aesenc-int.c: aesenc-int.c:665:16: error: always_inline function '_mm_shuffle_epi8' requires target feature 'ssse3', but would be inlined into function 'crypto_aead_aes256gcmv1_dolbeau_aesenc_int_constbranchindex_encrypt' that is compiled without support for 'ssse3'
aesenc-int.c: __m128i Hv = _mm_shuffle_epi8(_mm_loadu_si128((const __m128i*)H), rev);
aesenc-int.c: ^
aesenc-int.c: 1 error generated.

Number of similar (compiler,implementation) pairs: 1, namely:
CompilerImplementations
clang -mcpu=native -O3 -fomit-frame-pointer -fwrapv -Qunused-arguments -fPIC -fPIE dolbeau/aesenc-int

Compiler output

Implementation: dolbeau/aesenc-int
Security model: constbranchindex
Compiler: gcc -march=native -mtune=native -O2 -fomit-frame-pointer -fwrapv -fPIC -fPIE
aesenc-int.c: In file included from /usr/lib/gcc/x86_64-linux-gnu/6/include/immintrin.h:39:0,
aesenc-int.c: from aesenc-int.c:11:
aesenc-int.c: aesenc-int.c: In function 'aesni_key256_expand':
aesenc-int.c: /usr/lib/gcc/x86_64-linux-gnu/6/include/wmmintrin.h:87:1: error: inlining failed in call to always_inline '_mm_aeskeygenassist_si128': target specific option mismatch
aesenc-int.c: _mm_aeskeygenassist_si128 (__m128i __X, const int __C)
aesenc-int.c: ^~~~~~~~~~~~~~~~~~~~~~~~~
aesenc-int.c: aesenc-int.c:52:9: note: called from here
aesenc-int.c: temp1 = _mm_aeskeygenassist_si128(temp2, IMM); \
aesenc-int.c: ~~~~~~^~~~~~~~~~~~~~~~~~~~~~~~~~~~~~~~~~~~~~~
aesenc-int.c: aesenc-int.c:89:3: note: in expansion of macro 'BLOCK1'
aesenc-int.c: BLOCK1(0x40);
aesenc-int.c: ^~~~~~
aesenc-int.c: In file included from /usr/lib/gcc/x86_64-linux-gnu/6/include/immintrin.h:39:0,
aesenc-int.c: from aesenc-int.c:11:
aesenc-int.c: /usr/lib/gcc/x86_64-linux-gnu/6/include/wmmintrin.h:87:1: error: inlining failed in call to always_inline '_mm_aeskeygenassist_si128': target specific option mismatch
aesenc-int.c: _mm_aeskeygenassist_si128 (__m128i __X, const int __C)
aesenc-int.c: ^~~~~~~~~~~~~~~~~~~~~~~~~
aesenc-int.c: aesenc-int.c:62:9: note: called from here
aesenc-int.c: temp1 = _mm_aeskeygenassist_si128(temp0, IMM); \
aesenc-int.c: ~~~~~~^~~~~~~~~~~~~~~~~~~~~~~~~~~~~~~~~~~~~~~
aesenc-int.c: aesenc-int.c:87:3: note: in expansion of macro 'BLOCK2'
aesenc-int.c: BLOCK2(0x20);
aesenc-int.c: ^~~~~~
aesenc-int.c: In file included from /usr/lib/gcc/x86_64-linux-gnu/6/include/immintrin.h:39:0,
aesenc-int.c: from aesenc-int.c:11:
aesenc-int.c: ...

Number of similar (compiler,implementation) pairs: 4, namely:
CompilerImplementations
gcc -march=native -mtune=native -O2 -fomit-frame-pointer -fwrapv -fPIC -fPIE dolbeau/aesenc-int
gcc -march=native -mtune=native -O3 -fomit-frame-pointer -fwrapv -fPIC -fPIE dolbeau/aesenc-int
gcc -march=native -mtune=native -O -fomit-frame-pointer -fwrapv -fPIC -fPIE dolbeau/aesenc-int
gcc -march=native -mtune=native -Os -fomit-frame-pointer -fwrapv -fPIC -fPIE dolbeau/aesenc-int

Compiler output

Implementation: dolbeau/vaesenc-int
Security model: constbranchindex
Compiler: clang -march=native -O2 -fomit-frame-pointer -fwrapv -Qunused-arguments -fPIC -fPIE
vaesenc-int.c: vaesenc-int.c:49:18: warning: implicit declaration of function '_mm512_broadcast_i32x4' is invalid in C99 [-Wimplicit-function-declaration]
vaesenc-int.c: rkeys[idx++] = _mm512_broadcast_i32x4(key0);
vaesenc-int.c: ^
vaesenc-int.c: vaesenc-int.c:49:16: error: assigning to '__m512i' (vector of 8 'long long' values) from incompatible type 'int'
vaesenc-int.c: rkeys[idx++] = _mm512_broadcast_i32x4(key0);
vaesenc-int.c: ^ ~~~~~~~~~~~~~~~~~~~~~~~~~~~~
vaesenc-int.c: vaesenc-int.c:74:3: error: assigning to '__m512i' (vector of 8 'long long' values) from incompatible type 'int'
vaesenc-int.c: BLOCK1(0x01);
vaesenc-int.c: ^~~~~~~~~~~~
vaesenc-int.c: vaesenc-int.c:56:16: note: expanded from macro 'BLOCK1'
vaesenc-int.c: rkeys[idx++] = _mm512_broadcast_i32x4(temp2); \
vaesenc-int.c: ^ ~~~~~~~~~~~~~~~~~~~~~~~~~~~~~
vaesenc-int.c: vaesenc-int.c:75:3: error: assigning to '__m512i' (vector of 8 'long long' values) from incompatible type 'int'
vaesenc-int.c: BLOCK2(0x01);
vaesenc-int.c: ^~~~~~~~~~~~
vaesenc-int.c: vaesenc-int.c:66:16: note: expanded from macro 'BLOCK2'
vaesenc-int.c: rkeys[idx++] = _mm512_broadcast_i32x4(temp0); \
vaesenc-int.c: ^ ~~~~~~~~~~~~~~~~~~~~~~~~~~~~~
vaesenc-int.c: vaesenc-int.c:77:3: error: assigning to '__m512i' (vector of 8 'long long' values) from incompatible type 'int'
vaesenc-int.c: BLOCK1(0x02);
vaesenc-int.c: ^~~~~~~~~~~~
vaesenc-int.c: vaesenc-int.c:56:16: note: expanded from macro 'BLOCK1'
vaesenc-int.c: rkeys[idx++] = _mm512_broadcast_i32x4(temp2); \
vaesenc-int.c: ^ ~~~~~~~~~~~~~~~~~~~~~~~~~~~~~
vaesenc-int.c: vaesenc-int.c:78:3: error: assigning to '__m512i' (vector of 8 'long long' values) from incompatible type 'int'
vaesenc-int.c: ...

Number of similar (compiler,implementation) pairs: 5, namely:
CompilerImplementations
clang -march=native -O2 -fomit-frame-pointer -fwrapv -Qunused-arguments -fPIC -fPIE dolbeau/vaesenc-int
clang -march=native -O3 -fomit-frame-pointer -fwrapv -Qunused-arguments -fPIC -fPIE dolbeau/vaesenc-int
clang -march=native -O -fomit-frame-pointer -fwrapv -Qunused-arguments -fPIC -fPIE dolbeau/vaesenc-int
clang -march=native -Os -fomit-frame-pointer -fwrapv -Qunused-arguments -fPIC -fPIE dolbeau/vaesenc-int
clang -mcpu=native -O3 -fomit-frame-pointer -fwrapv -Qunused-arguments -fPIC -fPIE dolbeau/vaesenc-int

Compiler output

Implementation: dolbeau/vaesenc-int
Security model: constbranchindex
Compiler: gcc -march=native -mtune=native -O2 -fomit-frame-pointer -fwrapv -fPIC -fPIE
vaesenc-int.c: vaesenc-int.c: In function 'aesni_encryptv2':
vaesenc-int.c: vaesenc-int.c:261:34: warning: passing argument 1 of '_mm256_load_si256' from incompatible pointer type [-Wincompatible-pointer-types]
vaesenc-int.c: __m256i nv = _mm256_load_si256((const __m128i *)n);
vaesenc-int.c: ^
vaesenc-int.c: In file included from /usr/lib/gcc/x86_64-linux-gnu/6/include/immintrin.h:41:0,
vaesenc-int.c: from vaesenc-int.c:11:
vaesenc-int.c: /usr/lib/gcc/x86_64-linux-gnu/6/include/avxintrin.h:882:1: note: expected 'const __vector(4) long long int *' but argument is of type 'const __vector(2) long long int *'
vaesenc-int.c: _mm256_load_si256 (__m256i const *__P)
vaesenc-int.c: ^~~~~~~~~~~~~~~~~
vaesenc-int.c: vaesenc-int.c:266:12: warning: implicit declaration of function '_mm256_aesenc_epi128' [-Wimplicit-function-declaration]
vaesenc-int.c: temp = _mm256_aesenc_epi128(temp, rkeys[i]);
vaesenc-int.c: ^~~~~~~~~~~~~~~~~~~~
vaesenc-int.c: vaesenc-int.c:266:10: error: incompatible types when assigning to type '__m256i {aka __vector(4) long long int}' from type 'int'
vaesenc-int.c: temp = _mm256_aesenc_epi128(temp, rkeys[i]);
vaesenc-int.c: ^
vaesenc-int.c: vaesenc-int.c:268:10: warning: implicit declaration of function '_mm256_aesenclast_epi128' [-Wimplicit-function-declaration]
vaesenc-int.c: temp = _mm256_aesenclast_epi128(temp, rkeys[14]);
vaesenc-int.c: ^~~~~~~~~~~~~~~~~~~~~~~~
vaesenc-int.c: vaesenc-int.c:268:8: error: incompatible types when assigning to type '__m256i {aka __vector(4) long long int}' from type 'int'
vaesenc-int.c: temp = _mm256_aesenclast_epi128(temp, rkeys[14]);
vaesenc-int.c: ^
vaesenc-int.c: vaesenc-int.c: In function 'aesni_encryptv4':
vaesenc-int.c: vaesenc-int.c:278:12: warning: implicit declaration of function '_mm512_aesenc_epi128' [-Wimplicit-function-declaration]
vaesenc-int.c: temp = _mm512_aesenc_epi128(temp, rkeys[i]);
vaesenc-int.c: ^~~~~~~~~~~~~~~~~~~~
vaesenc-int.c: ...

Number of similar (compiler,implementation) pairs: 4, namely:
CompilerImplementations
gcc -march=native -mtune=native -O2 -fomit-frame-pointer -fwrapv -fPIC -fPIE dolbeau/vaesenc-int
gcc -march=native -mtune=native -O3 -fomit-frame-pointer -fwrapv -fPIC -fPIE dolbeau/vaesenc-int
gcc -march=native -mtune=native -O -fomit-frame-pointer -fwrapv -fPIC -fPIE dolbeau/vaesenc-int
gcc -march=native -mtune=native -Os -fomit-frame-pointer -fwrapv -fPIC -fPIE dolbeau/vaesenc-int

Compiler output

Implementation: T:openssl
Security model: timingleaks
Compiler: clang -march=native -O2 -fomit-frame-pointer -fwrapv -Qunused-arguments -fPIC -fPIE
decrypt.c: decrypt.c:13:18: error: variable has incomplete type 'EVP_CIPHER_CTX' (aka 'struct evp_cipher_ctx_st')
decrypt.c: EVP_CIPHER_CTX x;
decrypt.c: ^
decrypt.c: /usr/include/openssl/ossl_typ.h:90:16: note: forward declaration of 'struct evp_cipher_ctx_st'
decrypt.c: typedef struct evp_cipher_ctx_st EVP_CIPHER_CTX;
decrypt.c: ^
decrypt.c: 1 error generated.

Number of similar (compiler,implementation) pairs: 5, namely:
CompilerImplementations
clang -march=native -O2 -fomit-frame-pointer -fwrapv -Qunused-arguments -fPIC -fPIE T:openssl
clang -march=native -O3 -fomit-frame-pointer -fwrapv -Qunused-arguments -fPIC -fPIE T:openssl
clang -march=native -O -fomit-frame-pointer -fwrapv -Qunused-arguments -fPIC -fPIE T:openssl
clang -march=native -Os -fomit-frame-pointer -fwrapv -Qunused-arguments -fPIC -fPIE T:openssl
clang -mcpu=native -O3 -fomit-frame-pointer -fwrapv -Qunused-arguments -fPIC -fPIE T:openssl

Compiler output

Implementation: T:openssl
Security model: timingleaks
Compiler: gcc -march=native -mtune=native -O2 -fomit-frame-pointer -fwrapv -fPIC -fPIE
decrypt.c: decrypt.c: In function 'crypto_aead_aes256gcmv1_openssl_timingleaks_decrypt':
decrypt.c: decrypt.c:13:18: error: storage size of 'x' isn't known
decrypt.c: EVP_CIPHER_CTX x;
decrypt.c: ^

Number of similar (compiler,implementation) pairs: 4, namely:
CompilerImplementations
gcc -march=native -mtune=native -O2 -fomit-frame-pointer -fwrapv -fPIC -fPIE T:openssl
gcc -march=native -mtune=native -O3 -fomit-frame-pointer -fwrapv -fPIC -fPIE T:openssl
gcc -march=native -mtune=native -O -fomit-frame-pointer -fwrapv -fPIC -fPIE T:openssl
gcc -march=native -mtune=native -Os -fomit-frame-pointer -fwrapv -fPIC -fPIE T:openssl