Implementation notes: amd64, dali, crypto_hash/groestl512

Computer: dali
Microarchitecture: amd64; Zen (820f01)
Architecture: amd64
CPU ID: AuthenticAMD-00820f01-178bfbff
SUPERCOP version: 20240425
Operation: crypto_hash
Primitive: groestl512
TimeObject sizeTest sizeImplementationCompilerBenchmark dateSUPERCOP version
181219570 0 123221815 788 2200T:aesni-intrgcc_-march=native_-mtune=native_-O3_-fomit-frame-pointer_-fwrapv_-fPIC_-fPIE2024042720240425
181448914 0 123220127 788 2200T:aesni-intrgcc_-march=native_-mtune=native_-O2_-fomit-frame-pointer_-fwrapv_-fPIC_-fPIE2024042720240425
187998615 0 123219326 780 2200T:aesni-intrgcc_-march=native_-mtune=native_-O_-fomit-frame-pointer_-fwrapv_-fPIC_-fPIE2024042720240425
197329724 0 120022579 820 2104T:aesni-intrclang_-march=native_-O3_-fomit-frame-pointer_-fwrapv_-Qunused-arguments_-fPIC_-fPIE2024042720240425
198538391 0 120018809 812 2104T:aesni-intrclang_-march=native_-Os_-fomit-frame-pointer_-fwrapv_-Qunused-arguments_-fPIC_-fPIE2024042720240425
198719724 0 120022451 820 2104T:aesni-intrclang_-march=native_-O2_-fomit-frame-pointer_-fwrapv_-Qunused-arguments_-fPIC_-fPIE2024042720240425
215938506 0 123218250 764 2168T:aesni-intrgcc_-march=native_-mtune=native_-Os_-fomit-frame-pointer_-fwrapv_-fPIC_-fPIE2024042720240425
252348378 0 166420623 788 2616T:avx-intrgcc_-march=native_-mtune=native_-O3_-fomit-frame-pointer_-fwrapv_-fPIC_-fPIE2024042720240425
253457746 0 166418959 788 2616T:avx-intrgcc_-march=native_-mtune=native_-O2_-fomit-frame-pointer_-fwrapv_-fPIC_-fPIE2024042720240425
255337348 0 166418062 780 2616T:avx-intrgcc_-march=native_-mtune=native_-O_-fomit-frame-pointer_-fwrapv_-fPIC_-fPIE2024042720240425
270307217 0 166416970 764 2584T:avx-intrgcc_-march=native_-mtune=native_-Os_-fomit-frame-pointer_-fwrapv_-fPIC_-fPIE2024042720240425
283199044 0 177621763 820 2712T:avx-intrclang_-march=native_-O2_-fomit-frame-pointer_-fwrapv_-Qunused-arguments_-fPIC_-fPIE2024042720240425
284379044 0 177621875 820 2712T:avx-intrclang_-march=native_-O3_-fomit-frame-pointer_-fwrapv_-Qunused-arguments_-fPIC_-fPIE2024042720240425
284557718 0 177618137 812 2680T:avx-intrclang_-march=native_-Os_-fomit-frame-pointer_-fwrapv_-Qunused-arguments_-fPIC_-fPIE2024042720240425
3866619026 0 152031271 788 2488T:vperm-intrgcc_-march=native_-mtune=native_-O3_-fomit-frame-pointer_-fwrapv_-fPIC_-fPIE2024042720240425
3888818370 0 152029583 788 2488T:vperm-intrgcc_-march=native_-mtune=native_-O2_-fomit-frame-pointer_-fwrapv_-fPIC_-fPIE2024042720240425
3973117934 0 152028654 780 2488T:vperm-intrgcc_-march=native_-mtune=native_-O_-fomit-frame-pointer_-fwrapv_-fPIC_-fPIE2024042720240425
4061026742 0 039328 812 920T:opteronclang_-march=native_-O2_-fomit-frame-pointer_-fwrapv_-Qunused-arguments_-fPIC_-fPIE2024042720240425
4061127174 0 040008 812 888T:opteronclang_-mcpu=native_-O3_-fomit-frame-pointer_-fwrapv_-Qunused-arguments_-fPIC_-fPIE2024042720240425
4074026742 0 039456 812 920T:opteronclang_-march=native_-O3_-fomit-frame-pointer_-fwrapv_-Qunused-arguments_-fPIC_-fPIE2024042720240425
4078827742 0 040576 812 888T:core2duoclang_-mcpu=native_-O3_-fomit-frame-pointer_-fwrapv_-Qunused-arguments_-fPIC_-fPIE2024042720240425
4080327262 0 039864 812 920T:core2duoclang_-march=native_-O2_-fomit-frame-pointer_-fwrapv_-Qunused-arguments_-fPIC_-fPIE2024042720240425
4085427262 0 039976 812 920T:core2duoclang_-march=native_-O3_-fomit-frame-pointer_-fwrapv_-Qunused-arguments_-fPIC_-fPIE2024042720240425
4097726504 0 036798 804 888T:core2duoclang_-march=native_-Os_-fomit-frame-pointer_-fwrapv_-Qunused-arguments_-fPIC_-fPIE2024042720240425
4147825998 0 036270 804 888T:opteronclang_-march=native_-Os_-fomit-frame-pointer_-fwrapv_-Qunused-arguments_-fPIC_-fPIE2024042720240425
4180718450 0 152028202 764 2456T:vperm-intrgcc_-march=native_-mtune=native_-Os_-fomit-frame-pointer_-fwrapv_-fPIC_-fPIE2024042720240425
4703122817 0 230434707 820 3224T:vperm-intrclang_-march=native_-O2_-fomit-frame-pointer_-fwrapv_-Qunused-arguments_-fPIC_-fPIE2024042720240425
4712022817 0 230434835 820 3224T:vperm-intrclang_-march=native_-O3_-fomit-frame-pointer_-fwrapv_-Qunused-arguments_-fPIC_-fPIE2024042720240425
4725319940 0 230430361 812 3192T:vperm-intrclang_-march=native_-Os_-fomit-frame-pointer_-fwrapv_-Qunused-arguments_-fPIC_-fPIE2024042720240425
5319615809 0 174426489 812 2648T:aesni-intrclang_-march=native_-O_-fomit-frame-pointer_-fwrapv_-Qunused-arguments_-fPIC_-fPIE2024042720240425
5894141062 0 050827 756 920T:sphlibgcc_-march=native_-mtune=native_-Os_-fomit-frame-pointer_-fwrapv_-fPIC_-fPIE2024042720240425
6034343738 0 053499 756 920T:sphlib-adaptedgcc_-march=native_-mtune=native_-Os_-fomit-frame-pointer_-fwrapv_-fPIC_-fPIE2024042720240425
6108746847 0 059096 780 952T:sphlibgcc_-march=native_-mtune=native_-O3_-fomit-frame-pointer_-fwrapv_-fPIC_-fPIE2024042720240425
6337947167 0 058392 780 952T:sphlibgcc_-march=native_-mtune=native_-O2_-fomit-frame-pointer_-fwrapv_-fPIC_-fPIE2024042720240425
6401250767 0 063016 780 952T:sphlib-adaptedgcc_-march=native_-mtune=native_-O3_-fomit-frame-pointer_-fwrapv_-fPIC_-fPIE2024042720240425
6426147158 0 057960 780 952T:sphlibgcc_-march=native_-mtune=native_-O_-fomit-frame-pointer_-fwrapv_-fPIC_-fPIE2024042720240425
6700212721 0 270423377 812 3608T:avx-intrclang_-march=native_-O_-fomit-frame-pointer_-fwrapv_-Qunused-arguments_-fPIC_-fPIE2024042720240425
6761750967 0 061768 780 952T:sphlib-adaptedgcc_-march=native_-mtune=native_-O_-fomit-frame-pointer_-fwrapv_-fPIC_-fPIE2024042720240425
6782948317 0 058702 804 888T:sphlibclang_-march=native_-Os_-fomit-frame-pointer_-fwrapv_-Qunused-arguments_-fPIC_-fPIE2024042720240425
6828053519 0 064744 780 952T:sphlib-adaptedgcc_-march=native_-mtune=native_-O2_-fomit-frame-pointer_-fwrapv_-fPIC_-fPIE2024042720240425
6865848145 0 060976 812 920T:sphlibclang_-march=native_-O3_-fomit-frame-pointer_-fwrapv_-Qunused-arguments_-fPIC_-fPIE2024042720240425
6875148145 0 060848 812 920T:sphlibclang_-march=native_-O2_-fomit-frame-pointer_-fwrapv_-Qunused-arguments_-fPIC_-fPIE2024042720240425
6909053057 0 066024 812 888T:sphlib-adaptedclang_-mcpu=native_-O3_-fomit-frame-pointer_-fwrapv_-Qunused-arguments_-fPIC_-fPIE2024042720240425
6946551137 0 063856 812 920T:sphlib-adaptedclang_-march=native_-O2_-fomit-frame-pointer_-fwrapv_-Qunused-arguments_-fPIC_-fPIE2024042720240425
6952251754 0 062158 804 888T:sphlib-adaptedclang_-march=native_-Os_-fomit-frame-pointer_-fwrapv_-Qunused-arguments_-fPIC_-fPIE2024042720240425
7083647661 0 058358 804 888T:sphlibclang_-march=native_-O_-fomit-frame-pointer_-fwrapv_-Qunused-arguments_-fPIC_-fPIE2024042720240425
7170620673 0 033120 812 920T:sphlib-smallclang_-march=native_-O3_-fomit-frame-pointer_-fwrapv_-Qunused-arguments_-fPIC_-fPIE2024042720240425
7179651137 0 063984 812 920T:sphlib-adaptedclang_-march=native_-O3_-fomit-frame-pointer_-fwrapv_-Qunused-arguments_-fPIC_-fPIE2024042720240425
7185219444 0 029470 804 888T:sphlib-smallclang_-march=native_-Os_-fomit-frame-pointer_-fwrapv_-Qunused-arguments_-fPIC_-fPIE2024042720240425
7420350669 0 061382 804 888T:sphlib-adaptedclang_-march=native_-O_-fomit-frame-pointer_-fwrapv_-Qunused-arguments_-fPIC_-fPIE2024042720240425
7435120673 0 033008 812 920T:sphlib-smallclang_-march=native_-O2_-fomit-frame-pointer_-fwrapv_-Qunused-arguments_-fPIC_-fPIE2024042720240425
7682619373 0 030086 804 888T:sphlib-smallclang_-march=native_-O_-fomit-frame-pointer_-fwrapv_-Qunused-arguments_-fPIC_-fPIE2024042720240425
7804320380 0 031184 780 952T:sphlib-smallgcc_-march=native_-mtune=native_-O_-fomit-frame-pointer_-fwrapv_-fPIC_-fPIE2024042720240425
7819250001 0 062952 812 888T:sphlibclang_-mcpu=native_-O3_-fomit-frame-pointer_-fwrapv_-Qunused-arguments_-fPIC_-fPIE2024042720240425
7937922063 0 033288 780 952T:sphlib-smallgcc_-march=native_-mtune=native_-O2_-fomit-frame-pointer_-fwrapv_-fPIC_-fPIE2024042720240425
8020971187 0 083536 796 952T:mmxgcc_-march=native_-mtune=native_-O3_-fomit-frame-pointer_-fwrapv_-fPIC_-fPIE2024042720240425
8070623023 0 035272 780 952T:sphlib-smallgcc_-march=native_-mtune=native_-O3_-fomit-frame-pointer_-fwrapv_-fPIC_-fPIE2024042720240425
8097323441 0 036296 812 888T:sphlib-smallclang_-mcpu=native_-O3_-fomit-frame-pointer_-fwrapv_-Qunused-arguments_-fPIC_-fPIE2024042720240425
8284967623 0 078960 796 952T:mmxgcc_-march=native_-mtune=native_-O2_-fomit-frame-pointer_-fwrapv_-fPIC_-fPIE2024042720240425
8443266032 0 075899 772 920T:mmxgcc_-march=native_-mtune=native_-Os_-fomit-frame-pointer_-fwrapv_-fPIC_-fPIE2024042720240425
8658567239 0 078079 788 952T:mmxgcc_-march=native_-mtune=native_-O_-fomit-frame-pointer_-fwrapv_-fPIC_-fPIE2024042720240425
8756169291 0 082414 836 888T:mmxclang_-mcpu=native_-O3_-fomit-frame-pointer_-fwrapv_-Qunused-arguments_-fPIC_-fPIE2024042720240425
8780164555 0 077558 836 920T:mmxclang_-march=native_-O3_-fomit-frame-pointer_-fwrapv_-Qunused-arguments_-fPIC_-fPIE2024042720240425
8825563747 0 076622 836 920T:mmxclang_-march=native_-O2_-fomit-frame-pointer_-fwrapv_-Qunused-arguments_-fPIC_-fPIE2024042720240425
9072262517 0 072990 820 888T:mmxclang_-march=native_-Os_-fomit-frame-pointer_-fwrapv_-Qunused-arguments_-fPIC_-fPIE2024042720240425
9110064973 0 075726 820 888T:mmxclang_-march=native_-O_-fomit-frame-pointer_-fwrapv_-Qunused-arguments_-fPIC_-fPIE2024042720240425
9286618192 0 027947 756 920T:sphlib-smallgcc_-march=native_-mtune=native_-Os_-fomit-frame-pointer_-fwrapv_-fPIC_-fPIE2024042720240425
11447524695 0 037088 796 952T:opt32gcc_-march=native_-mtune=native_-O3_-fomit-frame-pointer_-fwrapv_-fPIC_-fPIE2024042720240425
11610022378 0 033247 788 952T:opt32gcc_-march=native_-mtune=native_-O_-fomit-frame-pointer_-fwrapv_-fPIC_-fPIE2024042720240425
11616622943 0 034280 796 952T:opt32gcc_-march=native_-mtune=native_-O2_-fomit-frame-pointer_-fwrapv_-fPIC_-fPIE2024042720240425
11719523388 0 033926 820 888T:opt32clang_-march=native_-Os_-fomit-frame-pointer_-fwrapv_-Qunused-arguments_-fPIC_-fPIE2024042720240425
11730323926 0 037014 836 920T:opt32clang_-march=native_-O3_-fomit-frame-pointer_-fwrapv_-Qunused-arguments_-fPIC_-fPIE2024042720240425
11739523766 0 036710 836 920T:opt32clang_-march=native_-O2_-fomit-frame-pointer_-fwrapv_-Qunused-arguments_-fPIC_-fPIE2024042720240425
11828226718 0 039926 836 888T:opt32clang_-mcpu=native_-O3_-fomit-frame-pointer_-fwrapv_-Qunused-arguments_-fPIC_-fPIE2024042720240425
11926122109 0 032894 820 888T:opt32clang_-march=native_-O_-fomit-frame-pointer_-fwrapv_-Qunused-arguments_-fPIC_-fPIE2024042720240425
12155820879 0 030779 772 920T:opt32gcc_-march=native_-mtune=native_-Os_-fomit-frame-pointer_-fwrapv_-fPIC_-fPIE2024042720240425
12800638057 0 249648737 812 3384T:vperm-intrclang_-march=native_-O_-fomit-frame-pointer_-fwrapv_-Qunused-arguments_-fPIC_-fPIE2024042720240425
2777585717 0 018576 812 888T:32bit-bytesliced-c-smallclang_-mcpu=native_-O3_-fomit-frame-pointer_-fwrapv_-Qunused-arguments_-fPIC_-fPIE2024042720240425
2799774521 0 017272 812 920T:32bit-bytesliced-c-smallclang_-march=native_-O3_-fomit-frame-pointer_-fwrapv_-Qunused-arguments_-fPIC_-fPIE2024042720240425
2880793374 0 016016 812 920T:32bit-bytesliced-c-smallclang_-march=native_-O2_-fomit-frame-pointer_-fwrapv_-Qunused-arguments_-fPIC_-fPIE2024042720240425
3178135279 0 017464 780 952T:32bit-bytesliced-c-smallgcc_-march=native_-mtune=native_-O3_-fomit-frame-pointer_-fwrapv_-fPIC_-fPIE2024042720240425
3564432375 0 013520 780 952T:32bit-bytesliced-c-smallgcc_-march=native_-mtune=native_-O2_-fomit-frame-pointer_-fwrapv_-fPIC_-fPIE2024042720240425
3640392870 0 013182 804 888T:32bit-bytesliced-c-smallclang_-march=native_-Os_-fomit-frame-pointer_-fwrapv_-Qunused-arguments_-fPIC_-fPIE2024042720240425
3797162131 0 012694 804 888T:32bit-bytesliced-c-smallclang_-march=native_-O_-fomit-frame-pointer_-fwrapv_-Qunused-arguments_-fPIC_-fPIE2024042720240425
4107511776 0 011435 756 920T:32bit-bytesliced-c-smallgcc_-march=native_-mtune=native_-Os_-fomit-frame-pointer_-fwrapv_-fPIC_-fPIE2024042720240425
5716362612 0 013263 772 952T:32bit-bytesliced-c-smallgcc_-march=native_-mtune=native_-O_-fomit-frame-pointer_-fwrapv_-fPIC_-fPIE2024042720240425

Compiler output

Implementation: T:aesni
Security model: timingleaks
Compiler: clang -march=native -O2 -fomit-frame-pointer -fwrapv -Qunused-arguments -fPIC -fPIE
hash.c: hash.c:104:12: warning: comparison of array 'ctx->chaining' equal to a null pointer is always false [-Wtautological-pointer-compare]
hash.c: if (ctx->chaining == NULL || ctx->buffer == NULL)
hash.c: ~~~~~^~~~~~~~ ~~~~
hash.c: hash.c:104:37: warning: comparison of array 'ctx->buffer' equal to a null pointer is always false [-Wtautological-pointer-compare]
hash.c: if (ctx->chaining == NULL || ctx->buffer == NULL)
hash.c: ~~~~~^~~~~~ ~~~~
hash.c: In file included from hash.c:13:
hash.c: ./groestl-asm-aes.h:851:8: error: invalid operand for instruction
hash.c: asm ("movaps xmm8, [rdi+0*16]");
hash.c: ^
hash.c: <inline asm>:1:16: note: instantiated into assembly here
hash.c: movaps xmm8, [rdi+0*16]
hash.c: ^~~~~~~~~~
hash.c: In file included from hash.c:13:
hash.c: ./groestl-asm-aes.h:852:8: error: invalid operand for instruction
hash.c: asm ("movaps xmm9, [rdi+1*16]");
hash.c: ^
hash.c: <inline asm>:1:16: note: instantiated into assembly here
hash.c: movaps xmm9, [rdi+1*16]
hash.c: ^~~~~~~~~~
hash.c: In file included from hash.c:13:
hash.c: ./groestl-asm-aes.h:853:8: error: invalid operand for instruction
hash.c: asm ("movaps xmm10, [rdi+2*16]");
hash.c: ^
hash.c: <inline asm>:1:16: note: instantiated into assembly here
hash.c: ...

Number of similar (compiler,implementation) pairs: 5, namely:
CompilerImplementations
clang -march=native -O2 -fomit-frame-pointer -fwrapv -Qunused-arguments -fPIC -fPIE T:aesni
clang -march=native -O3 -fomit-frame-pointer -fwrapv -Qunused-arguments -fPIC -fPIE T:aesni
clang -march=native -O -fomit-frame-pointer -fwrapv -Qunused-arguments -fPIC -fPIE T:aesni
clang -march=native -Os -fomit-frame-pointer -fwrapv -Qunused-arguments -fPIC -fPIE T:aesni
clang -mcpu=native -O3 -fomit-frame-pointer -fwrapv -Qunused-arguments -fPIC -fPIE T:aesni

Compiler output

Implementation: T:aesni
Security model: timingleaks
Compiler: gcc -march=native -mtune=native -O2 -fomit-frame-pointer -fwrapv -fPIC -fPIE
try.c: /usr/bin/ld: libcrypto_hash_groestl512.a(hash.o): relocation R_X86_64_32S against symbol `TRANSP_MASK' can not be used when making a PIE object; recompile with -fPIE
try.c: collect2: error: ld returned 1 exit status

Number of similar (compiler,implementation) pairs: 8, namely:
CompilerImplementations
gcc -march=native -mtune=native -O2 -fomit-frame-pointer -fwrapv -fPIC -fPIE T:aesni
gcc -march=native -mtune=native -O3 -fomit-frame-pointer -fwrapv -fPIC -fPIE T:aesni
gcc -march=native -mtune=native -O -fomit-frame-pointer -fwrapv -fPIC -fPIE T:aesni
gcc -march=native -mtune=native -Os -fomit-frame-pointer -fwrapv -fPIC -fPIE T:aesni
gcc -march=native -mtune=native -O2 -fomit-frame-pointer -fwrapv -fPIC -fPIE T:avx
gcc -march=native -mtune=native -O3 -fomit-frame-pointer -fwrapv -fPIC -fPIE T:avx
gcc -march=native -mtune=native -O -fomit-frame-pointer -fwrapv -fPIC -fPIE T:avx
gcc -march=native -mtune=native -Os -fomit-frame-pointer -fwrapv -fPIC -fPIE T:avx

Compiler output

Implementation: T:aesni-intr
Security model: timingleaks
Compiler: clang -march=native -O2 -fomit-frame-pointer -fwrapv -Qunused-arguments -fPIC -fPIE
hash.c: hash.c:104:12: warning: comparison of array 'ctx->chaining' equal to a null pointer is always false [-Wtautological-pointer-compare]
hash.c: if (ctx->chaining == NULL || ctx->buffer == NULL)
hash.c: ~~~~~^~~~~~~~ ~~~~
hash.c: hash.c:104:37: warning: comparison of array 'ctx->buffer' equal to a null pointer is always false [-Wtautological-pointer-compare]
hash.c: if (ctx->chaining == NULL || ctx->buffer == NULL)
hash.c: ~~~~~^~~~~~ ~~~~
hash.c: 2 warnings generated.

Number of similar (compiler,implementation) pairs: 12, namely:
CompilerImplementations
clang -march=native -O2 -fomit-frame-pointer -fwrapv -Qunused-arguments -fPIC -fPIE T:aesni-intr
clang -march=native -O3 -fomit-frame-pointer -fwrapv -Qunused-arguments -fPIC -fPIE T:aesni-intr
clang -march=native -O -fomit-frame-pointer -fwrapv -Qunused-arguments -fPIC -fPIE T:aesni-intr
clang -march=native -Os -fomit-frame-pointer -fwrapv -Qunused-arguments -fPIC -fPIE T:aesni-intr
clang -march=native -O2 -fomit-frame-pointer -fwrapv -Qunused-arguments -fPIC -fPIE T:avx-intr
clang -march=native -O3 -fomit-frame-pointer -fwrapv -Qunused-arguments -fPIC -fPIE T:avx-intr
clang -march=native -O -fomit-frame-pointer -fwrapv -Qunused-arguments -fPIC -fPIE T:avx-intr
clang -march=native -Os -fomit-frame-pointer -fwrapv -Qunused-arguments -fPIC -fPIE T:avx-intr
clang -march=native -O2 -fomit-frame-pointer -fwrapv -Qunused-arguments -fPIC -fPIE T:vperm-intr
clang -march=native -O3 -fomit-frame-pointer -fwrapv -Qunused-arguments -fPIC -fPIE T:vperm-intr
clang -march=native -O -fomit-frame-pointer -fwrapv -Qunused-arguments -fPIC -fPIE T:vperm-intr
clang -march=native -Os -fomit-frame-pointer -fwrapv -Qunused-arguments -fPIC -fPIE T:vperm-intr

Compiler output

Implementation: T:aesni-intr
Security model: timingleaks
Compiler: clang -mcpu=native -O3 -fomit-frame-pointer -fwrapv -Qunused-arguments -fPIC -fPIE
hash.c: In file included from hash.c:28:
hash.c: ./groestl-intr-aes.h:786:3: error: always_inline function '_mm_shuffle_epi8' requires target feature 'ssse3', but would be inlined into function 'INIT' that is compiled without support for 'ssse3'
hash.c: Matrix_Transpose(xmm8, xmm9, xmm10, xmm11, xmm12, xmm13, xmm14, xmm15, xmm0, xmm1, xmm2, xmm3, xmm4, xmm5, xmm6, xmm7);
hash.c: ^
hash.c: ./groestl-intr-aes.h:631:8: note: expanded from macro 'Matrix_Transpose'
hash.c: i6 = _mm_shuffle_epi8(i6, t0);\
hash.c: ^
hash.c: ./groestl-intr-aes.h:786:3: error: always_inline function '_mm_shuffle_epi8' requires target feature 'ssse3', but would be inlined into function 'INIT' that is compiled without support for 'ssse3'
hash.c: ./groestl-intr-aes.h:632:8: note: expanded from macro 'Matrix_Transpose'
hash.c: i0 = _mm_shuffle_epi8(i0, t0);\
hash.c: ^
hash.c: ./groestl-intr-aes.h:786:3: error: always_inline function '_mm_shuffle_epi8' requires target feature 'ssse3', but would be inlined into function 'INIT' that is compiled without support for 'ssse3'
hash.c: ./groestl-intr-aes.h:633:8: note: expanded from macro 'Matrix_Transpose'
hash.c: i1 = _mm_shuffle_epi8(i1, t0);\
hash.c: ^
hash.c: ./groestl-intr-aes.h:786:3: error: always_inline function '_mm_shuffle_epi8' requires target feature 'ssse3', but would be inlined into function 'INIT' that is compiled without support for 'ssse3'
hash.c: ./groestl-intr-aes.h:634:8: note: expanded from macro 'Matrix_Transpose'
hash.c: i2 = _mm_shuffle_epi8(i2, t0);\
hash.c: ^
hash.c: ./groestl-intr-aes.h:786:3: error: always_inline function '_mm_shuffle_epi8' requires target feature 'ssse3', but would be inlined into function 'INIT' that is compiled without support for 'ssse3'
hash.c: ./groestl-intr-aes.h:635:8: note: expanded from macro 'Matrix_Transpose'
hash.c: i3 = _mm_shuffle_epi8(i3, t0);\
hash.c: ^
hash.c: ./groestl-intr-aes.h:786:3: error: always_inline function '_mm_shuffle_epi8' requires target feature 'ssse3', but would be inlined into function 'INIT' that is compiled without support for 'ssse3'
hash.c: ./groestl-intr-aes.h:637:8: note: expanded from macro 'Matrix_Transpose'
hash.c: ...

Number of similar (compiler,implementation) pairs: 1, namely:
CompilerImplementations
clang -mcpu=native -O3 -fomit-frame-pointer -fwrapv -Qunused-arguments -fPIC -fPIE T:aesni-intr

Compiler output

Implementation: T:avx
Security model: timingleaks
Compiler: clang -march=native -O2 -fomit-frame-pointer -fwrapv -Qunused-arguments -fPIC -fPIE
hash.c: hash.c:104:12: warning: comparison of array 'ctx->chaining' equal to a null pointer is always false [-Wtautological-pointer-compare]
hash.c: if (ctx->chaining == NULL || ctx->buffer == NULL)
hash.c: ~~~~~^~~~~~~~ ~~~~
hash.c: hash.c:104:37: warning: comparison of array 'ctx->buffer' equal to a null pointer is always false [-Wtautological-pointer-compare]
hash.c: if (ctx->chaining == NULL || ctx->buffer == NULL)
hash.c: ~~~~~^~~~~~ ~~~~
hash.c: In file included from hash.c:16:
hash.c: ./groestl-asm-avx.h:925:8: error: invalid operand for instruction
hash.c: asm ("vmovaps xmm8, [rdi+0*16]");
hash.c: ^
hash.c: <inline asm>:1:17: note: instantiated into assembly here
hash.c: vmovaps xmm8, [rdi+0*16]
hash.c: ^~~~~~~~~~
hash.c: In file included from hash.c:16:
hash.c: ./groestl-asm-avx.h:926:8: error: invalid operand for instruction
hash.c: asm ("vmovaps xmm9, [rdi+1*16]");
hash.c: ^
hash.c: <inline asm>:1:17: note: instantiated into assembly here
hash.c: vmovaps xmm9, [rdi+1*16]
hash.c: ^~~~~~~~~~
hash.c: In file included from hash.c:16:
hash.c: ./groestl-asm-avx.h:927:8: error: invalid operand for instruction
hash.c: asm ("vmovaps xmm10, [rdi+2*16]");
hash.c: ^
hash.c: <inline asm>:1:17: note: instantiated into assembly here
hash.c: ...

Number of similar (compiler,implementation) pairs: 5, namely:
CompilerImplementations
clang -march=native -O2 -fomit-frame-pointer -fwrapv -Qunused-arguments -fPIC -fPIE T:avx
clang -march=native -O3 -fomit-frame-pointer -fwrapv -Qunused-arguments -fPIC -fPIE T:avx
clang -march=native -O -fomit-frame-pointer -fwrapv -Qunused-arguments -fPIC -fPIE T:avx
clang -march=native -Os -fomit-frame-pointer -fwrapv -Qunused-arguments -fPIC -fPIE T:avx
clang -mcpu=native -O3 -fomit-frame-pointer -fwrapv -Qunused-arguments -fPIC -fPIE T:avx

Compiler output

Implementation: T:avx-intr
Security model: timingleaks
Compiler: clang -mcpu=native -O3 -fomit-frame-pointer -fwrapv -Qunused-arguments -fPIC -fPIE
hash.c: In file included from hash.c:31:
hash.c: ./groestl-intr-avx.h:851:3: error: always_inline function '_mm_shuffle_epi8' requires target feature 'ssse3', but would be inlined into function 'INIT' that is compiled without support for 'ssse3'
hash.c: Matrix_Transpose(xmm8, xmm9, xmm10, xmm11, xmm12, xmm13, xmm14, xmm15, xmm0, xmm1, xmm2, xmm3, xmm4, xmm5, xmm6, xmm7);
hash.c: ^
hash.c: ./groestl-intr-avx.h:725:8: note: expanded from macro 'Matrix_Transpose'
hash.c: i6 = _mm_shuffle_epi8(i6, t0);\
hash.c: ^
hash.c: ./groestl-intr-avx.h:851:3: error: always_inline function '_mm_shuffle_epi8' requires target feature 'ssse3', but would be inlined into function 'INIT' that is compiled without support for 'ssse3'
hash.c: ./groestl-intr-avx.h:726:8: note: expanded from macro 'Matrix_Transpose'
hash.c: i0 = _mm_shuffle_epi8(i0, t0);\
hash.c: ^
hash.c: ./groestl-intr-avx.h:851:3: error: always_inline function '_mm_shuffle_epi8' requires target feature 'ssse3', but would be inlined into function 'INIT' that is compiled without support for 'ssse3'
hash.c: ./groestl-intr-avx.h:727:8: note: expanded from macro 'Matrix_Transpose'
hash.c: i1 = _mm_shuffle_epi8(i1, t0);\
hash.c: ^
hash.c: ./groestl-intr-avx.h:851:3: error: always_inline function '_mm_shuffle_epi8' requires target feature 'ssse3', but would be inlined into function 'INIT' that is compiled without support for 'ssse3'
hash.c: ./groestl-intr-avx.h:728:8: note: expanded from macro 'Matrix_Transpose'
hash.c: i2 = _mm_shuffle_epi8(i2, t0);\
hash.c: ^
hash.c: ./groestl-intr-avx.h:851:3: error: always_inline function '_mm_shuffle_epi8' requires target feature 'ssse3', but would be inlined into function 'INIT' that is compiled without support for 'ssse3'
hash.c: ./groestl-intr-avx.h:729:8: note: expanded from macro 'Matrix_Transpose'
hash.c: i3 = _mm_shuffle_epi8(i3, t0);\
hash.c: ^
hash.c: ./groestl-intr-avx.h:851:3: error: always_inline function '_mm_shuffle_epi8' requires target feature 'ssse3', but would be inlined into function 'INIT' that is compiled without support for 'ssse3'
hash.c: ./groestl-intr-avx.h:730:8: note: expanded from macro 'Matrix_Transpose'
hash.c: ...

Number of similar (compiler,implementation) pairs: 1, namely:
CompilerImplementations
clang -mcpu=native -O3 -fomit-frame-pointer -fwrapv -Qunused-arguments -fPIC -fPIE T:avx-intr

Compiler output

Implementation: T:core2duo
Security model: timingleaks
Compiler: clang -march=native -O -fomit-frame-pointer -fwrapv -Qunused-arguments -fPIC -fPIE
try.c: /usr/bin/ld: libcrypto_hash_groestl512.a(hash.o): in function `Transform':
try.c: hash.c:(.text+0x...): undefined reference to `Q1024ASM'
try.c: /usr/bin/ld: hash.c:(.text+0x...): undefined reference to `P1024ASM'
try.c: /usr/bin/ld: libcrypto_hash_groestl512.a(hash.o): in function `OutputTransformation':
try.c: hash.c:(.text+0x...): undefined reference to `P1024ASM'
try.c: clang: error: linker command failed with exit code 1 (use -v to see invocation)

Number of similar (compiler,implementation) pairs: 2, namely:
CompilerImplementations
clang -march=native -O -fomit-frame-pointer -fwrapv -Qunused-arguments -fPIC -fPIE T:core2duo T:opteron

Compiler output

Implementation: T:core2duo
Security model: timingleaks
Compiler: gcc -march=native -mtune=native -O2 -fomit-frame-pointer -fwrapv -fPIC -fPIE
try.c: /usr/bin/ld: libcrypto_hash_groestl512.a(hash.o): in function `Transform':
try.c: hash.c:(.text+0x...): undefined reference to `Q1024ASM'
try.c: /usr/bin/ld: hash.c:(.text+0x...): undefined reference to `P1024ASM'
try.c: /usr/bin/ld: libcrypto_hash_groestl512.a(hash.o): in function `OutputTransformation':
try.c: hash.c:(.text+0x...): undefined reference to `P1024ASM'
try.c: collect2: error: ld returned 1 exit status

Number of similar (compiler,implementation) pairs: 6, namely:
CompilerImplementations
gcc -march=native -mtune=native -O2 -fomit-frame-pointer -fwrapv -fPIC -fPIE T:core2duo
gcc -march=native -mtune=native -O -fomit-frame-pointer -fwrapv -fPIC -fPIE T:core2duo
gcc -march=native -mtune=native -Os -fomit-frame-pointer -fwrapv -fPIC -fPIE T:core2duo
gcc -march=native -mtune=native -O2 -fomit-frame-pointer -fwrapv -fPIC -fPIE T:opteron
gcc -march=native -mtune=native -O -fomit-frame-pointer -fwrapv -fPIC -fPIE T:opteron
gcc -march=native -mtune=native -Os -fomit-frame-pointer -fwrapv -fPIC -fPIE T:opteron

Compiler output

Implementation: T:core2duo
Security model: timingleaks
Compiler: gcc -march=native -mtune=native -O3 -fomit-frame-pointer -fwrapv -fPIC -fPIE
try.c: /usr/bin/ld: libcrypto_hash_groestl512.a(hash.o): in function `Transform.constprop.0':
try.c: hash.c:(.text+0x...): undefined reference to `Q1024ASM'
try.c: /usr/bin/ld: hash.c:(.text+0x...): undefined reference to `P1024ASM'
try.c: /usr/bin/ld: libcrypto_hash_groestl512.a(hash.o): in function `Transform':
try.c: hash.c:(.text+0x...): undefined reference to `Q1024ASM'
try.c: /usr/bin/ld: hash.c:(.text+0x...): undefined reference to `P1024ASM'
try.c: /usr/bin/ld: libcrypto_hash_groestl512.a(hash.o): in function `OutputTransformation':
try.c: hash.c:(.text+0x...): undefined reference to `P1024ASM'
try.c: /usr/bin/ld: libcrypto_hash_groestl512.a(hash.o): in function `Final':
try.c: hash.c:(.text+0x...): undefined reference to `P1024ASM'
try.c: collect2: error: ld returned 1 exit status

Number of similar (compiler,implementation) pairs: 2, namely:
CompilerImplementations
gcc -march=native -mtune=native -O3 -fomit-frame-pointer -fwrapv -fPIC -fPIE T:core2duo T:opteron

Compiler output

Implementation: T:opt64
Security model: timingleaks
Compiler: clang -march=native -O2 -fomit-frame-pointer -fwrapv -Qunused-arguments -fPIC -fPIE
hash.c: hash.c:191:3: warning: non-constant static local variable in inline function may be different in different files [-Wstatic-local-in-inline]
hash.c: static u64 y[COLS1024] __attribute__((aligned(16)));
hash.c: ^
hash.c: hash.c:190:1: note: use 'static' to give inline function 'F1024' internal linkage
hash.c: inline void F1024(u64 *h, const u64 *m) {
hash.c: ^
hash.c: static
hash.c: hash.c:192:3: warning: non-constant static local variable in inline function may be different in different files [-Wstatic-local-in-inline]
hash.c: static u64 z[COLS1024] __attribute__((aligned(16)));
hash.c: ^
hash.c: hash.c:190:1: note: use 'static' to give inline function 'F1024' internal linkage
hash.c: inline void F1024(u64 *h, const u64 *m) {
hash.c: ^
hash.c: static
hash.c: hash.c:193:3: warning: non-constant static local variable in inline function may be different in different files [-Wstatic-local-in-inline]
hash.c: static u64 outQ[COLS1024] __attribute__((aligned(16)));
hash.c: ^
hash.c: hash.c:190:1: note: use 'static' to give inline function 'F1024' internal linkage
hash.c: inline void F1024(u64 *h, const u64 *m) {
hash.c: ^
hash.c: static
hash.c: hash.c:194:3: warning: non-constant static local variable in inline function may be different in different files [-Wstatic-local-in-inline]
hash.c: static u64 inP[COLS1024] __attribute__((aligned(16)));
hash.c: ^
hash.c: hash.c:190:1: note: use 'static' to give inline function 'F1024' internal linkage
hash.c: ...
try.c: /usr/bin/ld: libcrypto_hash_groestl512.a(hash.o): in function `Transform':
try.c: hash.c:(.text+0x...): undefined reference to `F512'
try.c: /usr/bin/ld: hash.c:(.text+0x...): undefined reference to `F1024'
try.c: /usr/bin/ld: libcrypto_hash_groestl512.a(hash.o): in function `Update':
try.c: hash.c:(.text+0x...): undefined reference to `F512'
try.c: /usr/bin/ld: hash.c:(.text+0x...): undefined reference to `F1024'
try.c: /usr/bin/ld: hash.c:(.text+0x...): undefined reference to `F512'
try.c: /usr/bin/ld: hash.c:(.text+0x...): undefined reference to `F1024'
try.c: /usr/bin/ld: libcrypto_hash_groestl512.a(hash.o): in function `Final':
try.c: hash.c:(.text+0x...): undefined reference to `F512'
try.c: /usr/bin/ld: hash.c:(.text+0x...): undefined reference to `F1024'
try.c: /usr/bin/ld: hash.c:(.text+0x...): undefined reference to `F512'
try.c: /usr/bin/ld: hash.c:(.text+0x...): undefined reference to `F1024'
try.c: clang: error: linker command failed with exit code 1 (use -v to see invocation)

Number of similar (compiler,implementation) pairs: 3, namely:
CompilerImplementations
clang -march=native -O2 -fomit-frame-pointer -fwrapv -Qunused-arguments -fPIC -fPIE T:opt64
clang -march=native -O3 -fomit-frame-pointer -fwrapv -Qunused-arguments -fPIC -fPIE T:opt64
clang -mcpu=native -O3 -fomit-frame-pointer -fwrapv -Qunused-arguments -fPIC -fPIE T:opt64

Compiler output

Implementation: T:opt64
Security model: timingleaks
Compiler: clang -march=native -O -fomit-frame-pointer -fwrapv -Qunused-arguments -fPIC -fPIE
hash.c: hash.c:191:3: warning: non-constant static local variable in inline function may be different in different files [-Wstatic-local-in-inline]
hash.c: static u64 y[COLS1024] __attribute__((aligned(16)));
hash.c: ^
hash.c: hash.c:190:1: note: use 'static' to give inline function 'F1024' internal linkage
hash.c: inline void F1024(u64 *h, const u64 *m) {
hash.c: ^
hash.c: static
hash.c: hash.c:192:3: warning: non-constant static local variable in inline function may be different in different files [-Wstatic-local-in-inline]
hash.c: static u64 z[COLS1024] __attribute__((aligned(16)));
hash.c: ^
hash.c: hash.c:190:1: note: use 'static' to give inline function 'F1024' internal linkage
hash.c: inline void F1024(u64 *h, const u64 *m) {
hash.c: ^
hash.c: static
hash.c: hash.c:193:3: warning: non-constant static local variable in inline function may be different in different files [-Wstatic-local-in-inline]
hash.c: static u64 outQ[COLS1024] __attribute__((aligned(16)));
hash.c: ^
hash.c: hash.c:190:1: note: use 'static' to give inline function 'F1024' internal linkage
hash.c: inline void F1024(u64 *h, const u64 *m) {
hash.c: ^
hash.c: static
hash.c: hash.c:194:3: warning: non-constant static local variable in inline function may be different in different files [-Wstatic-local-in-inline]
hash.c: static u64 inP[COLS1024] __attribute__((aligned(16)));
hash.c: ^
hash.c: hash.c:190:1: note: use 'static' to give inline function 'F1024' internal linkage
hash.c: ...
try.c: /usr/bin/ld: libcrypto_hash_groestl512.a(hash.o): in function `Transform':
try.c: hash.c:(.text+0x...): undefined reference to `F512'
try.c: /usr/bin/ld: hash.c:(.text+0x...): undefined reference to `F1024'
try.c: clang: error: linker command failed with exit code 1 (use -v to see invocation)

Number of similar (compiler,implementation) pairs: 2, namely:
CompilerImplementations
clang -march=native -O -fomit-frame-pointer -fwrapv -Qunused-arguments -fPIC -fPIE T:opt64
clang -march=native -Os -fomit-frame-pointer -fwrapv -Qunused-arguments -fPIC -fPIE T:opt64

Compiler output

Implementation: T:opt64
Security model: timingleaks
Compiler: gcc -march=native -mtune=native -O2 -fomit-frame-pointer -fwrapv -fPIC -fPIE
hash.c: hash.c:194:14: warning: 'inP' is static but declared in inline function 'F1024' which is not static
hash.c: 194 | static u64 inP[COLS1024] __attribute__((aligned(16)));
hash.c: | ^~~
hash.c: hash.c:193:14: warning: 'outQ' is static but declared in inline function 'F1024' which is not static
hash.c: 193 | static u64 outQ[COLS1024] __attribute__((aligned(16)));
hash.c: | ^~~~
hash.c: hash.c:192:14: warning: 'z' is static but declared in inline function 'F1024' which is not static
hash.c: 192 | static u64 z[COLS1024] __attribute__((aligned(16)));
hash.c: | ^
hash.c: hash.c:191:14: warning: 'y' is static but declared in inline function 'F1024' which is not static
hash.c: 191 | static u64 y[COLS1024] __attribute__((aligned(16)));
hash.c: | ^
try.c: /usr/bin/ld: libcrypto_hash_groestl512.a(hash.o): in function `Transform':
try.c: hash.c:(.text+0x...): undefined reference to `F1024'
try.c: /usr/bin/ld: hash.c:(.text+0x...): undefined reference to `F512'
try.c: collect2: error: ld returned 1 exit status

Number of similar (compiler,implementation) pairs: 2, namely:
CompilerImplementations
gcc -march=native -mtune=native -O2 -fomit-frame-pointer -fwrapv -fPIC -fPIE T:opt64
gcc -march=native -mtune=native -O -fomit-frame-pointer -fwrapv -fPIC -fPIE T:opt64

Compiler output

Implementation: T:opt64
Security model: timingleaks
Compiler: gcc -march=native -mtune=native -O3 -fomit-frame-pointer -fwrapv -fPIC -fPIE
hash.c: hash.c:194:14: warning: 'inP' is static but declared in inline function 'F1024' which is not static
hash.c: 194 | static u64 inP[COLS1024] __attribute__((aligned(16)));
hash.c: | ^~~
hash.c: hash.c:193:14: warning: 'outQ' is static but declared in inline function 'F1024' which is not static
hash.c: 193 | static u64 outQ[COLS1024] __attribute__((aligned(16)));
hash.c: | ^~~~
hash.c: hash.c:192:14: warning: 'z' is static but declared in inline function 'F1024' which is not static
hash.c: 192 | static u64 z[COLS1024] __attribute__((aligned(16)));
hash.c: | ^
hash.c: hash.c:191:14: warning: 'y' is static but declared in inline function 'F1024' which is not static
hash.c: 191 | static u64 y[COLS1024] __attribute__((aligned(16)));
hash.c: | ^
try.c: /usr/bin/ld: libcrypto_hash_groestl512.a(hash.o): in function `Transform':
try.c: hash.c:(.text+0x...): undefined reference to `F1024'
try.c: /usr/bin/ld: hash.c:(.text+0x...): undefined reference to `F512'
try.c: /usr/bin/ld: libcrypto_hash_groestl512.a(hash.o): in function `Update':
try.c: hash.c:(.text+0x...): undefined reference to `F1024'
try.c: /usr/bin/ld: hash.c:(.text+0x...): undefined reference to `F512'
try.c: /usr/bin/ld: hash.c:(.text+0x...): undefined reference to `F1024'
try.c: /usr/bin/ld: hash.c:(.text+0x...): undefined reference to `F512'
try.c: /usr/bin/ld: libcrypto_hash_groestl512.a(hash.o): in function `Final':
try.c: hash.c:(.text+0x...): undefined reference to `F1024'
try.c: /usr/bin/ld: hash.c:(.text+0x...): undefined reference to `F1024'
try.c: /usr/bin/ld: hash.c:(.text+0x...): undefined reference to `F512'
try.c: /usr/bin/ld: hash.c:(.text+0x...): undefined reference to `F512'
try.c: collect2: error: ld returned 1 exit status

Number of similar (compiler,implementation) pairs: 1, namely:
CompilerImplementations
gcc -march=native -mtune=native -O3 -fomit-frame-pointer -fwrapv -fPIC -fPIE T:opt64

Compiler output

Implementation: T:opt64
Security model: timingleaks
Compiler: gcc -march=native -mtune=native -Os -fomit-frame-pointer -fwrapv -fPIC -fPIE
hash.c: hash.c:194:14: warning: 'inP' is static but declared in inline function 'F1024' which is not static
hash.c: 194 | static u64 inP[COLS1024] __attribute__((aligned(16)));
hash.c: | ^~~
hash.c: hash.c:193:14: warning: 'outQ' is static but declared in inline function 'F1024' which is not static
hash.c: 193 | static u64 outQ[COLS1024] __attribute__((aligned(16)));
hash.c: | ^~~~
hash.c: hash.c:192:14: warning: 'z' is static but declared in inline function 'F1024' which is not static
hash.c: 192 | static u64 z[COLS1024] __attribute__((aligned(16)));
hash.c: | ^
hash.c: hash.c:191:14: warning: 'y' is static but declared in inline function 'F1024' which is not static
hash.c: 191 | static u64 y[COLS1024] __attribute__((aligned(16)));
hash.c: | ^
try.c: /usr/bin/ld: libcrypto_hash_groestl512.a(hash.o): in function `Transform':
try.c: hash.c:(.text+0x...): undefined reference to `F512'
try.c: /usr/bin/ld: hash.c:(.text+0x...): undefined reference to `F1024'
try.c: collect2: error: ld returned 1 exit status

Number of similar (compiler,implementation) pairs: 1, namely:
CompilerImplementations
gcc -march=native -mtune=native -Os -fomit-frame-pointer -fwrapv -fPIC -fPIE T:opt64

Compiler output

Implementation: T:vperm
Security model: timingleaks
Compiler: clang -march=native -O2 -fomit-frame-pointer -fwrapv -Qunused-arguments -fPIC -fPIE
hash.c: hash.c:104:12: warning: comparison of array 'ctx->chaining' equal to a null pointer is always false [-Wtautological-pointer-compare]
hash.c: if (ctx->chaining == NULL || ctx->buffer == NULL)
hash.c: ~~~~~^~~~~~~~ ~~~~
hash.c: hash.c:104:37: warning: comparison of array 'ctx->buffer' equal to a null pointer is always false [-Wtautological-pointer-compare]
hash.c: if (ctx->chaining == NULL || ctx->buffer == NULL)
hash.c: ~~~~~^~~~~~ ~~~~
hash.c: In file included from hash.c:19:
hash.c: ./groestl-asm-vperm.h:1196:3: error: invalid operand for instruction
hash.c: VPERM_Transform_RoundConst();
hash.c: ^
hash.c: ./groestl-asm-vperm.h:1173:3: note: expanded from macro 'VPERM_Transform_RoundConst'
hash.c: VPERM_Transform_RoundConst_CNT2(0, 1);\
hash.c: ^
hash.c: ./groestl-asm-vperm.h:1158:8: note: expanded from macro 'VPERM_Transform_RoundConst_CNT2'
hash.c: asm ("movaps xmm0, [ROUND_CONST_P+"tostr(i)"*16]");\
hash.c: ^
hash.c: <inline asm>:1:15: note: instantiated into assembly here
hash.c: movaps xmm0, [ROUND_CONST_P+0*16]
hash.c: ^~~~~~~~~~~~~~~~~~~~
hash.c: In file included from hash.c:19:
hash.c: ./groestl-asm-vperm.h:1196:3: error: invalid operand for instruction
hash.c: VPERM_Transform_RoundConst();
hash.c: ^
hash.c: ./groestl-asm-vperm.h:1173:3: note: expanded from macro 'VPERM_Transform_RoundConst'
hash.c: VPERM_Transform_RoundConst_CNT2(0, 1);\
hash.c: ...

Number of similar (compiler,implementation) pairs: 5, namely:
CompilerImplementations
clang -march=native -O2 -fomit-frame-pointer -fwrapv -Qunused-arguments -fPIC -fPIE T:vperm
clang -march=native -O3 -fomit-frame-pointer -fwrapv -Qunused-arguments -fPIC -fPIE T:vperm
clang -march=native -O -fomit-frame-pointer -fwrapv -Qunused-arguments -fPIC -fPIE T:vperm
clang -march=native -Os -fomit-frame-pointer -fwrapv -Qunused-arguments -fPIC -fPIE T:vperm
clang -mcpu=native -O3 -fomit-frame-pointer -fwrapv -Qunused-arguments -fPIC -fPIE T:vperm

Compiler output

Implementation: T:vperm
Security model: timingleaks
Compiler: gcc -march=native -mtune=native -O2 -fomit-frame-pointer -fwrapv -fPIC -fPIE
try.c: /usr/bin/ld: libcrypto_hash_groestl512.a(hash.o): relocation R_X86_64_32S against symbol `ROUND_CONST_P' can not be used when making a PIE object; recompile with -fPIE
try.c: collect2: error: ld returned 1 exit status

Number of similar (compiler,implementation) pairs: 4, namely:
CompilerImplementations
gcc -march=native -mtune=native -O2 -fomit-frame-pointer -fwrapv -fPIC -fPIE T:vperm
gcc -march=native -mtune=native -O3 -fomit-frame-pointer -fwrapv -fPIC -fPIE T:vperm
gcc -march=native -mtune=native -O -fomit-frame-pointer -fwrapv -fPIC -fPIE T:vperm
gcc -march=native -mtune=native -Os -fomit-frame-pointer -fwrapv -fPIC -fPIE T:vperm

Compiler output

Implementation: T:vperm-intr
Security model: timingleaks
Compiler: clang -mcpu=native -O3 -fomit-frame-pointer -fwrapv -Qunused-arguments -fPIC -fPIE
hash.c: In file included from hash.c:34:
hash.c: ./groestl-intr-vperm.h:1102:3: error: always_inline function '_mm_shuffle_epi8' requires target feature 'ssse3', but would be inlined into function 'INIT' that is compiled without support for 'ssse3'
hash.c: VPERM_Transform_RoundConst();
hash.c: ^
hash.c: ./groestl-intr-vperm.h:1081:3: note: expanded from macro 'VPERM_Transform_RoundConst'
hash.c: VPERM_Transform_RoundConst_CNT2(0, 1);\
hash.c: ^
hash.c: ./groestl-intr-vperm.h:1070:3: note: expanded from macro 'VPERM_Transform_RoundConst_CNT2'
hash.c: VPERM_Transform_State(xmm0, xmm1, xmm2, xmm3, VPERM_IPT, xmm4, xmm5, xmm6, xmm7, xmm8, xmm9, xmm10);\
hash.c: ^
hash.c: ./groestl-intr-vperm.h:133:3: note: expanded from macro 'VPERM_Transform_State'
hash.c: VPERM_Transform_No_Const(a0, a1, t0, t1, t2, t3, c0, c1, c2);\
hash.c: ^
hash.c: ./groestl-intr-vperm.h:88:8: note: expanded from macro 'VPERM_Transform_No_Const'
hash.c: t2 = _mm_shuffle_epi8(t2, a0);\
hash.c: ^
hash.c: ./groestl-intr-vperm.h:1102:3: error: always_inline function '_mm_shuffle_epi8' requires target feature 'ssse3', but would be inlined into function 'INIT' that is compiled without support for 'ssse3'
hash.c: ./groestl-intr-vperm.h:1081:3: note: expanded from macro 'VPERM_Transform_RoundConst'
hash.c: VPERM_Transform_RoundConst_CNT2(0, 1);\
hash.c: ^
hash.c: ./groestl-intr-vperm.h:1070:3: note: expanded from macro 'VPERM_Transform_RoundConst_CNT2'
hash.c: VPERM_Transform_State(xmm0, xmm1, xmm2, xmm3, VPERM_IPT, xmm4, xmm5, xmm6, xmm7, xmm8, xmm9, xmm10);\
hash.c: ^
hash.c: ./groestl-intr-vperm.h:133:3: note: expanded from macro 'VPERM_Transform_State'
hash.c: VPERM_Transform_No_Const(a0, a1, t0, t1, t2, t3, c0, c1, c2);\
hash.c: ...

Number of similar (compiler,implementation) pairs: 1, namely:
CompilerImplementations
clang -mcpu=native -O3 -fomit-frame-pointer -fwrapv -Qunused-arguments -fPIC -fPIE T:vperm-intr