Implementation notes: amd64, dali, crypto_aead/pi64cipher256v1

Computer: dali
Microarchitecture: amd64; Zen (820f01)
Architecture: amd64
CPU ID: AuthenticAMD-00820f01-178bfbff
SUPERCOP version: 20240425
Operation: crypto_aead
Primitive: pi64cipher256v1
TimeObject sizeTest sizeImplementationCompilerBenchmark dateSUPERCOP version
67142177627 0 256194112 812 1304T:optimized_AVX2clang_-march=native_-O3_-fomit-frame-pointer_-fwrapv_-Qunused-arguments_-fPIC_-fPIE2024042720240425
67142177627 0 256191646 804 1304T:optimized_AVX2clang_-march=native_-Os_-fomit-frame-pointer_-fwrapv_-Qunused-arguments_-fPIC_-fPIE2024042720240425
67176177627 0 256194280 812 1304T:optimized_AVX2clang_-mcpu=native_-O3_-fomit-frame-pointer_-fwrapv_-Qunused-arguments_-fPIC_-fPIE2024042720240425
67177177627 0 256191886 804 1304T:optimized_AVX2clang_-march=native_-O_-fomit-frame-pointer_-fwrapv_-Qunused-arguments_-fPIC_-fPIE2024042720240425
67180177627 0 256193968 812 1304T:optimized_AVX2clang_-march=native_-O2_-fomit-frame-pointer_-fwrapv_-Qunused-arguments_-fPIC_-fPIE2024042720240425
69383174207 0 256190688 812 1304T:optimized_AVXclang_-march=native_-O3_-fomit-frame-pointer_-fwrapv_-Qunused-arguments_-fPIC_-fPIE2024042720240425
69386174207 0 256190544 812 1304T:optimized_AVXclang_-march=native_-O2_-fomit-frame-pointer_-fwrapv_-Qunused-arguments_-fPIC_-fPIE2024042720240425
69400174207 0 256188462 804 1304T:optimized_AVXclang_-march=native_-O_-fomit-frame-pointer_-fwrapv_-Qunused-arguments_-fPIC_-fPIE2024042720240425
69502174207 0 256190856 812 1304T:optimized_AVXclang_-mcpu=native_-O3_-fomit-frame-pointer_-fwrapv_-Qunused-arguments_-fPIC_-fPIE2024042720240425
69869184775 0 256199030 804 1304T:optimized_SSEclang_-march=native_-O_-fomit-frame-pointer_-fwrapv_-Qunused-arguments_-fPIC_-fPIE2024042720240425
69899174207 0 256188222 804 1304T:optimized_AVXclang_-march=native_-Os_-fomit-frame-pointer_-fwrapv_-Qunused-arguments_-fPIC_-fPIE2024042720240425
69961184775 0 256198790 804 1304T:optimized_SSEclang_-march=native_-Os_-fomit-frame-pointer_-fwrapv_-Qunused-arguments_-fPIC_-fPIE2024042720240425
70027184775 0 256201424 812 1304T:optimized_SSEclang_-mcpu=native_-O3_-fomit-frame-pointer_-fwrapv_-Qunused-arguments_-fPIC_-fPIE2024042720240425
70028184775 0 256201112 812 1304T:optimized_SSEclang_-march=native_-O2_-fomit-frame-pointer_-fwrapv_-Qunused-arguments_-fPIC_-fPIE2024042720240425
70432184775 0 256201256 812 1304T:optimized_SSEclang_-march=native_-O3_-fomit-frame-pointer_-fwrapv_-Qunused-arguments_-fPIC_-fPIE2024042720240425

Test failure

Implementation: T:optimized_nonSSE
Security model: timingleaks
Compiler: clang -march=native -O2 -fomit-frame-pointer -fwrapv -Qunused-arguments -fPIC -fPIE
error 111
crypto_aead_decrypt returns nonzero

Number of similar (compiler,implementation) pairs: 18, namely:
CompilerImplementations
clang -march=native -O2 -fomit-frame-pointer -fwrapv -Qunused-arguments -fPIC -fPIE T:optimized_nonSSE
clang -march=native -O3 -fomit-frame-pointer -fwrapv -Qunused-arguments -fPIC -fPIE T:optimized_nonSSE
clang -march=native -O -fomit-frame-pointer -fwrapv -Qunused-arguments -fPIC -fPIE T:optimized_nonSSE
clang -march=native -Os -fomit-frame-pointer -fwrapv -Qunused-arguments -fPIC -fPIE T:optimized_nonSSE
clang -mcpu=native -O3 -fomit-frame-pointer -fwrapv -Qunused-arguments -fPIC -fPIE T:optimized_nonSSE
gcc -march=native -mtune=native -O2 -fomit-frame-pointer -fwrapv -fPIC -fPIE T:optimized_nonSSE
gcc -march=native -mtune=native -O3 -fomit-frame-pointer -fwrapv -fPIC -fPIE T:optimized_nonSSE
gcc -march=native -mtune=native -O -fomit-frame-pointer -fwrapv -fPIC -fPIE T:optimized_nonSSE
gcc -march=native -mtune=native -Os -fomit-frame-pointer -fwrapv -fPIC -fPIE T:optimized_nonSSE
clang -march=native -O2 -fomit-frame-pointer -fwrapv -Qunused-arguments -fPIC -fPIE T:ref
clang -march=native -O3 -fomit-frame-pointer -fwrapv -Qunused-arguments -fPIC -fPIE T:ref
clang -march=native -O -fomit-frame-pointer -fwrapv -Qunused-arguments -fPIC -fPIE T:ref
clang -march=native -Os -fomit-frame-pointer -fwrapv -Qunused-arguments -fPIC -fPIE T:ref
clang -mcpu=native -O3 -fomit-frame-pointer -fwrapv -Qunused-arguments -fPIC -fPIE T:ref
gcc -march=native -mtune=native -O2 -fomit-frame-pointer -fwrapv -fPIC -fPIE T:ref
gcc -march=native -mtune=native -O3 -fomit-frame-pointer -fwrapv -fPIC -fPIE T:ref
gcc -march=native -mtune=native -O -fomit-frame-pointer -fwrapv -fPIC -fPIE T:ref
gcc -march=native -mtune=native -Os -fomit-frame-pointer -fwrapv -fPIC -fPIE T:ref

Compiler output

Implementation: T:optimized_AVX
Security model: timingleaks
Compiler: gcc -march=native -mtune=native -O2 -fomit-frame-pointer -fwrapv -fPIC -fPIE
try.c: /usr/bin/ld: libcrypto_aead_pi64cipher256v1.a(encrypt_AVX.o): relocation R_X86_64_32S against symbol `InternalState' can not be used when making a PIE object; recompile with -fPIE
try.c: collect2: error: ld returned 1 exit status

Number of similar (compiler,implementation) pairs: 4, namely:
CompilerImplementations
gcc -march=native -mtune=native -O2 -fomit-frame-pointer -fwrapv -fPIC -fPIE T:optimized_AVX
gcc -march=native -mtune=native -O3 -fomit-frame-pointer -fwrapv -fPIC -fPIE T:optimized_AVX
gcc -march=native -mtune=native -O -fomit-frame-pointer -fwrapv -fPIC -fPIE T:optimized_AVX
gcc -march=native -mtune=native -Os -fomit-frame-pointer -fwrapv -fPIC -fPIE T:optimized_AVX

Compiler output

Implementation: T:optimized_AVX2
Security model: timingleaks
Compiler: gcc -march=native -mtune=native -O2 -fomit-frame-pointer -fwrapv -fPIC -fPIE
try.c: /usr/bin/ld: libcrypto_aead_pi64cipher256v1.a(encrypt_AVX2.o): relocation R_X86_64_32S against symbol `InternalState' can not be used when making a PIE object; recompile with -fPIE
try.c: collect2: error: ld returned 1 exit status

Number of similar (compiler,implementation) pairs: 4, namely:
CompilerImplementations
gcc -march=native -mtune=native -O2 -fomit-frame-pointer -fwrapv -fPIC -fPIE T:optimized_AVX2
gcc -march=native -mtune=native -O3 -fomit-frame-pointer -fwrapv -fPIC -fPIE T:optimized_AVX2
gcc -march=native -mtune=native -O -fomit-frame-pointer -fwrapv -fPIC -fPIE T:optimized_AVX2
gcc -march=native -mtune=native -Os -fomit-frame-pointer -fwrapv -fPIC -fPIE T:optimized_AVX2

Compiler output

Implementation: T:optimized_SSE
Security model: timingleaks
Compiler: gcc -march=native -mtune=native -O2 -fomit-frame-pointer -fwrapv -fPIC -fPIE
try.c: /usr/bin/ld: libcrypto_aead_pi64cipher256v1.a(encrypt_SSE.o): relocation R_X86_64_32S against symbol `InternalState' can not be used when making a PIE object; recompile with -fPIE
try.c: collect2: error: ld returned 1 exit status

Number of similar (compiler,implementation) pairs: 4, namely:
CompilerImplementations
gcc -march=native -mtune=native -O2 -fomit-frame-pointer -fwrapv -fPIC -fPIE T:optimized_SSE
gcc -march=native -mtune=native -O3 -fomit-frame-pointer -fwrapv -fPIC -fPIE T:optimized_SSE
gcc -march=native -mtune=native -O -fomit-frame-pointer -fwrapv -fPIC -fPIE T:optimized_SSE
gcc -march=native -mtune=native -Os -fomit-frame-pointer -fwrapv -fPIC -fPIE T:optimized_SSE

Compiler output

Implementation: T:optimized_nonSSE
Security model: timingleaks
Compiler: clang -march=native -O2 -fomit-frame-pointer -fwrapv -Qunused-arguments -fPIC -fPIE
encrypt.c: encrypt.c:346:42: warning: unsequenced modification and access to 'i1' [-Wunsequenced]
encrypt.c: InternalState8[i1] = InternalState8[i1++] ^ ad[b+i];
encrypt.c: ~~ ^
encrypt.c: encrypt.c:448:68: warning: unsequenced modification and access to 'i1' [-Wunsequenced]
encrypt.c: c[CRYPTO_NSECBYTES+b+i] = InternalState8[i1] = InternalState8[i1++] ^ m[b+i];
encrypt.c: ~~ ^
encrypt.c: encrypt.c:593:42: warning: unsequenced modification and access to 'i1' [-Wunsequenced]
encrypt.c: InternalState8[i1] = InternalState8[i1++] ^ ad[b+i];
encrypt.c: ~~ ^
encrypt.c: 3 warnings generated.

Number of similar (compiler,implementation) pairs: 5, namely:
CompilerImplementations
clang -march=native -O2 -fomit-frame-pointer -fwrapv -Qunused-arguments -fPIC -fPIE T:optimized_nonSSE
clang -march=native -O3 -fomit-frame-pointer -fwrapv -Qunused-arguments -fPIC -fPIE T:optimized_nonSSE
clang -march=native -O -fomit-frame-pointer -fwrapv -Qunused-arguments -fPIC -fPIE T:optimized_nonSSE
clang -march=native -Os -fomit-frame-pointer -fwrapv -Qunused-arguments -fPIC -fPIE T:optimized_nonSSE
clang -mcpu=native -O3 -fomit-frame-pointer -fwrapv -Qunused-arguments -fPIC -fPIE T:optimized_nonSSE

Compiler output

Implementation: T:ref
Security model: timingleaks
Compiler: clang -march=native -O2 -fomit-frame-pointer -fwrapv -Qunused-arguments -fPIC -fPIE
encrypt.c: encrypt.c:231:42: warning: unsequenced modification and access to 'i1' [-Wunsequenced]
encrypt.c: InternalState8[i1] = InternalState8[i1++] ^ ad[b+i];
encrypt.c: ~~ ^
encrypt.c: encrypt.c:333:68: warning: unsequenced modification and access to 'i1' [-Wunsequenced]
encrypt.c: c[CRYPTO_NSECBYTES+b+i] = InternalState8[i1] = InternalState8[i1++] ^ m[b+i];
encrypt.c: ~~ ^
encrypt.c: encrypt.c:478:42: warning: unsequenced modification and access to 'i1' [-Wunsequenced]
encrypt.c: InternalState8[i1] = InternalState8[i1++] ^ ad[b+i];
encrypt.c: ~~ ^
encrypt.c: 3 warnings generated.

Number of similar (compiler,implementation) pairs: 5, namely:
CompilerImplementations
clang -march=native -O2 -fomit-frame-pointer -fwrapv -Qunused-arguments -fPIC -fPIE T:ref
clang -march=native -O3 -fomit-frame-pointer -fwrapv -Qunused-arguments -fPIC -fPIE T:ref
clang -march=native -O -fomit-frame-pointer -fwrapv -Qunused-arguments -fPIC -fPIE T:ref
clang -march=native -Os -fomit-frame-pointer -fwrapv -Qunused-arguments -fPIC -fPIE T:ref
clang -mcpu=native -O3 -fomit-frame-pointer -fwrapv -Qunused-arguments -fPIC -fPIE T:ref