Implementation notes: amd64, cubi10, crypto_kem/rqc256

Computer: cubi10
Microarchitecture: amd64; Comet Lake (806ec)
Architecture: amd64
CPU ID: GenuineIntel-000806ec-bfebfbff
SUPERCOP version: 20240625
Operation: crypto_kem
Primitive: rqc256
TimeObject sizeTest sizeImplementationCompilerBenchmark dateSUPERCOP version
1671995138434 0 2492930 908 1720T:avxclang_-march=native_-O2_-fwrapv_-Qunused-arguments_-fPIC_-fPIE_-gdwarf-4_-Wall2024070720240625
1716119940858 0 2495466 908 1720T:avxclang_-march=native_-O3_-fwrapv_-Qunused-arguments_-fPIC_-fPIE_-gdwarf-4_-Wall2024070720240625
1772117542271 0 2496549 884 1784T:avxgcc_-march=native_-mtune=native_-O3_-fwrapv_-fPIC_-fPIE_-gdwarf-4_-Wall2024070720240625
1823700230063 0 2481226 892 1720T:avxclang_-march=native_-Os_-fwrapv_-Qunused-arguments_-fPIC_-fPIE_-gdwarf-4_-Wall2024070720240625
1855447238054 0 2490365 884 1784T:avxgcc_-march=native_-mtune=native_-O2_-fwrapv_-fPIC_-fPIE_-gdwarf-4_-Wall2024070720240625
1860545330985 0 2482474 892 1720T:avxclang_-march=native_-O_-fwrapv_-Qunused-arguments_-fPIC_-fPIE_-gdwarf-4_-Wall2024070720240625
1972949130991 0 2482645 884 1784T:avxgcc_-march=native_-mtune=native_-O_-fwrapv_-fPIC_-fPIE_-gdwarf-4_-Wall2024070720240625
2022840227394 0 2477941 876 1752T:avxgcc_-march=native_-mtune=native_-Os_-fwrapv_-fPIC_-fPIE_-gdwarf-4_-Wall2024070720240625

Compiler output


rbc_qre.c: rbc_qre.c:123:13: warning: variable 'modulus' is used uninitialized whenever 'if' condition is false [-Wsometimes-uninitialized]
rbc_qre.c:   } else if(degree == 211) {
rbc_qre.c:             ^~~~~~~~~~~~~
rbc_qre.c: rbc_qre.c:134:10: note: uninitialized use occurs here
rbc_qre.c:   return modulus;
rbc_qre.c:          ^~~~~~~
rbc_qre.c: rbc_qre.c:123:10: note: remove the 'if' if its condition is always true
rbc_qre.c:   } else if(degree == 211) {
rbc_qre.c:          ^~~~~~~~~~~~~~~~~~
rbc_qre.c: rbc_qre.c:60:26: note: initialize the variable 'modulus' to silence this warning
rbc_qre.c:   rbc_poly_sparse modulus;
rbc_qre.c:                          ^
rbc_qre.c:                           = NULL
rbc_qre.c: 1 warning generated.

Number of similar (implementation,compiler) pairs: 4, namely:
ImplementationCompiler
T:avxclang -march=native -O2 -fwrapv -Qunused-arguments -fPIC -fPIE -gdwarf-4 -Wall (Debian_Clang_11.0.1)
T:avxclang -march=native -O3 -fwrapv -Qunused-arguments -fPIC -fPIE -gdwarf-4 -Wall (Debian_Clang_11.0.1)
T:avxclang -march=native -O -fwrapv -Qunused-arguments -fPIC -fPIE -gdwarf-4 -Wall (Debian_Clang_11.0.1)
T:avxclang -march=native -Os -fwrapv -Qunused-arguments -fPIC -fPIE -gdwarf-4 -Wall (Debian_Clang_11.0.1)

Compiler output


rbc_elt.c: rbc_elt.c:526:19: error: '__builtin_ia32_pclmulqdq128' needs target feature pclmul
rbc_elt.c:   __m128i a0_b0 = _mm_clmulepi64_si128(a, b, 0x00);
rbc_elt.c:                   ^
rbc_elt.c: /usr/lib/llvm-11/lib/clang/11.0.1/include/__wmmintrin_pclmul.h:45:13: note: expanded from macro '_mm_clmulepi64_si128'
rbc_elt.c:   ((__m128i)__builtin_ia32_pclmulqdq128((__v2di)(__m128i)(X), \
rbc_elt.c:             ^
rbc_elt.c: rbc_elt.c:528:19: error: '__builtin_ia32_pclmulqdq128' needs target feature pclmul
rbc_elt.c:   __m128i a0_b1 = _mm_clmulepi64_si128(a, b, 0x10);
rbc_elt.c:                   ^
rbc_elt.c: /usr/lib/llvm-11/lib/clang/11.0.1/include/__wmmintrin_pclmul.h:45:13: note: expanded from macro '_mm_clmulepi64_si128'
rbc_elt.c:   ((__m128i)__builtin_ia32_pclmulqdq128((__v2di)(__m128i)(X), \
rbc_elt.c:             ^
rbc_elt.c: rbc_elt.c:529:19: error: '__builtin_ia32_pclmulqdq128' needs target feature pclmul
rbc_elt.c:   __m128i a1_b0 = _mm_clmulepi64_si128(a, b, 0x01);
rbc_elt.c:                   ^
rbc_elt.c: /usr/lib/llvm-11/lib/clang/11.0.1/include/__wmmintrin_pclmul.h:45:13: note: expanded from macro '_mm_clmulepi64_si128'
rbc_elt.c:   ((__m128i)__builtin_ia32_pclmulqdq128((__v2di)(__m128i)(X), \
rbc_elt.c:             ^
rbc_elt.c: rbc_elt.c:531:19: error: '__builtin_ia32_pclmulqdq128' needs target feature pclmul
rbc_elt.c:   __m128i a0_b2 = _mm_clmulepi64_si128(a, d, 0x00);
rbc_elt.c:                   ^
rbc_elt.c: /usr/lib/llvm-11/lib/clang/11.0.1/include/__wmmintrin_pclmul.h:45:13: note: expanded from macro '_mm_clmulepi64_si128'
rbc_elt.c:   ((__m128i)__builtin_ia32_pclmulqdq128((__v2di)(__m128i)(X), \
rbc_elt.c:             ^
rbc_elt.c: rbc_elt.c:532:19: error: '__builtin_ia32_pclmulqdq128' needs target feature pclmul
rbc_elt.c: ...

Number of similar (implementation,compiler) pairs: 1, namely:
ImplementationCompiler
T:avxclang -mcpu=native -O3 -fwrapv -Qunused-arguments -fPIC -fPIE -gdwarf-4 -Wall (Debian_Clang_11.0.1)

Compiler output


rbc_qre.c: rbc_qre.c:123:13: warning: variable 'modulus' is used uninitialized whenever 'if' condition is false [-Wsometimes-uninitialized]
rbc_qre.c:   } else if(degree == 211) {
rbc_qre.c:             ^~~~~~~~~~~~~
rbc_qre.c: rbc_qre.c:134:10: note: uninitialized use occurs here
rbc_qre.c:   return modulus;
rbc_qre.c:          ^~~~~~~
rbc_qre.c: rbc_qre.c:123:10: note: remove the 'if' if its condition is always true
rbc_qre.c:   } else if(degree == 211) {
rbc_qre.c:          ^~~~~~~~~~~~~~~~~~
rbc_qre.c: rbc_qre.c:60:26: note: initialize the variable 'modulus' to silence this warning
rbc_qre.c:   rbc_poly_sparse modulus;
rbc_qre.c:                          ^
rbc_qre.c:                           = NULL
rbc_qre.c: 1 warning generated.
try.c: /usr/bin/ld: libcrypto_kem_rqc256.a(parsing.o):.../supercop-data/cubi10/amd64/try/c/clang_-march=native_-O2_-fwrapv_-Qunused-arguments_-fPIC_-fPIE_-gdwarf-4_-Wall/timingleaks/crypto_kem/rqc256/ref/work/./rbc.h:40: multiple definition of `RBC_SQR_LOOKUP_TABLE'; libcrypto_kem_rqc256.a(kem.o):.../supercop-data/cubi10/amd64/try/c/clang_-march=native_-O2_-fwrapv_-Qunused-arguments_-fPIC_-fPIE_-gdwarf-4_-Wall/timingleaks/crypto_kem/rqc256/ref/work/./rbc.h:40: first defined here
try.c: /usr/bin/ld: libcrypto_kem_rqc256.a(rbc_elt.o):.../supercop-data/cubi10/amd64/try/c/clang_-march=native_-O2_-fwrapv_-Qunused-arguments_-fPIC_-fPIE_-gdwarf-4_-Wall/timingleaks/crypto_kem/rqc256/ref/work/./rbc.h:40: multiple definition of `RBC_SQR_LOOKUP_TABLE'; libcrypto_kem_rqc256.a(kem.o):.../supercop-data/cubi10/amd64/try/c/clang_-march=native_-O2_-fwrapv_-Qunused-arguments_-fPIC_-fPIE_-gdwarf-4_-Wall/timingleaks/crypto_kem/rqc256/ref/work/./rbc.h:40: first defined here
try.c: /usr/bin/ld: libcrypto_kem_rqc256.a(rbc_qre.o):.../supercop-data/cubi10/amd64/try/c/clang_-march=native_-O2_-fwrapv_-Qunused-arguments_-fPIC_-fPIE_-gdwarf-4_-Wall/timingleaks/crypto_kem/rqc256/ref/work/./rbc.h:40: multiple definition of `RBC_SQR_LOOKUP_TABLE'; libcrypto_kem_rqc256.a(kem.o):.../supercop-data/cubi10/amd64/try/c/clang_-march=native_-O2_-fwrapv_-Qunused-arguments_-fPIC_-fPIE_-gdwarf-4_-Wall/timingleaks/crypto_kem/rqc256/ref/work/./rbc.h:40: first defined here
try.c: /usr/bin/ld: libcrypto_kem_rqc256.a(rbc_vec.o):.../supercop-data/cubi10/amd64/try/c/clang_-march=native_-O2_-fwrapv_-Qunused-arguments_-fPIC_-fPIE_-gdwarf-4_-Wall/timingleaks/crypto_kem/rqc256/ref/work/./rbc.h:40: multiple definition of `RBC_SQR_LOOKUP_TABLE'; libcrypto_kem_rqc256.a(kem.o):.../supercop-data/cubi10/amd64/try/c/clang_-march=native_-O2_-fwrapv_-Qunused-arguments_-fPIC_-fPIE_-gdwarf-4_-Wall/timingleaks/crypto_kem/rqc256/ref/work/./rbc.h:40: first defined here
try.c: /usr/bin/ld: libcrypto_kem_rqc256.a(rbc_vspace.o):.../supercop-data/cubi10/amd64/try/c/clang_-march=native_-O2_-fwrapv_-Qunused-arguments_-fPIC_-fPIE_-gdwarf-4_-Wall/timingleaks/crypto_kem/rqc256/ref/work/./rbc.h:40: multiple definition of `RBC_SQR_LOOKUP_TABLE'; libcrypto_kem_rqc256.a(kem.o):.../supercop-data/cubi10/amd64/try/c/clang_-march=native_-O2_-fwrapv_-Qunused-arguments_-fPIC_-fPIE_-gdwarf-4_-Wall/timingleaks/crypto_kem/rqc256/ref/work/./rbc.h:40: first defined here
try.c: /usr/bin/ld: libcrypto_kem_rqc256.a(rqc.o):.../supercop-data/cubi10/amd64/try/c/clang_-march=native_-O2_-fwrapv_-Qunused-arguments_-fPIC_-fPIE_-gdwarf-4_-Wall/timingleaks/crypto_kem/rqc256/ref/work/./rbc.h:40: multiple definition of `RBC_SQR_LOOKUP_TABLE'; libcrypto_kem_rqc256.a(kem.o):.../supercop-data/cubi10/amd64/try/c/clang_-march=native_-O2_-fwrapv_-Qunused-arguments_-fPIC_-fPIE_-gdwarf-4_-Wall/timingleaks/crypto_kem/rqc256/ref/work/./rbc.h:40: first defined here
try.c: /usr/bin/ld: libcrypto_kem_rqc256.a(gabidulin.o):.../supercop-data/cubi10/amd64/try/c/clang_-march=native_-O2_-fwrapv_-Qunused-arguments_-fPIC_-fPIE_-gdwarf-4_-Wall/timingleaks/crypto_kem/rqc256/ref/work/./rbc.h:40: multiple definition of `RBC_SQR_LOOKUP_TABLE'; libcrypto_kem_rqc256.a(kem.o):.../supercop-data/cubi10/amd64/try/c/clang_-march=native_-O2_-fwrapv_-Qunused-arguments_-fPIC_-fPIE_-gdwarf-4_-Wall/timingleaks/crypto_kem/rqc256/ref/work/./rbc.h:40: first defined here
try.c: /usr/bin/ld: libcrypto_kem_rqc256.a(qpoly.o):.../supercop-data/cubi10/amd64/try/c/clang_-march=native_-O2_-fwrapv_-Qunused-arguments_-fPIC_-fPIE_-gdwarf-4_-Wall/timingleaks/crypto_kem/rqc256/ref/work/./rbc.h:40: multiple definition of `RBC_SQR_LOOKUP_TABLE'; libcrypto_kem_rqc256.a(kem.o):.../supercop-data/cubi10/amd64/try/c/clang_-march=native_-O2_-fwrapv_-Qunused-arguments_-fPIC_-fPIE_-gdwarf-4_-Wall/timingleaks/crypto_kem/rqc256/ref/work/./rbc.h:40: first defined here
try.c: /usr/bin/ld: libcrypto_kem_rqc256.a(rbc_poly.o):.../supercop-data/cubi10/amd64/try/c/clang_-march=native_-O2_-fwrapv_-Qunused-arguments_-fPIC_-fPIE_-gdwarf-4_-Wall/timingleaks/crypto_kem/rqc256/ref/work/./rbc.h:40: multiple definition of `RBC_SQR_LOOKUP_TABLE'; libcrypto_kem_rqc256.a(kem.o):.../supercop-data/cubi10/amd64/try/c/clang_-march=native_-O2_-fwrapv_-Qunused-arguments_-fPIC_-fPIE_-gdwarf-4_-Wall/timingleaks/crypto_kem/rqc256/ref/work/./rbc.h:40: first defined here
try.c: clang: error: linker command failed with exit code 1 (use -v to see invocation)

Number of similar (implementation,compiler) pairs: 1, namely:
ImplementationCompiler
T:refclang -march=native -O2 -fwrapv -Qunused-arguments -fPIC -fPIE -gdwarf-4 -Wall (Debian_Clang_11.0.1)

Compiler output


rbc_qre.c: rbc_qre.c:123:13: warning: variable 'modulus' is used uninitialized whenever 'if' condition is false [-Wsometimes-uninitialized]
rbc_qre.c:   } else if(degree == 211) {
rbc_qre.c:             ^~~~~~~~~~~~~
rbc_qre.c: rbc_qre.c:134:10: note: uninitialized use occurs here
rbc_qre.c:   return modulus;
rbc_qre.c:          ^~~~~~~
rbc_qre.c: rbc_qre.c:123:10: note: remove the 'if' if its condition is always true
rbc_qre.c:   } else if(degree == 211) {
rbc_qre.c:          ^~~~~~~~~~~~~~~~~~
rbc_qre.c: rbc_qre.c:60:26: note: initialize the variable 'modulus' to silence this warning
rbc_qre.c:   rbc_poly_sparse modulus;
rbc_qre.c:                          ^
rbc_qre.c:                           = NULL
rbc_qre.c: 1 warning generated.
try.c: /usr/bin/ld: libcrypto_kem_rqc256.a(parsing.o):.../supercop-data/cubi10/amd64/try/c/clang_-march=native_-O3_-fwrapv_-Qunused-arguments_-fPIC_-fPIE_-gdwarf-4_-Wall/timingleaks/crypto_kem/rqc256/ref/work/./rbc.h:40: multiple definition of `RBC_SQR_LOOKUP_TABLE'; libcrypto_kem_rqc256.a(kem.o):.../supercop-data/cubi10/amd64/try/c/clang_-march=native_-O3_-fwrapv_-Qunused-arguments_-fPIC_-fPIE_-gdwarf-4_-Wall/timingleaks/crypto_kem/rqc256/ref/work/./rbc.h:40: first defined here
try.c: /usr/bin/ld: libcrypto_kem_rqc256.a(rbc_elt.o):.../supercop-data/cubi10/amd64/try/c/clang_-march=native_-O3_-fwrapv_-Qunused-arguments_-fPIC_-fPIE_-gdwarf-4_-Wall/timingleaks/crypto_kem/rqc256/ref/work/./rbc.h:40: multiple definition of `RBC_SQR_LOOKUP_TABLE'; libcrypto_kem_rqc256.a(kem.o):.../supercop-data/cubi10/amd64/try/c/clang_-march=native_-O3_-fwrapv_-Qunused-arguments_-fPIC_-fPIE_-gdwarf-4_-Wall/timingleaks/crypto_kem/rqc256/ref/work/./rbc.h:40: first defined here
try.c: /usr/bin/ld: libcrypto_kem_rqc256.a(rbc_qre.o):.../supercop-data/cubi10/amd64/try/c/clang_-march=native_-O3_-fwrapv_-Qunused-arguments_-fPIC_-fPIE_-gdwarf-4_-Wall/timingleaks/crypto_kem/rqc256/ref/work/./rbc.h:40: multiple definition of `RBC_SQR_LOOKUP_TABLE'; libcrypto_kem_rqc256.a(kem.o):.../supercop-data/cubi10/amd64/try/c/clang_-march=native_-O3_-fwrapv_-Qunused-arguments_-fPIC_-fPIE_-gdwarf-4_-Wall/timingleaks/crypto_kem/rqc256/ref/work/./rbc.h:40: first defined here
try.c: /usr/bin/ld: libcrypto_kem_rqc256.a(rbc_vec.o):.../supercop-data/cubi10/amd64/try/c/clang_-march=native_-O3_-fwrapv_-Qunused-arguments_-fPIC_-fPIE_-gdwarf-4_-Wall/timingleaks/crypto_kem/rqc256/ref/work/./rbc.h:40: multiple definition of `RBC_SQR_LOOKUP_TABLE'; libcrypto_kem_rqc256.a(kem.o):.../supercop-data/cubi10/amd64/try/c/clang_-march=native_-O3_-fwrapv_-Qunused-arguments_-fPIC_-fPIE_-gdwarf-4_-Wall/timingleaks/crypto_kem/rqc256/ref/work/./rbc.h:40: first defined here
try.c: /usr/bin/ld: libcrypto_kem_rqc256.a(rbc_vspace.o):.../supercop-data/cubi10/amd64/try/c/clang_-march=native_-O3_-fwrapv_-Qunused-arguments_-fPIC_-fPIE_-gdwarf-4_-Wall/timingleaks/crypto_kem/rqc256/ref/work/./rbc.h:40: multiple definition of `RBC_SQR_LOOKUP_TABLE'; libcrypto_kem_rqc256.a(kem.o):.../supercop-data/cubi10/amd64/try/c/clang_-march=native_-O3_-fwrapv_-Qunused-arguments_-fPIC_-fPIE_-gdwarf-4_-Wall/timingleaks/crypto_kem/rqc256/ref/work/./rbc.h:40: first defined here
try.c: /usr/bin/ld: libcrypto_kem_rqc256.a(rqc.o):.../supercop-data/cubi10/amd64/try/c/clang_-march=native_-O3_-fwrapv_-Qunused-arguments_-fPIC_-fPIE_-gdwarf-4_-Wall/timingleaks/crypto_kem/rqc256/ref/work/./rbc.h:40: multiple definition of `RBC_SQR_LOOKUP_TABLE'; libcrypto_kem_rqc256.a(kem.o):.../supercop-data/cubi10/amd64/try/c/clang_-march=native_-O3_-fwrapv_-Qunused-arguments_-fPIC_-fPIE_-gdwarf-4_-Wall/timingleaks/crypto_kem/rqc256/ref/work/./rbc.h:40: first defined here
try.c: /usr/bin/ld: libcrypto_kem_rqc256.a(gabidulin.o):.../supercop-data/cubi10/amd64/try/c/clang_-march=native_-O3_-fwrapv_-Qunused-arguments_-fPIC_-fPIE_-gdwarf-4_-Wall/timingleaks/crypto_kem/rqc256/ref/work/./rbc.h:40: multiple definition of `RBC_SQR_LOOKUP_TABLE'; libcrypto_kem_rqc256.a(kem.o):.../supercop-data/cubi10/amd64/try/c/clang_-march=native_-O3_-fwrapv_-Qunused-arguments_-fPIC_-fPIE_-gdwarf-4_-Wall/timingleaks/crypto_kem/rqc256/ref/work/./rbc.h:40: first defined here
try.c: /usr/bin/ld: libcrypto_kem_rqc256.a(qpoly.o):.../supercop-data/cubi10/amd64/try/c/clang_-march=native_-O3_-fwrapv_-Qunused-arguments_-fPIC_-fPIE_-gdwarf-4_-Wall/timingleaks/crypto_kem/rqc256/ref/work/./rbc.h:40: multiple definition of `RBC_SQR_LOOKUP_TABLE'; libcrypto_kem_rqc256.a(kem.o):.../supercop-data/cubi10/amd64/try/c/clang_-march=native_-O3_-fwrapv_-Qunused-arguments_-fPIC_-fPIE_-gdwarf-4_-Wall/timingleaks/crypto_kem/rqc256/ref/work/./rbc.h:40: first defined here
try.c: /usr/bin/ld: libcrypto_kem_rqc256.a(rbc_poly.o):.../supercop-data/cubi10/amd64/try/c/clang_-march=native_-O3_-fwrapv_-Qunused-arguments_-fPIC_-fPIE_-gdwarf-4_-Wall/timingleaks/crypto_kem/rqc256/ref/work/./rbc.h:40: multiple definition of `RBC_SQR_LOOKUP_TABLE'; libcrypto_kem_rqc256.a(kem.o):.../supercop-data/cubi10/amd64/try/c/clang_-march=native_-O3_-fwrapv_-Qunused-arguments_-fPIC_-fPIE_-gdwarf-4_-Wall/timingleaks/crypto_kem/rqc256/ref/work/./rbc.h:40: first defined here
try.c: clang: error: linker command failed with exit code 1 (use -v to see invocation)

Number of similar (implementation,compiler) pairs: 1, namely:
ImplementationCompiler
T:refclang -march=native -O3 -fwrapv -Qunused-arguments -fPIC -fPIE -gdwarf-4 -Wall (Debian_Clang_11.0.1)

Compiler output


rbc_qre.c: rbc_qre.c:123:13: warning: variable 'modulus' is used uninitialized whenever 'if' condition is false [-Wsometimes-uninitialized]
rbc_qre.c:   } else if(degree == 211) {
rbc_qre.c:             ^~~~~~~~~~~~~
rbc_qre.c: rbc_qre.c:134:10: note: uninitialized use occurs here
rbc_qre.c:   return modulus;
rbc_qre.c:          ^~~~~~~
rbc_qre.c: rbc_qre.c:123:10: note: remove the 'if' if its condition is always true
rbc_qre.c:   } else if(degree == 211) {
rbc_qre.c:          ^~~~~~~~~~~~~~~~~~
rbc_qre.c: rbc_qre.c:60:26: note: initialize the variable 'modulus' to silence this warning
rbc_qre.c:   rbc_poly_sparse modulus;
rbc_qre.c:                          ^
rbc_qre.c:                           = NULL
rbc_qre.c: 1 warning generated.
try.c: /usr/bin/ld: libcrypto_kem_rqc256.a(parsing.o):.../supercop-data/cubi10/amd64/try/c/clang_-march=native_-O_-fwrapv_-Qunused-arguments_-fPIC_-fPIE_-gdwarf-4_-Wall/timingleaks/crypto_kem/rqc256/ref/work/./rbc.h:40: multiple definition of `RBC_SQR_LOOKUP_TABLE'; libcrypto_kem_rqc256.a(kem.o):.../supercop-data/cubi10/amd64/try/c/clang_-march=native_-O_-fwrapv_-Qunused-arguments_-fPIC_-fPIE_-gdwarf-4_-Wall/timingleaks/crypto_kem/rqc256/ref/work/./rbc.h:40: first defined here
try.c: /usr/bin/ld: libcrypto_kem_rqc256.a(rbc_elt.o):.../supercop-data/cubi10/amd64/try/c/clang_-march=native_-O_-fwrapv_-Qunused-arguments_-fPIC_-fPIE_-gdwarf-4_-Wall/timingleaks/crypto_kem/rqc256/ref/work/./rbc.h:40: multiple definition of `RBC_SQR_LOOKUP_TABLE'; libcrypto_kem_rqc256.a(kem.o):.../supercop-data/cubi10/amd64/try/c/clang_-march=native_-O_-fwrapv_-Qunused-arguments_-fPIC_-fPIE_-gdwarf-4_-Wall/timingleaks/crypto_kem/rqc256/ref/work/./rbc.h:40: first defined here
try.c: /usr/bin/ld: libcrypto_kem_rqc256.a(rbc_qre.o):.../supercop-data/cubi10/amd64/try/c/clang_-march=native_-O_-fwrapv_-Qunused-arguments_-fPIC_-fPIE_-gdwarf-4_-Wall/timingleaks/crypto_kem/rqc256/ref/work/./rbc.h:40: multiple definition of `RBC_SQR_LOOKUP_TABLE'; libcrypto_kem_rqc256.a(kem.o):.../supercop-data/cubi10/amd64/try/c/clang_-march=native_-O_-fwrapv_-Qunused-arguments_-fPIC_-fPIE_-gdwarf-4_-Wall/timingleaks/crypto_kem/rqc256/ref/work/./rbc.h:40: first defined here
try.c: /usr/bin/ld: libcrypto_kem_rqc256.a(rbc_vec.o):.../supercop-data/cubi10/amd64/try/c/clang_-march=native_-O_-fwrapv_-Qunused-arguments_-fPIC_-fPIE_-gdwarf-4_-Wall/timingleaks/crypto_kem/rqc256/ref/work/./rbc.h:40: multiple definition of `RBC_SQR_LOOKUP_TABLE'; libcrypto_kem_rqc256.a(kem.o):.../supercop-data/cubi10/amd64/try/c/clang_-march=native_-O_-fwrapv_-Qunused-arguments_-fPIC_-fPIE_-gdwarf-4_-Wall/timingleaks/crypto_kem/rqc256/ref/work/./rbc.h:40: first defined here
try.c: /usr/bin/ld: libcrypto_kem_rqc256.a(rbc_vspace.o):.../supercop-data/cubi10/amd64/try/c/clang_-march=native_-O_-fwrapv_-Qunused-arguments_-fPIC_-fPIE_-gdwarf-4_-Wall/timingleaks/crypto_kem/rqc256/ref/work/./rbc.h:40: multiple definition of `RBC_SQR_LOOKUP_TABLE'; libcrypto_kem_rqc256.a(kem.o):.../supercop-data/cubi10/amd64/try/c/clang_-march=native_-O_-fwrapv_-Qunused-arguments_-fPIC_-fPIE_-gdwarf-4_-Wall/timingleaks/crypto_kem/rqc256/ref/work/./rbc.h:40: first defined here
try.c: /usr/bin/ld: libcrypto_kem_rqc256.a(rqc.o):.../supercop-data/cubi10/amd64/try/c/clang_-march=native_-O_-fwrapv_-Qunused-arguments_-fPIC_-fPIE_-gdwarf-4_-Wall/timingleaks/crypto_kem/rqc256/ref/work/./rbc.h:40: multiple definition of `RBC_SQR_LOOKUP_TABLE'; libcrypto_kem_rqc256.a(kem.o):.../supercop-data/cubi10/amd64/try/c/clang_-march=native_-O_-fwrapv_-Qunused-arguments_-fPIC_-fPIE_-gdwarf-4_-Wall/timingleaks/crypto_kem/rqc256/ref/work/./rbc.h:40: first defined here
try.c: /usr/bin/ld: libcrypto_kem_rqc256.a(gabidulin.o):.../supercop-data/cubi10/amd64/try/c/clang_-march=native_-O_-fwrapv_-Qunused-arguments_-fPIC_-fPIE_-gdwarf-4_-Wall/timingleaks/crypto_kem/rqc256/ref/work/./rbc.h:40: multiple definition of `RBC_SQR_LOOKUP_TABLE'; libcrypto_kem_rqc256.a(kem.o):.../supercop-data/cubi10/amd64/try/c/clang_-march=native_-O_-fwrapv_-Qunused-arguments_-fPIC_-fPIE_-gdwarf-4_-Wall/timingleaks/crypto_kem/rqc256/ref/work/./rbc.h:40: first defined here
try.c: /usr/bin/ld: libcrypto_kem_rqc256.a(qpoly.o):.../supercop-data/cubi10/amd64/try/c/clang_-march=native_-O_-fwrapv_-Qunused-arguments_-fPIC_-fPIE_-gdwarf-4_-Wall/timingleaks/crypto_kem/rqc256/ref/work/./rbc.h:40: multiple definition of `RBC_SQR_LOOKUP_TABLE'; libcrypto_kem_rqc256.a(kem.o):.../supercop-data/cubi10/amd64/try/c/clang_-march=native_-O_-fwrapv_-Qunused-arguments_-fPIC_-fPIE_-gdwarf-4_-Wall/timingleaks/crypto_kem/rqc256/ref/work/./rbc.h:40: first defined here
try.c: /usr/bin/ld: libcrypto_kem_rqc256.a(rbc_poly.o):.../supercop-data/cubi10/amd64/try/c/clang_-march=native_-O_-fwrapv_-Qunused-arguments_-fPIC_-fPIE_-gdwarf-4_-Wall/timingleaks/crypto_kem/rqc256/ref/work/./rbc.h:40: multiple definition of `RBC_SQR_LOOKUP_TABLE'; libcrypto_kem_rqc256.a(kem.o):.../supercop-data/cubi10/amd64/try/c/clang_-march=native_-O_-fwrapv_-Qunused-arguments_-fPIC_-fPIE_-gdwarf-4_-Wall/timingleaks/crypto_kem/rqc256/ref/work/./rbc.h:40: first defined here
try.c: clang: error: linker command failed with exit code 1 (use -v to see invocation)

Number of similar (implementation,compiler) pairs: 1, namely:
ImplementationCompiler
T:refclang -march=native -O -fwrapv -Qunused-arguments -fPIC -fPIE -gdwarf-4 -Wall (Debian_Clang_11.0.1)

Compiler output


rbc_qre.c: rbc_qre.c:123:13: warning: variable 'modulus' is used uninitialized whenever 'if' condition is false [-Wsometimes-uninitialized]
rbc_qre.c:   } else if(degree == 211) {
rbc_qre.c:             ^~~~~~~~~~~~~
rbc_qre.c: rbc_qre.c:134:10: note: uninitialized use occurs here
rbc_qre.c:   return modulus;
rbc_qre.c:          ^~~~~~~
rbc_qre.c: rbc_qre.c:123:10: note: remove the 'if' if its condition is always true
rbc_qre.c:   } else if(degree == 211) {
rbc_qre.c:          ^~~~~~~~~~~~~~~~~~
rbc_qre.c: rbc_qre.c:60:26: note: initialize the variable 'modulus' to silence this warning
rbc_qre.c:   rbc_poly_sparse modulus;
rbc_qre.c:                          ^
rbc_qre.c:                           = NULL
rbc_qre.c: 1 warning generated.
try.c: /usr/bin/ld: libcrypto_kem_rqc256.a(parsing.o):.../supercop-data/cubi10/amd64/try/c/clang_-march=native_-Os_-fwrapv_-Qunused-arguments_-fPIC_-fPIE_-gdwarf-4_-Wall/timingleaks/crypto_kem/rqc256/ref/work/./rbc.h:40: multiple definition of `RBC_SQR_LOOKUP_TABLE'; libcrypto_kem_rqc256.a(kem.o):.../supercop-data/cubi10/amd64/try/c/clang_-march=native_-Os_-fwrapv_-Qunused-arguments_-fPIC_-fPIE_-gdwarf-4_-Wall/timingleaks/crypto_kem/rqc256/ref/work/./rbc.h:40: first defined here
try.c: /usr/bin/ld: libcrypto_kem_rqc256.a(rbc_elt.o):.../supercop-data/cubi10/amd64/try/c/clang_-march=native_-Os_-fwrapv_-Qunused-arguments_-fPIC_-fPIE_-gdwarf-4_-Wall/timingleaks/crypto_kem/rqc256/ref/work/./rbc.h:40: multiple definition of `RBC_SQR_LOOKUP_TABLE'; libcrypto_kem_rqc256.a(kem.o):.../supercop-data/cubi10/amd64/try/c/clang_-march=native_-Os_-fwrapv_-Qunused-arguments_-fPIC_-fPIE_-gdwarf-4_-Wall/timingleaks/crypto_kem/rqc256/ref/work/./rbc.h:40: first defined here
try.c: /usr/bin/ld: libcrypto_kem_rqc256.a(rbc_qre.o):.../supercop-data/cubi10/amd64/try/c/clang_-march=native_-Os_-fwrapv_-Qunused-arguments_-fPIC_-fPIE_-gdwarf-4_-Wall/timingleaks/crypto_kem/rqc256/ref/work/./rbc.h:40: multiple definition of `RBC_SQR_LOOKUP_TABLE'; libcrypto_kem_rqc256.a(kem.o):.../supercop-data/cubi10/amd64/try/c/clang_-march=native_-Os_-fwrapv_-Qunused-arguments_-fPIC_-fPIE_-gdwarf-4_-Wall/timingleaks/crypto_kem/rqc256/ref/work/./rbc.h:40: first defined here
try.c: /usr/bin/ld: libcrypto_kem_rqc256.a(rbc_vec.o):.../supercop-data/cubi10/amd64/try/c/clang_-march=native_-Os_-fwrapv_-Qunused-arguments_-fPIC_-fPIE_-gdwarf-4_-Wall/timingleaks/crypto_kem/rqc256/ref/work/./rbc.h:40: multiple definition of `RBC_SQR_LOOKUP_TABLE'; libcrypto_kem_rqc256.a(kem.o):.../supercop-data/cubi10/amd64/try/c/clang_-march=native_-Os_-fwrapv_-Qunused-arguments_-fPIC_-fPIE_-gdwarf-4_-Wall/timingleaks/crypto_kem/rqc256/ref/work/./rbc.h:40: first defined here
try.c: /usr/bin/ld: libcrypto_kem_rqc256.a(rbc_vspace.o):.../supercop-data/cubi10/amd64/try/c/clang_-march=native_-Os_-fwrapv_-Qunused-arguments_-fPIC_-fPIE_-gdwarf-4_-Wall/timingleaks/crypto_kem/rqc256/ref/work/./rbc.h:40: multiple definition of `RBC_SQR_LOOKUP_TABLE'; libcrypto_kem_rqc256.a(kem.o):.../supercop-data/cubi10/amd64/try/c/clang_-march=native_-Os_-fwrapv_-Qunused-arguments_-fPIC_-fPIE_-gdwarf-4_-Wall/timingleaks/crypto_kem/rqc256/ref/work/./rbc.h:40: first defined here
try.c: /usr/bin/ld: libcrypto_kem_rqc256.a(rqc.o):.../supercop-data/cubi10/amd64/try/c/clang_-march=native_-Os_-fwrapv_-Qunused-arguments_-fPIC_-fPIE_-gdwarf-4_-Wall/timingleaks/crypto_kem/rqc256/ref/work/./rbc.h:40: multiple definition of `RBC_SQR_LOOKUP_TABLE'; libcrypto_kem_rqc256.a(kem.o):.../supercop-data/cubi10/amd64/try/c/clang_-march=native_-Os_-fwrapv_-Qunused-arguments_-fPIC_-fPIE_-gdwarf-4_-Wall/timingleaks/crypto_kem/rqc256/ref/work/./rbc.h:40: first defined here
try.c: /usr/bin/ld: libcrypto_kem_rqc256.a(gabidulin.o):.../supercop-data/cubi10/amd64/try/c/clang_-march=native_-Os_-fwrapv_-Qunused-arguments_-fPIC_-fPIE_-gdwarf-4_-Wall/timingleaks/crypto_kem/rqc256/ref/work/./rbc.h:40: multiple definition of `RBC_SQR_LOOKUP_TABLE'; libcrypto_kem_rqc256.a(kem.o):.../supercop-data/cubi10/amd64/try/c/clang_-march=native_-Os_-fwrapv_-Qunused-arguments_-fPIC_-fPIE_-gdwarf-4_-Wall/timingleaks/crypto_kem/rqc256/ref/work/./rbc.h:40: first defined here
try.c: /usr/bin/ld: libcrypto_kem_rqc256.a(qpoly.o):.../supercop-data/cubi10/amd64/try/c/clang_-march=native_-Os_-fwrapv_-Qunused-arguments_-fPIC_-fPIE_-gdwarf-4_-Wall/timingleaks/crypto_kem/rqc256/ref/work/./rbc.h:40: multiple definition of `RBC_SQR_LOOKUP_TABLE'; libcrypto_kem_rqc256.a(kem.o):.../supercop-data/cubi10/amd64/try/c/clang_-march=native_-Os_-fwrapv_-Qunused-arguments_-fPIC_-fPIE_-gdwarf-4_-Wall/timingleaks/crypto_kem/rqc256/ref/work/./rbc.h:40: first defined here
try.c: /usr/bin/ld: libcrypto_kem_rqc256.a(rbc_poly.o):.../supercop-data/cubi10/amd64/try/c/clang_-march=native_-Os_-fwrapv_-Qunused-arguments_-fPIC_-fPIE_-gdwarf-4_-Wall/timingleaks/crypto_kem/rqc256/ref/work/./rbc.h:40: multiple definition of `RBC_SQR_LOOKUP_TABLE'; libcrypto_kem_rqc256.a(kem.o):.../supercop-data/cubi10/amd64/try/c/clang_-march=native_-Os_-fwrapv_-Qunused-arguments_-fPIC_-fPIE_-gdwarf-4_-Wall/timingleaks/crypto_kem/rqc256/ref/work/./rbc.h:40: first defined here
try.c: clang: error: linker command failed with exit code 1 (use -v to see invocation)

Number of similar (implementation,compiler) pairs: 1, namely:
ImplementationCompiler
T:refclang -march=native -Os -fwrapv -Qunused-arguments -fPIC -fPIE -gdwarf-4 -Wall (Debian_Clang_11.0.1)

Compiler output


rbc_qre.c: rbc_qre.c:123:13: warning: variable 'modulus' is used uninitialized whenever 'if' condition is false [-Wsometimes-uninitialized]
rbc_qre.c:   } else if(degree == 211) {
rbc_qre.c:             ^~~~~~~~~~~~~
rbc_qre.c: rbc_qre.c:134:10: note: uninitialized use occurs here
rbc_qre.c:   return modulus;
rbc_qre.c:          ^~~~~~~
rbc_qre.c: rbc_qre.c:123:10: note: remove the 'if' if its condition is always true
rbc_qre.c:   } else if(degree == 211) {
rbc_qre.c:          ^~~~~~~~~~~~~~~~~~
rbc_qre.c: rbc_qre.c:60:26: note: initialize the variable 'modulus' to silence this warning
rbc_qre.c:   rbc_poly_sparse modulus;
rbc_qre.c:                          ^
rbc_qre.c:                           = NULL
rbc_qre.c: 1 warning generated.
try.c: /usr/bin/ld: libcrypto_kem_rqc256.a(parsing.o):.../supercop-data/cubi10/amd64/try/c/clang_-mcpu=native_-O3_-fwrapv_-Qunused-arguments_-fPIC_-fPIE_-gdwarf-4_-Wall/timingleaks/crypto_kem/rqc256/ref/work/./rbc.h:40: multiple definition of `RBC_SQR_LOOKUP_TABLE'; libcrypto_kem_rqc256.a(kem.o):.../supercop-data/cubi10/amd64/try/c/clang_-mcpu=native_-O3_-fwrapv_-Qunused-arguments_-fPIC_-fPIE_-gdwarf-4_-Wall/timingleaks/crypto_kem/rqc256/ref/work/./rbc.h:40: first defined here
try.c: /usr/bin/ld: libcrypto_kem_rqc256.a(rbc_elt.o):.../supercop-data/cubi10/amd64/try/c/clang_-mcpu=native_-O3_-fwrapv_-Qunused-arguments_-fPIC_-fPIE_-gdwarf-4_-Wall/timingleaks/crypto_kem/rqc256/ref/work/./rbc.h:40: multiple definition of `RBC_SQR_LOOKUP_TABLE'; libcrypto_kem_rqc256.a(kem.o):.../supercop-data/cubi10/amd64/try/c/clang_-mcpu=native_-O3_-fwrapv_-Qunused-arguments_-fPIC_-fPIE_-gdwarf-4_-Wall/timingleaks/crypto_kem/rqc256/ref/work/./rbc.h:40: first defined here
try.c: /usr/bin/ld: libcrypto_kem_rqc256.a(rbc_qre.o):.../supercop-data/cubi10/amd64/try/c/clang_-mcpu=native_-O3_-fwrapv_-Qunused-arguments_-fPIC_-fPIE_-gdwarf-4_-Wall/timingleaks/crypto_kem/rqc256/ref/work/./rbc.h:40: multiple definition of `RBC_SQR_LOOKUP_TABLE'; libcrypto_kem_rqc256.a(kem.o):.../supercop-data/cubi10/amd64/try/c/clang_-mcpu=native_-O3_-fwrapv_-Qunused-arguments_-fPIC_-fPIE_-gdwarf-4_-Wall/timingleaks/crypto_kem/rqc256/ref/work/./rbc.h:40: first defined here
try.c: /usr/bin/ld: libcrypto_kem_rqc256.a(rbc_vec.o):.../supercop-data/cubi10/amd64/try/c/clang_-mcpu=native_-O3_-fwrapv_-Qunused-arguments_-fPIC_-fPIE_-gdwarf-4_-Wall/timingleaks/crypto_kem/rqc256/ref/work/./rbc.h:40: multiple definition of `RBC_SQR_LOOKUP_TABLE'; libcrypto_kem_rqc256.a(kem.o):.../supercop-data/cubi10/amd64/try/c/clang_-mcpu=native_-O3_-fwrapv_-Qunused-arguments_-fPIC_-fPIE_-gdwarf-4_-Wall/timingleaks/crypto_kem/rqc256/ref/work/./rbc.h:40: first defined here
try.c: /usr/bin/ld: libcrypto_kem_rqc256.a(rbc_vspace.o):.../supercop-data/cubi10/amd64/try/c/clang_-mcpu=native_-O3_-fwrapv_-Qunused-arguments_-fPIC_-fPIE_-gdwarf-4_-Wall/timingleaks/crypto_kem/rqc256/ref/work/./rbc.h:40: multiple definition of `RBC_SQR_LOOKUP_TABLE'; libcrypto_kem_rqc256.a(kem.o):.../supercop-data/cubi10/amd64/try/c/clang_-mcpu=native_-O3_-fwrapv_-Qunused-arguments_-fPIC_-fPIE_-gdwarf-4_-Wall/timingleaks/crypto_kem/rqc256/ref/work/./rbc.h:40: first defined here
try.c: /usr/bin/ld: libcrypto_kem_rqc256.a(rqc.o):.../supercop-data/cubi10/amd64/try/c/clang_-mcpu=native_-O3_-fwrapv_-Qunused-arguments_-fPIC_-fPIE_-gdwarf-4_-Wall/timingleaks/crypto_kem/rqc256/ref/work/./rbc.h:40: multiple definition of `RBC_SQR_LOOKUP_TABLE'; libcrypto_kem_rqc256.a(kem.o):.../supercop-data/cubi10/amd64/try/c/clang_-mcpu=native_-O3_-fwrapv_-Qunused-arguments_-fPIC_-fPIE_-gdwarf-4_-Wall/timingleaks/crypto_kem/rqc256/ref/work/./rbc.h:40: first defined here
try.c: /usr/bin/ld: libcrypto_kem_rqc256.a(gabidulin.o):.../supercop-data/cubi10/amd64/try/c/clang_-mcpu=native_-O3_-fwrapv_-Qunused-arguments_-fPIC_-fPIE_-gdwarf-4_-Wall/timingleaks/crypto_kem/rqc256/ref/work/./rbc.h:40: multiple definition of `RBC_SQR_LOOKUP_TABLE'; libcrypto_kem_rqc256.a(kem.o):.../supercop-data/cubi10/amd64/try/c/clang_-mcpu=native_-O3_-fwrapv_-Qunused-arguments_-fPIC_-fPIE_-gdwarf-4_-Wall/timingleaks/crypto_kem/rqc256/ref/work/./rbc.h:40: first defined here
try.c: /usr/bin/ld: libcrypto_kem_rqc256.a(qpoly.o):.../supercop-data/cubi10/amd64/try/c/clang_-mcpu=native_-O3_-fwrapv_-Qunused-arguments_-fPIC_-fPIE_-gdwarf-4_-Wall/timingleaks/crypto_kem/rqc256/ref/work/./rbc.h:40: multiple definition of `RBC_SQR_LOOKUP_TABLE'; libcrypto_kem_rqc256.a(kem.o):.../supercop-data/cubi10/amd64/try/c/clang_-mcpu=native_-O3_-fwrapv_-Qunused-arguments_-fPIC_-fPIE_-gdwarf-4_-Wall/timingleaks/crypto_kem/rqc256/ref/work/./rbc.h:40: first defined here
try.c: /usr/bin/ld: libcrypto_kem_rqc256.a(rbc_poly.o):.../supercop-data/cubi10/amd64/try/c/clang_-mcpu=native_-O3_-fwrapv_-Qunused-arguments_-fPIC_-fPIE_-gdwarf-4_-Wall/timingleaks/crypto_kem/rqc256/ref/work/./rbc.h:40: multiple definition of `RBC_SQR_LOOKUP_TABLE'; libcrypto_kem_rqc256.a(kem.o):.../supercop-data/cubi10/amd64/try/c/clang_-mcpu=native_-O3_-fwrapv_-Qunused-arguments_-fPIC_-fPIE_-gdwarf-4_-Wall/timingleaks/crypto_kem/rqc256/ref/work/./rbc.h:40: first defined here
try.c: clang: error: linker command failed with exit code 1 (use -v to see invocation)

Number of similar (implementation,compiler) pairs: 1, namely:
ImplementationCompiler
T:refclang -mcpu=native -O3 -fwrapv -Qunused-arguments -fPIC -fPIE -gdwarf-4 -Wall (Debian_Clang_11.0.1)

Compiler output


try.c: /usr/bin/ld: libcrypto_kem_rqc256.a(parsing.o):.../supercop-data/cubi10/amd64/try/c/gcc_-march=native_-mtune=native_-O2_-fwrapv_-fPIC_-fPIE_-gdwarf-4_-Wall/timingleaks/crypto_kem/rqc256/ref/work/rbc.h:40: multiple definition of `RBC_SQR_LOOKUP_TABLE'; libcrypto_kem_rqc256.a(kem.o):.../supercop-data/cubi10/amd64/try/c/gcc_-march=native_-mtune=native_-O2_-fwrapv_-fPIC_-fPIE_-gdwarf-4_-Wall/timingleaks/crypto_kem/rqc256/ref/work/rbc.h:40: first defined here
try.c: /usr/bin/ld: libcrypto_kem_rqc256.a(rbc_elt.o):.../supercop-data/cubi10/amd64/try/c/gcc_-march=native_-mtune=native_-O2_-fwrapv_-fPIC_-fPIE_-gdwarf-4_-Wall/timingleaks/crypto_kem/rqc256/ref/work/rbc.h:40: multiple definition of `RBC_SQR_LOOKUP_TABLE'; libcrypto_kem_rqc256.a(kem.o):.../supercop-data/cubi10/amd64/try/c/gcc_-march=native_-mtune=native_-O2_-fwrapv_-fPIC_-fPIE_-gdwarf-4_-Wall/timingleaks/crypto_kem/rqc256/ref/work/rbc.h:40: first defined here
try.c: /usr/bin/ld: libcrypto_kem_rqc256.a(rbc_qre.o):.../supercop-data/cubi10/amd64/try/c/gcc_-march=native_-mtune=native_-O2_-fwrapv_-fPIC_-fPIE_-gdwarf-4_-Wall/timingleaks/crypto_kem/rqc256/ref/work/rbc.h:40: multiple definition of `RBC_SQR_LOOKUP_TABLE'; libcrypto_kem_rqc256.a(kem.o):.../supercop-data/cubi10/amd64/try/c/gcc_-march=native_-mtune=native_-O2_-fwrapv_-fPIC_-fPIE_-gdwarf-4_-Wall/timingleaks/crypto_kem/rqc256/ref/work/rbc.h:40: first defined here
try.c: /usr/bin/ld: libcrypto_kem_rqc256.a(rbc_vec.o):.../supercop-data/cubi10/amd64/try/c/gcc_-march=native_-mtune=native_-O2_-fwrapv_-fPIC_-fPIE_-gdwarf-4_-Wall/timingleaks/crypto_kem/rqc256/ref/work/rbc.h:40: multiple definition of `RBC_SQR_LOOKUP_TABLE'; libcrypto_kem_rqc256.a(kem.o):.../supercop-data/cubi10/amd64/try/c/gcc_-march=native_-mtune=native_-O2_-fwrapv_-fPIC_-fPIE_-gdwarf-4_-Wall/timingleaks/crypto_kem/rqc256/ref/work/rbc.h:40: first defined here
try.c: /usr/bin/ld: libcrypto_kem_rqc256.a(rbc_vspace.o):.../supercop-data/cubi10/amd64/try/c/gcc_-march=native_-mtune=native_-O2_-fwrapv_-fPIC_-fPIE_-gdwarf-4_-Wall/timingleaks/crypto_kem/rqc256/ref/work/rbc.h:40: multiple definition of `RBC_SQR_LOOKUP_TABLE'; libcrypto_kem_rqc256.a(kem.o):.../supercop-data/cubi10/amd64/try/c/gcc_-march=native_-mtune=native_-O2_-fwrapv_-fPIC_-fPIE_-gdwarf-4_-Wall/timingleaks/crypto_kem/rqc256/ref/work/rbc.h:40: first defined here
try.c: /usr/bin/ld: libcrypto_kem_rqc256.a(rqc.o):.../supercop-data/cubi10/amd64/try/c/gcc_-march=native_-mtune=native_-O2_-fwrapv_-fPIC_-fPIE_-gdwarf-4_-Wall/timingleaks/crypto_kem/rqc256/ref/work/rbc.h:40: multiple definition of `RBC_SQR_LOOKUP_TABLE'; libcrypto_kem_rqc256.a(kem.o):.../supercop-data/cubi10/amd64/try/c/gcc_-march=native_-mtune=native_-O2_-fwrapv_-fPIC_-fPIE_-gdwarf-4_-Wall/timingleaks/crypto_kem/rqc256/ref/work/rbc.h:40: first defined here
try.c: /usr/bin/ld: libcrypto_kem_rqc256.a(gabidulin.o):.../supercop-data/cubi10/amd64/try/c/gcc_-march=native_-mtune=native_-O2_-fwrapv_-fPIC_-fPIE_-gdwarf-4_-Wall/timingleaks/crypto_kem/rqc256/ref/work/rbc.h:40: multiple definition of `RBC_SQR_LOOKUP_TABLE'; libcrypto_kem_rqc256.a(kem.o):.../supercop-data/cubi10/amd64/try/c/gcc_-march=native_-mtune=native_-O2_-fwrapv_-fPIC_-fPIE_-gdwarf-4_-Wall/timingleaks/crypto_kem/rqc256/ref/work/rbc.h:40: first defined here
try.c: /usr/bin/ld: libcrypto_kem_rqc256.a(qpoly.o):.../supercop-data/cubi10/amd64/try/c/gcc_-march=native_-mtune=native_-O2_-fwrapv_-fPIC_-fPIE_-gdwarf-4_-Wall/timingleaks/crypto_kem/rqc256/ref/work/rbc.h:40: multiple definition of `RBC_SQR_LOOKUP_TABLE'; libcrypto_kem_rqc256.a(kem.o):.../supercop-data/cubi10/amd64/try/c/gcc_-march=native_-mtune=native_-O2_-fwrapv_-fPIC_-fPIE_-gdwarf-4_-Wall/timingleaks/crypto_kem/rqc256/ref/work/rbc.h:40: first defined here
try.c: /usr/bin/ld: libcrypto_kem_rqc256.a(rbc_poly.o):.../supercop-data/cubi10/amd64/try/c/gcc_-march=native_-mtune=native_-O2_-fwrapv_-fPIC_-fPIE_-gdwarf-4_-Wall/timingleaks/crypto_kem/rqc256/ref/work/rbc.h:40: multiple definition of `RBC_SQR_LOOKUP_TABLE'; libcrypto_kem_rqc256.a(kem.o):.../supercop-data/cubi10/amd64/try/c/gcc_-march=native_-mtune=native_-O2_-fwrapv_-fPIC_-fPIE_-gdwarf-4_-Wall/timingleaks/crypto_kem/rqc256/ref/work/rbc.h:40: first defined here
try.c: collect2: error: ld returned 1 exit status

Number of similar (implementation,compiler) pairs: 1, namely:
ImplementationCompiler
T:refgcc -march=native -mtune=native -O2 -fwrapv -fPIC -fPIE -gdwarf-4 -Wall (10.2.1_20210110)

Compiler output


try.c: /usr/bin/ld: libcrypto_kem_rqc256.a(parsing.o):.../supercop-data/cubi10/amd64/try/c/gcc_-march=native_-mtune=native_-O3_-fwrapv_-fPIC_-fPIE_-gdwarf-4_-Wall/timingleaks/crypto_kem/rqc256/ref/work/rbc.h:40: multiple definition of `RBC_SQR_LOOKUP_TABLE'; libcrypto_kem_rqc256.a(kem.o):.../supercop-data/cubi10/amd64/try/c/gcc_-march=native_-mtune=native_-O3_-fwrapv_-fPIC_-fPIE_-gdwarf-4_-Wall/timingleaks/crypto_kem/rqc256/ref/work/rbc.h:40: first defined here
try.c: /usr/bin/ld: libcrypto_kem_rqc256.a(rbc_elt.o):.../supercop-data/cubi10/amd64/try/c/gcc_-march=native_-mtune=native_-O3_-fwrapv_-fPIC_-fPIE_-gdwarf-4_-Wall/timingleaks/crypto_kem/rqc256/ref/work/rbc.h:40: multiple definition of `RBC_SQR_LOOKUP_TABLE'; libcrypto_kem_rqc256.a(kem.o):.../supercop-data/cubi10/amd64/try/c/gcc_-march=native_-mtune=native_-O3_-fwrapv_-fPIC_-fPIE_-gdwarf-4_-Wall/timingleaks/crypto_kem/rqc256/ref/work/rbc.h:40: first defined here
try.c: /usr/bin/ld: libcrypto_kem_rqc256.a(rbc_qre.o):.../supercop-data/cubi10/amd64/try/c/gcc_-march=native_-mtune=native_-O3_-fwrapv_-fPIC_-fPIE_-gdwarf-4_-Wall/timingleaks/crypto_kem/rqc256/ref/work/rbc.h:40: multiple definition of `RBC_SQR_LOOKUP_TABLE'; libcrypto_kem_rqc256.a(kem.o):.../supercop-data/cubi10/amd64/try/c/gcc_-march=native_-mtune=native_-O3_-fwrapv_-fPIC_-fPIE_-gdwarf-4_-Wall/timingleaks/crypto_kem/rqc256/ref/work/rbc.h:40: first defined here
try.c: /usr/bin/ld: libcrypto_kem_rqc256.a(rbc_vec.o):.../supercop-data/cubi10/amd64/try/c/gcc_-march=native_-mtune=native_-O3_-fwrapv_-fPIC_-fPIE_-gdwarf-4_-Wall/timingleaks/crypto_kem/rqc256/ref/work/rbc.h:40: multiple definition of `RBC_SQR_LOOKUP_TABLE'; libcrypto_kem_rqc256.a(kem.o):.../supercop-data/cubi10/amd64/try/c/gcc_-march=native_-mtune=native_-O3_-fwrapv_-fPIC_-fPIE_-gdwarf-4_-Wall/timingleaks/crypto_kem/rqc256/ref/work/rbc.h:40: first defined here
try.c: /usr/bin/ld: libcrypto_kem_rqc256.a(rbc_vspace.o):.../supercop-data/cubi10/amd64/try/c/gcc_-march=native_-mtune=native_-O3_-fwrapv_-fPIC_-fPIE_-gdwarf-4_-Wall/timingleaks/crypto_kem/rqc256/ref/work/rbc.h:40: multiple definition of `RBC_SQR_LOOKUP_TABLE'; libcrypto_kem_rqc256.a(kem.o):.../supercop-data/cubi10/amd64/try/c/gcc_-march=native_-mtune=native_-O3_-fwrapv_-fPIC_-fPIE_-gdwarf-4_-Wall/timingleaks/crypto_kem/rqc256/ref/work/rbc.h:40: first defined here
try.c: /usr/bin/ld: libcrypto_kem_rqc256.a(rqc.o):.../supercop-data/cubi10/amd64/try/c/gcc_-march=native_-mtune=native_-O3_-fwrapv_-fPIC_-fPIE_-gdwarf-4_-Wall/timingleaks/crypto_kem/rqc256/ref/work/rbc.h:40: multiple definition of `RBC_SQR_LOOKUP_TABLE'; libcrypto_kem_rqc256.a(kem.o):.../supercop-data/cubi10/amd64/try/c/gcc_-march=native_-mtune=native_-O3_-fwrapv_-fPIC_-fPIE_-gdwarf-4_-Wall/timingleaks/crypto_kem/rqc256/ref/work/rbc.h:40: first defined here
try.c: /usr/bin/ld: libcrypto_kem_rqc256.a(gabidulin.o):.../supercop-data/cubi10/amd64/try/c/gcc_-march=native_-mtune=native_-O3_-fwrapv_-fPIC_-fPIE_-gdwarf-4_-Wall/timingleaks/crypto_kem/rqc256/ref/work/rbc.h:40: multiple definition of `RBC_SQR_LOOKUP_TABLE'; libcrypto_kem_rqc256.a(kem.o):.../supercop-data/cubi10/amd64/try/c/gcc_-march=native_-mtune=native_-O3_-fwrapv_-fPIC_-fPIE_-gdwarf-4_-Wall/timingleaks/crypto_kem/rqc256/ref/work/rbc.h:40: first defined here
try.c: /usr/bin/ld: libcrypto_kem_rqc256.a(qpoly.o):.../supercop-data/cubi10/amd64/try/c/gcc_-march=native_-mtune=native_-O3_-fwrapv_-fPIC_-fPIE_-gdwarf-4_-Wall/timingleaks/crypto_kem/rqc256/ref/work/rbc.h:40: multiple definition of `RBC_SQR_LOOKUP_TABLE'; libcrypto_kem_rqc256.a(kem.o):.../supercop-data/cubi10/amd64/try/c/gcc_-march=native_-mtune=native_-O3_-fwrapv_-fPIC_-fPIE_-gdwarf-4_-Wall/timingleaks/crypto_kem/rqc256/ref/work/rbc.h:40: first defined here
try.c: /usr/bin/ld: libcrypto_kem_rqc256.a(rbc_poly.o):.../supercop-data/cubi10/amd64/try/c/gcc_-march=native_-mtune=native_-O3_-fwrapv_-fPIC_-fPIE_-gdwarf-4_-Wall/timingleaks/crypto_kem/rqc256/ref/work/rbc.h:40: multiple definition of `RBC_SQR_LOOKUP_TABLE'; libcrypto_kem_rqc256.a(kem.o):.../supercop-data/cubi10/amd64/try/c/gcc_-march=native_-mtune=native_-O3_-fwrapv_-fPIC_-fPIE_-gdwarf-4_-Wall/timingleaks/crypto_kem/rqc256/ref/work/rbc.h:40: first defined here
try.c: collect2: error: ld returned 1 exit status

Number of similar (implementation,compiler) pairs: 1, namely:
ImplementationCompiler
T:refgcc -march=native -mtune=native -O3 -fwrapv -fPIC -fPIE -gdwarf-4 -Wall (10.2.1_20210110)

Compiler output


try.c: /usr/bin/ld: libcrypto_kem_rqc256.a(parsing.o):.../supercop-data/cubi10/amd64/try/c/gcc_-march=native_-mtune=native_-O_-fwrapv_-fPIC_-fPIE_-gdwarf-4_-Wall/timingleaks/crypto_kem/rqc256/ref/work/rbc.h:40: multiple definition of `RBC_SQR_LOOKUP_TABLE'; libcrypto_kem_rqc256.a(kem.o):.../supercop-data/cubi10/amd64/try/c/gcc_-march=native_-mtune=native_-O_-fwrapv_-fPIC_-fPIE_-gdwarf-4_-Wall/timingleaks/crypto_kem/rqc256/ref/work/rbc.h:40: first defined here
try.c: /usr/bin/ld: libcrypto_kem_rqc256.a(rbc_elt.o):.../supercop-data/cubi10/amd64/try/c/gcc_-march=native_-mtune=native_-O_-fwrapv_-fPIC_-fPIE_-gdwarf-4_-Wall/timingleaks/crypto_kem/rqc256/ref/work/rbc.h:40: multiple definition of `RBC_SQR_LOOKUP_TABLE'; libcrypto_kem_rqc256.a(kem.o):.../supercop-data/cubi10/amd64/try/c/gcc_-march=native_-mtune=native_-O_-fwrapv_-fPIC_-fPIE_-gdwarf-4_-Wall/timingleaks/crypto_kem/rqc256/ref/work/rbc.h:40: first defined here
try.c: /usr/bin/ld: libcrypto_kem_rqc256.a(rbc_qre.o):.../supercop-data/cubi10/amd64/try/c/gcc_-march=native_-mtune=native_-O_-fwrapv_-fPIC_-fPIE_-gdwarf-4_-Wall/timingleaks/crypto_kem/rqc256/ref/work/rbc.h:40: multiple definition of `RBC_SQR_LOOKUP_TABLE'; libcrypto_kem_rqc256.a(kem.o):.../supercop-data/cubi10/amd64/try/c/gcc_-march=native_-mtune=native_-O_-fwrapv_-fPIC_-fPIE_-gdwarf-4_-Wall/timingleaks/crypto_kem/rqc256/ref/work/rbc.h:40: first defined here
try.c: /usr/bin/ld: libcrypto_kem_rqc256.a(rbc_vec.o):.../supercop-data/cubi10/amd64/try/c/gcc_-march=native_-mtune=native_-O_-fwrapv_-fPIC_-fPIE_-gdwarf-4_-Wall/timingleaks/crypto_kem/rqc256/ref/work/rbc.h:40: multiple definition of `RBC_SQR_LOOKUP_TABLE'; libcrypto_kem_rqc256.a(kem.o):.../supercop-data/cubi10/amd64/try/c/gcc_-march=native_-mtune=native_-O_-fwrapv_-fPIC_-fPIE_-gdwarf-4_-Wall/timingleaks/crypto_kem/rqc256/ref/work/rbc.h:40: first defined here
try.c: /usr/bin/ld: libcrypto_kem_rqc256.a(rbc_vspace.o):.../supercop-data/cubi10/amd64/try/c/gcc_-march=native_-mtune=native_-O_-fwrapv_-fPIC_-fPIE_-gdwarf-4_-Wall/timingleaks/crypto_kem/rqc256/ref/work/rbc.h:40: multiple definition of `RBC_SQR_LOOKUP_TABLE'; libcrypto_kem_rqc256.a(kem.o):.../supercop-data/cubi10/amd64/try/c/gcc_-march=native_-mtune=native_-O_-fwrapv_-fPIC_-fPIE_-gdwarf-4_-Wall/timingleaks/crypto_kem/rqc256/ref/work/rbc.h:40: first defined here
try.c: /usr/bin/ld: libcrypto_kem_rqc256.a(rqc.o):.../supercop-data/cubi10/amd64/try/c/gcc_-march=native_-mtune=native_-O_-fwrapv_-fPIC_-fPIE_-gdwarf-4_-Wall/timingleaks/crypto_kem/rqc256/ref/work/rbc.h:40: multiple definition of `RBC_SQR_LOOKUP_TABLE'; libcrypto_kem_rqc256.a(kem.o):.../supercop-data/cubi10/amd64/try/c/gcc_-march=native_-mtune=native_-O_-fwrapv_-fPIC_-fPIE_-gdwarf-4_-Wall/timingleaks/crypto_kem/rqc256/ref/work/rbc.h:40: first defined here
try.c: /usr/bin/ld: libcrypto_kem_rqc256.a(gabidulin.o):.../supercop-data/cubi10/amd64/try/c/gcc_-march=native_-mtune=native_-O_-fwrapv_-fPIC_-fPIE_-gdwarf-4_-Wall/timingleaks/crypto_kem/rqc256/ref/work/rbc.h:40: multiple definition of `RBC_SQR_LOOKUP_TABLE'; libcrypto_kem_rqc256.a(kem.o):.../supercop-data/cubi10/amd64/try/c/gcc_-march=native_-mtune=native_-O_-fwrapv_-fPIC_-fPIE_-gdwarf-4_-Wall/timingleaks/crypto_kem/rqc256/ref/work/rbc.h:40: first defined here
try.c: /usr/bin/ld: libcrypto_kem_rqc256.a(qpoly.o):.../supercop-data/cubi10/amd64/try/c/gcc_-march=native_-mtune=native_-O_-fwrapv_-fPIC_-fPIE_-gdwarf-4_-Wall/timingleaks/crypto_kem/rqc256/ref/work/rbc.h:40: multiple definition of `RBC_SQR_LOOKUP_TABLE'; libcrypto_kem_rqc256.a(kem.o):.../supercop-data/cubi10/amd64/try/c/gcc_-march=native_-mtune=native_-O_-fwrapv_-fPIC_-fPIE_-gdwarf-4_-Wall/timingleaks/crypto_kem/rqc256/ref/work/rbc.h:40: first defined here
try.c: /usr/bin/ld: libcrypto_kem_rqc256.a(rbc_poly.o):.../supercop-data/cubi10/amd64/try/c/gcc_-march=native_-mtune=native_-O_-fwrapv_-fPIC_-fPIE_-gdwarf-4_-Wall/timingleaks/crypto_kem/rqc256/ref/work/rbc.h:40: multiple definition of `RBC_SQR_LOOKUP_TABLE'; libcrypto_kem_rqc256.a(kem.o):.../supercop-data/cubi10/amd64/try/c/gcc_-march=native_-mtune=native_-O_-fwrapv_-fPIC_-fPIE_-gdwarf-4_-Wall/timingleaks/crypto_kem/rqc256/ref/work/rbc.h:40: first defined here
try.c: collect2: error: ld returned 1 exit status

Number of similar (implementation,compiler) pairs: 1, namely:
ImplementationCompiler
T:refgcc -march=native -mtune=native -O -fwrapv -fPIC -fPIE -gdwarf-4 -Wall (10.2.1_20210110)

Compiler output


try.c: /usr/bin/ld: libcrypto_kem_rqc256.a(parsing.o):.../supercop-data/cubi10/amd64/try/c/gcc_-march=native_-mtune=native_-Os_-fwrapv_-fPIC_-fPIE_-gdwarf-4_-Wall/timingleaks/crypto_kem/rqc256/ref/work/rbc.h:40: multiple definition of `RBC_SQR_LOOKUP_TABLE'; libcrypto_kem_rqc256.a(kem.o):.../supercop-data/cubi10/amd64/try/c/gcc_-march=native_-mtune=native_-Os_-fwrapv_-fPIC_-fPIE_-gdwarf-4_-Wall/timingleaks/crypto_kem/rqc256/ref/work/rbc.h:40: first defined here
try.c: /usr/bin/ld: libcrypto_kem_rqc256.a(rbc_elt.o):.../supercop-data/cubi10/amd64/try/c/gcc_-march=native_-mtune=native_-Os_-fwrapv_-fPIC_-fPIE_-gdwarf-4_-Wall/timingleaks/crypto_kem/rqc256/ref/work/rbc.h:40: multiple definition of `RBC_SQR_LOOKUP_TABLE'; libcrypto_kem_rqc256.a(kem.o):.../supercop-data/cubi10/amd64/try/c/gcc_-march=native_-mtune=native_-Os_-fwrapv_-fPIC_-fPIE_-gdwarf-4_-Wall/timingleaks/crypto_kem/rqc256/ref/work/rbc.h:40: first defined here
try.c: /usr/bin/ld: libcrypto_kem_rqc256.a(rbc_qre.o):.../supercop-data/cubi10/amd64/try/c/gcc_-march=native_-mtune=native_-Os_-fwrapv_-fPIC_-fPIE_-gdwarf-4_-Wall/timingleaks/crypto_kem/rqc256/ref/work/rbc.h:40: multiple definition of `RBC_SQR_LOOKUP_TABLE'; libcrypto_kem_rqc256.a(kem.o):.../supercop-data/cubi10/amd64/try/c/gcc_-march=native_-mtune=native_-Os_-fwrapv_-fPIC_-fPIE_-gdwarf-4_-Wall/timingleaks/crypto_kem/rqc256/ref/work/rbc.h:40: first defined here
try.c: /usr/bin/ld: libcrypto_kem_rqc256.a(rbc_vec.o):.../supercop-data/cubi10/amd64/try/c/gcc_-march=native_-mtune=native_-Os_-fwrapv_-fPIC_-fPIE_-gdwarf-4_-Wall/timingleaks/crypto_kem/rqc256/ref/work/rbc.h:40: multiple definition of `RBC_SQR_LOOKUP_TABLE'; libcrypto_kem_rqc256.a(kem.o):.../supercop-data/cubi10/amd64/try/c/gcc_-march=native_-mtune=native_-Os_-fwrapv_-fPIC_-fPIE_-gdwarf-4_-Wall/timingleaks/crypto_kem/rqc256/ref/work/rbc.h:40: first defined here
try.c: /usr/bin/ld: libcrypto_kem_rqc256.a(rbc_vspace.o):.../supercop-data/cubi10/amd64/try/c/gcc_-march=native_-mtune=native_-Os_-fwrapv_-fPIC_-fPIE_-gdwarf-4_-Wall/timingleaks/crypto_kem/rqc256/ref/work/rbc.h:40: multiple definition of `RBC_SQR_LOOKUP_TABLE'; libcrypto_kem_rqc256.a(kem.o):.../supercop-data/cubi10/amd64/try/c/gcc_-march=native_-mtune=native_-Os_-fwrapv_-fPIC_-fPIE_-gdwarf-4_-Wall/timingleaks/crypto_kem/rqc256/ref/work/rbc.h:40: first defined here
try.c: /usr/bin/ld: libcrypto_kem_rqc256.a(rqc.o):.../supercop-data/cubi10/amd64/try/c/gcc_-march=native_-mtune=native_-Os_-fwrapv_-fPIC_-fPIE_-gdwarf-4_-Wall/timingleaks/crypto_kem/rqc256/ref/work/rbc.h:40: multiple definition of `RBC_SQR_LOOKUP_TABLE'; libcrypto_kem_rqc256.a(kem.o):.../supercop-data/cubi10/amd64/try/c/gcc_-march=native_-mtune=native_-Os_-fwrapv_-fPIC_-fPIE_-gdwarf-4_-Wall/timingleaks/crypto_kem/rqc256/ref/work/rbc.h:40: first defined here
try.c: /usr/bin/ld: libcrypto_kem_rqc256.a(gabidulin.o):.../supercop-data/cubi10/amd64/try/c/gcc_-march=native_-mtune=native_-Os_-fwrapv_-fPIC_-fPIE_-gdwarf-4_-Wall/timingleaks/crypto_kem/rqc256/ref/work/rbc.h:40: multiple definition of `RBC_SQR_LOOKUP_TABLE'; libcrypto_kem_rqc256.a(kem.o):.../supercop-data/cubi10/amd64/try/c/gcc_-march=native_-mtune=native_-Os_-fwrapv_-fPIC_-fPIE_-gdwarf-4_-Wall/timingleaks/crypto_kem/rqc256/ref/work/rbc.h:40: first defined here
try.c: /usr/bin/ld: libcrypto_kem_rqc256.a(qpoly.o):.../supercop-data/cubi10/amd64/try/c/gcc_-march=native_-mtune=native_-Os_-fwrapv_-fPIC_-fPIE_-gdwarf-4_-Wall/timingleaks/crypto_kem/rqc256/ref/work/rbc.h:40: multiple definition of `RBC_SQR_LOOKUP_TABLE'; libcrypto_kem_rqc256.a(kem.o):.../supercop-data/cubi10/amd64/try/c/gcc_-march=native_-mtune=native_-Os_-fwrapv_-fPIC_-fPIE_-gdwarf-4_-Wall/timingleaks/crypto_kem/rqc256/ref/work/rbc.h:40: first defined here
try.c: /usr/bin/ld: libcrypto_kem_rqc256.a(rbc_poly.o):.../supercop-data/cubi10/amd64/try/c/gcc_-march=native_-mtune=native_-Os_-fwrapv_-fPIC_-fPIE_-gdwarf-4_-Wall/timingleaks/crypto_kem/rqc256/ref/work/rbc.h:40: multiple definition of `RBC_SQR_LOOKUP_TABLE'; libcrypto_kem_rqc256.a(kem.o):.../supercop-data/cubi10/amd64/try/c/gcc_-march=native_-mtune=native_-Os_-fwrapv_-fPIC_-fPIE_-gdwarf-4_-Wall/timingleaks/crypto_kem/rqc256/ref/work/rbc.h:40: first defined here
try.c: collect2: error: ld returned 1 exit status

Number of similar (implementation,compiler) pairs: 1, namely:
ImplementationCompiler
T:refgcc -march=native -mtune=native -Os -fwrapv -fPIC -fPIE -gdwarf-4 -Wall (10.2.1_20210110)