Implementation notes: amd64, cubi10, crypto_hash/echo512

Computer: cubi10
Microarchitecture: amd64; Comet Lake (806ec)
Architecture: amd64
CPU ID: GenuineIntel-000806ec-bfebfbff
SUPERCOP version: 20240425
Operation: crypto_hash
Primitive: echo512
TimeObject sizeTest sizeImplementationCompilerBenchmark dateSUPERCOP version
7078321215 0 031734 804 888T:ccalik/vpermclang_-march=native_-O_-fomit-frame-pointer_-fwrapv_-Qunused-arguments_-fPIC_-fPIE2024042620240425
7115921586 0 031862 804 888T:ccalik/aesniclang_-march=native_-Os_-fomit-frame-pointer_-fwrapv_-Qunused-arguments_-fPIC_-fPIE2024042620240425
7118121215 0 031734 804 888T:ccalik/aesniclang_-march=native_-O_-fomit-frame-pointer_-fwrapv_-Qunused-arguments_-fPIC_-fPIE2024042620240425
7125121586 0 031862 804 888T:ccalik/vpermclang_-march=native_-Os_-fomit-frame-pointer_-fwrapv_-Qunused-arguments_-fPIC_-fPIE2024042620240425
7216625093 0 038600 812 920T:ccalik/aesniclang_-march=native_-O2_-fomit-frame-pointer_-fwrapv_-Qunused-arguments_-fPIC_-fPIE2024042620240425
7238325093 0 038600 812 920T:ccalik/vpermclang_-march=native_-O2_-fomit-frame-pointer_-fwrapv_-Qunused-arguments_-fPIC_-fPIE2024042620240425
7250626805 0 040344 812 920T:ccalik/aesniclang_-march=native_-O3_-fomit-frame-pointer_-fwrapv_-Qunused-arguments_-fPIC_-fPIE2024042620240425
7358224737 0 037792 780 952T:ccalik/aesnigcc_-march=native_-mtune=native_-O3_-fomit-frame-pointer_-fwrapv_-fPIC_-fPIE2024042620240425
7474820708 0 031776 780 952T:ccalik/aesnigcc_-march=native_-mtune=native_-O2_-fomit-frame-pointer_-fwrapv_-fPIC_-fPIE2024042620240425
7477926805 0 040344 812 920T:ccalik/vpermclang_-march=native_-O3_-fomit-frame-pointer_-fwrapv_-Qunused-arguments_-fPIC_-fPIE2024042620240425
7511620708 0 031776 780 952T:ccalik/vpermgcc_-march=native_-mtune=native_-O2_-fomit-frame-pointer_-fwrapv_-fPIC_-fPIE2024042620240425
7533424737 0 037792 780 952T:ccalik/vpermgcc_-march=native_-mtune=native_-O3_-fomit-frame-pointer_-fwrapv_-fPIC_-fPIE2024042620240425
7565220562 0 031176 780 952T:ccalik/vpermgcc_-march=native_-mtune=native_-O_-fomit-frame-pointer_-fwrapv_-fPIC_-fPIE2024042620240425
7572520562 0 031176 780 952T:ccalik/aesnigcc_-march=native_-mtune=native_-O_-fomit-frame-pointer_-fwrapv_-fPIC_-fPIE2024042620240425
7740914665 0 024934 804 888T:ccalik/bitslicedclang_-march=native_-Os_-fomit-frame-pointer_-fwrapv_-Qunused-arguments_-fPIC_-fPIE2024042620240425
7760219574 0 029155 756 920T:ccalik/aesnigcc_-march=native_-mtune=native_-Os_-fomit-frame-pointer_-fwrapv_-fPIC_-fPIE2024042620240425
7764526880 0 036587 756 920T:sphlibgcc_-march=native_-mtune=native_-Os_-fomit-frame-pointer_-fwrapv_-fPIC_-fPIE2024042620240425
7772218093 0 031632 812 920T:ccalik/bitslicedclang_-march=native_-O3_-fomit-frame-pointer_-fwrapv_-Qunused-arguments_-fPIC_-fPIE2024042620240425
7805419574 0 029155 756 920T:ccalik/vpermgcc_-march=native_-mtune=native_-Os_-fomit-frame-pointer_-fwrapv_-fPIC_-fPIE2024042620240425
7818215358 0 025976 780 952T:ccalik/bitslicedgcc_-march=native_-mtune=native_-O_-fomit-frame-pointer_-fwrapv_-fPIC_-fPIE2024042620240425
7839416965 0 030472 812 920T:ccalik/bitslicedclang_-march=native_-O2_-fomit-frame-pointer_-fwrapv_-Qunused-arguments_-fPIC_-fPIE2024042620240425
8007431280 0 044424 780 952T:sphlibgcc_-march=native_-mtune=native_-O3_-fomit-frame-pointer_-fwrapv_-fPIC_-fPIE2024042620240425
8032028695 0 039888 780 952T:sphlibgcc_-march=native_-mtune=native_-O2_-fomit-frame-pointer_-fwrapv_-fPIC_-fPIE2024042620240425
8080120308 0 131408 780 984T:generic/opt64gcc_-march=native_-mtune=native_-O2_-fomit-frame-pointer_-fwrapv_-fPIC_-fPIE2024042620240425
8143628043 0 038784 780 952T:sphlibgcc_-march=native_-mtune=native_-O_-fomit-frame-pointer_-fwrapv_-fPIC_-fPIE2024042620240425
8191820864 0 130475 756 952T:generic/opt64gcc_-march=native_-mtune=native_-Os_-fomit-frame-pointer_-fwrapv_-fPIC_-fPIE2024042620240425
8313628867 0 042456 812 920T:sphlibclang_-march=native_-O2_-fomit-frame-pointer_-fwrapv_-Qunused-arguments_-fPIC_-fPIE2024042620240425
8335921676 0 134736 780 984T:generic/opt64gcc_-march=native_-mtune=native_-O3_-fomit-frame-pointer_-fwrapv_-fPIC_-fPIE2024042620240425
8345920237 0 130880 780 984T:generic/opt64gcc_-march=native_-mtune=native_-O_-fomit-frame-pointer_-fwrapv_-fPIC_-fPIE2024042620240425
8471816284 0 027352 780 952T:ccalik/bitslicedgcc_-march=native_-mtune=native_-O2_-fomit-frame-pointer_-fwrapv_-fPIC_-fPIE2024042620240425
8514514248 0 027432 780 952T:sphlib-smallgcc_-march=native_-mtune=native_-O3_-fomit-frame-pointer_-fwrapv_-fPIC_-fPIE2024042620240425
8544917873 0 030928 780 952T:ccalik/bitslicedgcc_-march=native_-mtune=native_-O3_-fomit-frame-pointer_-fwrapv_-fPIC_-fPIE2024042620240425
8553028643 0 041544 812 888T:sphlibclang_-mcpu=native_-O3_-fomit-frame-pointer_-fwrapv_-Qunused-arguments_-fPIC_-fPIE2024042620240425
8594015679 0 025267 756 920T:ccalik/bitslicedgcc_-march=native_-mtune=native_-Os_-fomit-frame-pointer_-fwrapv_-fPIC_-fPIE2024042620240425
8605029222 0 042920 812 920T:sphlibclang_-march=native_-O3_-fomit-frame-pointer_-fwrapv_-Qunused-arguments_-fPIC_-fPIE2024042620240425
8769428337 0 038998 804 888T:sphlibclang_-march=native_-O_-fomit-frame-pointer_-fwrapv_-Qunused-arguments_-fPIC_-fPIE2024042620240425
8773316287 0 026806 804 888T:ccalik/bitslicedclang_-march=native_-O_-fomit-frame-pointer_-fwrapv_-Qunused-arguments_-fPIC_-fPIE2024042620240425
898039344 0 019067 756 920T:sphlib-smallgcc_-march=native_-mtune=native_-Os_-fomit-frame-pointer_-fwrapv_-fPIC_-fPIE2024042620240425
9224713261 0 026200 812 888T:sphlib-smallclang_-mcpu=native_-O3_-fomit-frame-pointer_-fwrapv_-Qunused-arguments_-fPIC_-fPIE2024042620240425
9247713225 0 026952 812 920T:sphlib-smallclang_-march=native_-O3_-fomit-frame-pointer_-fwrapv_-Qunused-arguments_-fPIC_-fPIE2024042620240425
9253612969 0 026600 812 920T:sphlib-smallclang_-march=native_-O2_-fomit-frame-pointer_-fwrapv_-Qunused-arguments_-fPIC_-fPIE2024042620240425
9308510879 0 022088 780 952T:sphlib-smallgcc_-march=native_-mtune=native_-O2_-fomit-frame-pointer_-fwrapv_-fPIC_-fPIE2024042620240425
9395917740 0 1627371 756 952T:generic/opt32gcc_-march=native_-mtune=native_-Os_-fomit-frame-pointer_-fwrapv_-fPIC_-fPIE2024042620240425
9445310359 0 021112 780 952T:sphlib-smallgcc_-march=native_-mtune=native_-O_-fomit-frame-pointer_-fwrapv_-fPIC_-fPIE2024042620240425
9462922778 0 132894 804 888T:generic/opt64clang_-march=native_-Os_-fomit-frame-pointer_-fwrapv_-Qunused-arguments_-fPIC_-fPIE2024042620240425
9609619428 0 1630544 780 984T:generic/opt32gcc_-march=native_-mtune=native_-O2_-fomit-frame-pointer_-fwrapv_-fPIC_-fPIE2024042620240425
9683427568 0 037918 804 888T:sphlibclang_-march=native_-Os_-fomit-frame-pointer_-fwrapv_-Qunused-arguments_-fPIC_-fPIE2024042620240425
9919122065 0 1635704 812 920T:generic/opt32clang_-march=native_-O3_-fomit-frame-pointer_-fwrapv_-Qunused-arguments_-fPIC_-fPIE2024042620240425
9921122008 0 1635560 812 920T:generic/opt32clang_-march=native_-O2_-fomit-frame-pointer_-fwrapv_-Qunused-arguments_-fPIC_-fPIE2024042620240425
9941222127 0 1634968 812 920T:generic/opt32clang_-mcpu=native_-O3_-fomit-frame-pointer_-fwrapv_-Qunused-arguments_-fPIC_-fPIE2024042620240425
10010818772 0 1629416 780 984T:generic/opt32gcc_-march=native_-mtune=native_-O_-fomit-frame-pointer_-fwrapv_-fPIC_-fPIE2024042620240425
10184523480 0 134014 804 888T:generic/opt64clang_-march=native_-O_-fomit-frame-pointer_-fwrapv_-Qunused-arguments_-fPIC_-fPIE2024042620240425
10465926880 0 139720 812 888T:generic/opt64clang_-mcpu=native_-O3_-fomit-frame-pointer_-fwrapv_-Qunused-arguments_-fPIC_-fPIE2024042620240425
1057449673 0 020366 804 888T:sphlib-smallclang_-march=native_-O_-fomit-frame-pointer_-fwrapv_-Qunused-arguments_-fPIC_-fPIE2024042620240425
10740827825 0 1641464 812 920T:powerpc/pp32cv2clang_-march=native_-O3_-fomit-frame-pointer_-fwrapv_-Qunused-arguments_-fPIC_-fPIE2024042620240425
10752224564 0 1637640 780 984T:generic/opt32gcc_-march=native_-mtune=native_-O3_-fomit-frame-pointer_-fwrapv_-fPIC_-fPIE2024042620240425
10759627800 0 1641352 812 920T:powerpc/pp32cv2clang_-march=native_-O2_-fomit-frame-pointer_-fwrapv_-Qunused-arguments_-fPIC_-fPIE2024042620240425
1090128996 0 019398 804 888T:sphlib-smallclang_-march=native_-Os_-fomit-frame-pointer_-fwrapv_-Qunused-arguments_-fPIC_-fPIE2024042620240425
11044318080 0 1628622 804 920T:generic/opt32clang_-march=native_-O_-fomit-frame-pointer_-fwrapv_-Qunused-arguments_-fPIC_-fPIE2024042620240425
11204424304 0 137864 812 920T:generic/opt64clang_-march=native_-O3_-fomit-frame-pointer_-fwrapv_-Qunused-arguments_-fPIC_-fPIE2024042620240425
11374924462 0 138024 812 920T:generic/opt64clang_-march=native_-O2_-fomit-frame-pointer_-fwrapv_-Qunused-arguments_-fPIC_-fPIE2024042620240425
11664724847 0 1634854 804 920T:powerpc/pp32cv2clang_-march=native_-Os_-fomit-frame-pointer_-fwrapv_-Qunused-arguments_-fPIC_-fPIE2024042620240425
11831920673 0 1630678 804 920T:generic/opt32clang_-march=native_-Os_-fomit-frame-pointer_-fwrapv_-Qunused-arguments_-fPIC_-fPIE2024042620240425
11903528639 0 1641480 812 920T:powerpc/pp32cv2clang_-mcpu=native_-O3_-fomit-frame-pointer_-fwrapv_-Qunused-arguments_-fPIC_-fPIE2024042620240425
13621523968 0 1634510 804 920T:powerpc/pp32cv2clang_-march=native_-O_-fomit-frame-pointer_-fwrapv_-Qunused-arguments_-fPIC_-fPIE2024042620240425
14304825733 0 1635355 756 952T:powerpc/pp32cv2gcc_-march=native_-mtune=native_-Os_-fomit-frame-pointer_-fwrapv_-fPIC_-fPIE2024042620240425
14565921455 0 1634296 812 920T:powerpc/pp32cv1clang_-mcpu=native_-O3_-fomit-frame-pointer_-fwrapv_-Qunused-arguments_-fPIC_-fPIE2024042620240425
14775832916 0 1645992 780 984T:powerpc/pp32cv2gcc_-march=native_-mtune=native_-O3_-fomit-frame-pointer_-fwrapv_-fPIC_-fPIE2024042620240425
15374827587 0 1638232 780 984T:powerpc/pp32cv2gcc_-march=native_-mtune=native_-O_-fomit-frame-pointer_-fwrapv_-fPIC_-fPIE2024042620240425
15642728548 0 1639664 780 984T:powerpc/pp32cv2gcc_-march=native_-mtune=native_-O2_-fomit-frame-pointer_-fwrapv_-fPIC_-fPIE2024042620240425
15691625241 0 1638880 812 920T:powerpc/pp32cv1clang_-march=native_-O3_-fomit-frame-pointer_-fwrapv_-Qunused-arguments_-fPIC_-fPIE2024042620240425
15762225216 0 1638768 812 920T:powerpc/pp32cv1clang_-march=native_-O2_-fomit-frame-pointer_-fwrapv_-Qunused-arguments_-fPIC_-fPIE2024042620240425
16812523571 0 1633534 804 920T:powerpc/pp32cv1clang_-march=native_-Os_-fomit-frame-pointer_-fwrapv_-Qunused-arguments_-fPIC_-fPIE2024042620240425
16863717264 0 1627806 804 920T:powerpc/pp32cv1clang_-march=native_-O_-fomit-frame-pointer_-fwrapv_-Qunused-arguments_-fPIC_-fPIE2024042620240425
17368118052 0 1629168 780 984T:powerpc/pp32cv1gcc_-march=native_-mtune=native_-O2_-fomit-frame-pointer_-fwrapv_-fPIC_-fPIE2024042620240425
17631221364 0 1634440 780 984T:powerpc/pp32cv1gcc_-march=native_-mtune=native_-O3_-fomit-frame-pointer_-fwrapv_-fPIC_-fPIE2024042620240425
18198817662 0 1628312 780 984T:powerpc/pp32cv1gcc_-march=native_-mtune=native_-O_-fomit-frame-pointer_-fwrapv_-fPIC_-fPIE2024042620240425
18422416556 0 1626187 756 952T:powerpc/pp32cv1gcc_-march=native_-mtune=native_-Os_-fomit-frame-pointer_-fwrapv_-fPIC_-fPIE2024042620240425

Compiler output

Implementation: T:aes/aes64
Security model: timingleaks
Compiler: clang -march=native -O2 -fomit-frame-pointer -fwrapv -Qunused-arguments -fPIC -fPIE
echo64.S: echo64.S:1064:2: error: '.att_syntax noprefix' is not supported: registers must have a '%' prefix in .att_syntax
echo64.S: .att_syntax noprefix
echo64.S: ^
echo64.S: echo64.S:1077:10: error: unknown token in expression
echo64.S: movabsq $-9187201950435737472, %rax
echo64.S: ^
echo64.S: echo64.S:1078:10: error: unknown token in expression
echo64.S: movabsq $-9187201950435737472, %r11
echo64.S: ^
echo64.S: echo64.S:1079:10: error: unknown token in expression
echo64.S: movabsq $7599940337074203, %r10
echo64.S: ^
echo64.S: echo64.S:1080:7: error: unknown token in expression
echo64.S: movq %rax, MEM_CST+16(%rip)
echo64.S: ^
echo64.S: echo64.S:1081:10: error: unknown token in expression
echo64.S: movabsq $7599940337074203, %r9
echo64.S: ^
echo64.S: echo64.S:1082:10: error: unknown token in expression
echo64.S: movabsq $-72340172838076674, %rax
echo64.S: ^
echo64.S: echo64.S:1083:10: error: unknown token in expression
echo64.S: movabsq $72340172838076673, %r8
echo64.S: ^
echo64.S: echo64.S:1084:10: error: unknown token in expression
echo64.S: ...

Number of similar (compiler,implementation) pairs: 5, namely:
CompilerImplementations
clang -march=native -O2 -fomit-frame-pointer -fwrapv -Qunused-arguments -fPIC -fPIE T:aes/aes64
clang -march=native -O3 -fomit-frame-pointer -fwrapv -Qunused-arguments -fPIC -fPIE T:aes/aes64
clang -march=native -O -fomit-frame-pointer -fwrapv -Qunused-arguments -fPIC -fPIE T:aes/aes64
clang -march=native -Os -fomit-frame-pointer -fwrapv -Qunused-arguments -fPIC -fPIE T:aes/aes64
clang -mcpu=native -O3 -fomit-frame-pointer -fwrapv -Qunused-arguments -fPIC -fPIE T:aes/aes64

Compiler output

Implementation: T:aes/aes64
Security model: timingleaks
Compiler: gcc -march=native -mtune=native -O2 -fomit-frame-pointer -fwrapv -fPIC -fPIE
try.c: /usr/bin/ld: libcrypto_hash_echo512.a(echo64.o): relocation R_X86_64_32S against symbol `OLDCV' can not be used when making a PIE object; recompile with -fPIE
try.c: collect2: error: ld returned 1 exit status

Number of similar (compiler,implementation) pairs: 4, namely:
CompilerImplementations
gcc -march=native -mtune=native -O2 -fomit-frame-pointer -fwrapv -fPIC -fPIE T:aes/aes64
gcc -march=native -mtune=native -O3 -fomit-frame-pointer -fwrapv -fPIC -fPIE T:aes/aes64
gcc -march=native -mtune=native -O -fomit-frame-pointer -fwrapv -fPIC -fPIE T:aes/aes64
gcc -march=native -mtune=native -Os -fomit-frame-pointer -fwrapv -fPIC -fPIE T:aes/aes64

Compiler output

Implementation: T:athlon/athlon64
Security model: timingleaks
Compiler: clang -march=native -O2 -fomit-frame-pointer -fwrapv -Qunused-arguments -fPIC -fPIE
echo64.S: echo64.S:248:2: error: invalid instruction mnemonic 'movzbl'
echo64.S: movzbl ebp, ah
echo64.S: ^~~~~~
echo64.S: echo64.S:251:2: error: invalid instruction mnemonic 'movzbl'
echo64.S: movzbl esi, al
echo64.S: ^~~~~~
echo64.S: echo64.S:263:2: error: invalid instruction mnemonic 'movzbl'
echo64.S: movzbl ebp, bl
echo64.S: ^~~~~~
echo64.S: echo64.S:266:2: error: invalid instruction mnemonic 'movzbl'
echo64.S: movzbl esi, bh
echo64.S: ^~~~~~
echo64.S: echo64.S:278:2: error: invalid instruction mnemonic 'movzbl'
echo64.S: movzbl ebp, al
echo64.S: ^~~~~~
echo64.S: echo64.S:281:2: error: invalid instruction mnemonic 'movzbl'
echo64.S: movzbl esi, ah
echo64.S: ^~~~~~
echo64.S: echo64.S:293:2: error: invalid instruction mnemonic 'movzbl'
echo64.S: movzbl ebp, bh
echo64.S: ^~~~~~
echo64.S: echo64.S:296:2: error: invalid instruction mnemonic 'movzbl'
echo64.S: movzbl esi, bl
echo64.S: ^~~~~~
echo64.S: echo64.S:308:2: error: invalid instruction mnemonic 'movzbl'
echo64.S: ...

Number of similar (compiler,implementation) pairs: 5, namely:
CompilerImplementations
clang -march=native -O2 -fomit-frame-pointer -fwrapv -Qunused-arguments -fPIC -fPIE T:athlon/athlon64
clang -march=native -O3 -fomit-frame-pointer -fwrapv -Qunused-arguments -fPIC -fPIE T:athlon/athlon64
clang -march=native -O -fomit-frame-pointer -fwrapv -Qunused-arguments -fPIC -fPIE T:athlon/athlon64
clang -march=native -Os -fomit-frame-pointer -fwrapv -Qunused-arguments -fPIC -fPIE T:athlon/athlon64
clang -mcpu=native -O3 -fomit-frame-pointer -fwrapv -Qunused-arguments -fPIC -fPIE T:athlon/athlon64

Compiler output

Implementation: T:athlon/athlon64
Security model: timingleaks
Compiler: gcc -march=native -mtune=native -O2 -fomit-frame-pointer -fwrapv -fPIC -fPIE
echo64.S: echo64.c: Assembler messages:
echo64.S: echo64.c:519: Error: no such instruction: `movzbl ebp,ah'
echo64.S: echo64.c:519: Error: no such instruction: `movzbl esi,al'
echo64.S: echo64.c:519: Error: no such instruction: `movzbl ebp,bl'
echo64.S: echo64.c:519: Error: no such instruction: `movzbl esi,bh'
echo64.S: echo64.c:519: Error: no such instruction: `movzbl ebp,al'
echo64.S: echo64.c:519: Error: no such instruction: `movzbl esi,ah'
echo64.S: echo64.c:519: Error: no such instruction: `movzbl ebp,bh'
echo64.S: echo64.c:519: Error: no such instruction: `movzbl esi,bl'
echo64.S: echo64.c:519: Error: no such instruction: `movzbl ebp,ah'
echo64.S: echo64.c:519: Error: no such instruction: `movzbl esi,al'
echo64.S: echo64.c:519: Error: no such instruction: `movzbl ebp,bl'
echo64.S: echo64.c:519: Error: no such instruction: `movzbl esi,bh'
echo64.S: echo64.c:519: Error: no such instruction: `movzbl ebp,al'
echo64.S: echo64.c:519: Error: no such instruction: `movzbl esi,ah'
echo64.S: echo64.c:519: Error: no such instruction: `movzbl ebp,bl'
echo64.S: echo64.c:519: Error: no such instruction: `movzbl esi,bh'
echo64.S: echo64.c:519: Error: no such instruction: `movzbl ebp,dl'
echo64.S: echo64.c:519: Error: no such instruction: `movzbl esi,dh'
echo64.S: echo64.c:519: Error: no such instruction: `movzbl ebp,ch'
echo64.S: echo64.c:519: Error: no such instruction: `movzbl esi,cl'
echo64.S: echo64.c:519: Error: no such instruction: `movzbl ebp,cl'
echo64.S: echo64.c:519: Error: no such instruction: `movzbl esi,ch'
echo64.S: echo64.c:519: Error: no such instruction: `movzbl ebp,dh'
echo64.S: echo64.c:519: Error: no such instruction: `movzbl esi,dl'
echo64.S: ...

Number of similar (compiler,implementation) pairs: 4, namely:
CompilerImplementations
gcc -march=native -mtune=native -O2 -fomit-frame-pointer -fwrapv -fPIC -fPIE T:athlon/athlon64
gcc -march=native -mtune=native -O3 -fomit-frame-pointer -fwrapv -fPIC -fPIE T:athlon/athlon64
gcc -march=native -mtune=native -O -fomit-frame-pointer -fwrapv -fPIC -fPIE T:athlon/athlon64
gcc -march=native -mtune=native -Os -fomit-frame-pointer -fwrapv -fPIC -fPIE T:athlon/athlon64

Compiler output

Implementation: T:ccalik/aesni
Security model: timingleaks
Compiler: clang -mcpu=native -O3 -fomit-frame-pointer -fwrapv -Qunused-arguments -fPIC -fPIE
hash.c: hash.c:263:4: error: always_inline function '_mm_shuffle_epi8' requires target feature 'ssse3', but would be inlined into function 'Compress' that is compiled without support for 'ssse3'
hash.c: TRANSFORM(_state[i][j], _k_ipt, t1, t2);
hash.c: ^
hash.c: ./vperm.h:52:7: note: expanded from macro 'TRANSFORM'
hash.c: t1 = _mm_shuffle_epi8(*((__m128i*)table + 1), t1);\
hash.c: ^
hash.c: hash.c:263:4: error: always_inline function '_mm_shuffle_epi8' requires target feature 'ssse3', but would be inlined into function 'Compress' that is compiled without support for 'ssse3'
hash.c: ./vperm.h:53:7: note: expanded from macro 'TRANSFORM'
hash.c: x = _mm_shuffle_epi8(*((__m128i*)table + 0), x);\
hash.c: ^
hash.c: hash.c:280:5: error: always_inline function '_mm_shuffle_epi8' requires target feature 'ssse3', but would be inlined into function 'Compress' that is compiled without support for 'ssse3'
hash.c: TRANSFORM(_state[i][j], _k_ipt, t1, t2);
hash.c: ^
hash.c: ./vperm.h:52:7: note: expanded from macro 'TRANSFORM'
hash.c: t1 = _mm_shuffle_epi8(*((__m128i*)table + 1), t1);\
hash.c: ^
hash.c: hash.c:280:5: error: always_inline function '_mm_shuffle_epi8' requires target feature 'ssse3', but would be inlined into function 'Compress' that is compiled without support for 'ssse3'
hash.c: ./vperm.h:53:7: note: expanded from macro 'TRANSFORM'
hash.c: x = _mm_shuffle_epi8(*((__m128i*)table + 0), x);\
hash.c: ^
hash.c: hash.c:305:4: error: always_inline function '_mm_shuffle_epi8' requires target feature 'ssse3', but would be inlined into function 'Compress' that is compiled without support for 'ssse3'
hash.c: ECHO_SUB_AND_MIX(_state, 0, 0, _state2, 0, 0, 1, 2, 3);
hash.c: ^
hash.c: hash.c:124:5: note: expanded from macro 'ECHO_SUB_AND_MIX'
hash.c: AES_ROUND_VPERM_CORE(state[i][j], t1, t2, t3, t4, s1, s2, s3);\
hash.c: ...

Number of similar (compiler,implementation) pairs: 2, namely:
CompilerImplementations
clang -mcpu=native -O3 -fomit-frame-pointer -fwrapv -Qunused-arguments -fPIC -fPIE T:ccalik/aesni T:ccalik/vperm

Compiler output

Implementation: T:ccalik/bitsliced
Security model: timingleaks
Compiler: clang -mcpu=native -O3 -fomit-frame-pointer -fwrapv -Qunused-arguments -fPIC -fPIE
hash.c: hash.c:468:4: error: always_inline function '_mm_shuffle_epi8' requires target feature 'ssse3', but would be inlined into function 'Compress' that is compiled without support for 'ssse3'
hash.c: AES_SHIFT_ROWS(_state);
hash.c: ^
hash.c: hash.c:141:14: note: expanded from macro 'AES_SHIFT_ROWS'
hash.c: s[0][0] = _mm_shuffle_epi8(s[0][0], M128(shiftrowsslice));\
hash.c: ^
hash.c: hash.c:468:4: error: always_inline function '_mm_shuffle_epi8' requires target feature 'ssse3', but would be inlined into function 'Compress' that is compiled without support for 'ssse3'
hash.c: hash.c:142:14: note: expanded from macro 'AES_SHIFT_ROWS'
hash.c: s[0][1] = _mm_shuffle_epi8(s[0][1], M128(shiftrowsslice));\
hash.c: ^
hash.c: hash.c:468:4: error: always_inline function '_mm_shuffle_epi8' requires target feature 'ssse3', but would be inlined into function 'Compress' that is compiled without support for 'ssse3'
hash.c: hash.c:143:14: note: expanded from macro 'AES_SHIFT_ROWS'
hash.c: s[0][2] = _mm_shuffle_epi8(s[0][2], M128(shiftrowsslice));\
hash.c: ^
hash.c: hash.c:468:4: error: always_inline function '_mm_shuffle_epi8' requires target feature 'ssse3', but would be inlined into function 'Compress' that is compiled without support for 'ssse3'
hash.c: hash.c:144:14: note: expanded from macro 'AES_SHIFT_ROWS'
hash.c: s[0][3] = _mm_shuffle_epi8(s[0][3], M128(shiftrowsslice));\
hash.c: ^
hash.c: hash.c:468:4: error: always_inline function '_mm_shuffle_epi8' requires target feature 'ssse3', but would be inlined into function 'Compress' that is compiled without support for 'ssse3'
hash.c: hash.c:145:14: note: expanded from macro 'AES_SHIFT_ROWS'
hash.c: s[1][0] = _mm_shuffle_epi8(s[1][0], M128(shiftrowsslice));\
hash.c: ^
hash.c: hash.c:468:4: error: always_inline function '_mm_shuffle_epi8' requires target feature 'ssse3', but would be inlined into function 'Compress' that is compiled without support for 'ssse3'
hash.c: hash.c:146:14: note: expanded from macro 'AES_SHIFT_ROWS'
hash.c: s[1][1] = _mm_shuffle_epi8(s[1][1], M128(shiftrowsslice));\
hash.c: ...

Number of similar (compiler,implementation) pairs: 1, namely:
CompilerImplementations
clang -mcpu=native -O3 -fomit-frame-pointer -fwrapv -Qunused-arguments -fPIC -fPIE T:ccalik/bitsliced

Compiler output

Implementation: T:core2/core2v64
Security model: timingleaks
Compiler: clang -march=native -O2 -fomit-frame-pointer -fwrapv -Qunused-arguments -fPIC -fPIE
echo64.S: echo64.S:224:2: error: invalid instruction mnemonic 'movzbl'
echo64.S: movzbl ebp, ah
echo64.S: ^~~~~~
echo64.S: echo64.S:230:2: error: invalid instruction mnemonic 'movzbl'
echo64.S: movzbl esi, al
echo64.S: ^~~~~~
echo64.S: echo64.S:239:2: error: invalid instruction mnemonic 'movzbl'
echo64.S: movzbl ebp, bl
echo64.S: ^~~~~~
echo64.S: echo64.S:245:2: error: invalid instruction mnemonic 'movzbl'
echo64.S: movzbl esi, bh
echo64.S: ^~~~~~
echo64.S: echo64.S:254:2: error: invalid instruction mnemonic 'movzbl'
echo64.S: movzbl ebp, al
echo64.S: ^~~~~~
echo64.S: echo64.S:260:2: error: invalid instruction mnemonic 'movzbl'
echo64.S: movzbl esi, ah
echo64.S: ^~~~~~
echo64.S: echo64.S:269:2: error: invalid instruction mnemonic 'movzbl'
echo64.S: movzbl ebp, bh
echo64.S: ^~~~~~
echo64.S: echo64.S:275:2: error: invalid instruction mnemonic 'movzbl'
echo64.S: movzbl esi, bl
echo64.S: ^~~~~~
echo64.S: echo64.S:284:2: error: invalid instruction mnemonic 'movzbl'
echo64.S: ...

Number of similar (compiler,implementation) pairs: 5, namely:
CompilerImplementations
clang -march=native -O2 -fomit-frame-pointer -fwrapv -Qunused-arguments -fPIC -fPIE T:core2/core2v64
clang -march=native -O3 -fomit-frame-pointer -fwrapv -Qunused-arguments -fPIC -fPIE T:core2/core2v64
clang -march=native -O -fomit-frame-pointer -fwrapv -Qunused-arguments -fPIC -fPIE T:core2/core2v64
clang -march=native -Os -fomit-frame-pointer -fwrapv -Qunused-arguments -fPIC -fPIE T:core2/core2v64
clang -mcpu=native -O3 -fomit-frame-pointer -fwrapv -Qunused-arguments -fPIC -fPIE T:core2/core2v64

Compiler output

Implementation: T:core2/core2v64
Security model: timingleaks
Compiler: gcc -march=native -mtune=native -O2 -fomit-frame-pointer -fwrapv -fPIC -fPIE
echo64.S: echo64.c: Assembler messages:
echo64.S: echo64.c:473: Error: no such instruction: `movzbl ebp,ah'
echo64.S: echo64.c:473: Error: no such instruction: `movzbl esi,al'
echo64.S: echo64.c:473: Error: no such instruction: `movzbl ebp,bl'
echo64.S: echo64.c:473: Error: no such instruction: `movzbl esi,bh'
echo64.S: echo64.c:473: Error: no such instruction: `movzbl ebp,al'
echo64.S: echo64.c:473: Error: no such instruction: `movzbl esi,ah'
echo64.S: echo64.c:473: Error: no such instruction: `movzbl ebp,bh'
echo64.S: echo64.c:473: Error: no such instruction: `movzbl esi,bl'
echo64.S: echo64.c:473: Error: no such instruction: `movzbl ebp,ah'
echo64.S: echo64.c:473: Error: no such instruction: `movzbl esi,al'
echo64.S: echo64.c:473: Error: no such instruction: `movzbl ebp,bl'
echo64.S: echo64.c:473: Error: no such instruction: `movzbl esi,bh'
echo64.S: echo64.c:473: Error: no such instruction: `movzbl ebp,al'
echo64.S: echo64.c:473: Error: no such instruction: `movzbl esi,ah'
echo64.S: echo64.c:473: Error: no such instruction: `movzbl ebp,bl'
echo64.S: echo64.c:473: Error: no such instruction: `movzbl esi,bh'
echo64.S: echo64.c:473: Error: no such instruction: `movzbl ebp,dl'
echo64.S: echo64.c:473: Error: no such instruction: `movzbl esi,dh'
echo64.S: echo64.c:473: Error: no such instruction: `movzbl ebp,ch'
echo64.S: echo64.c:473: Error: no such instruction: `movzbl esi,cl'
echo64.S: echo64.c:473: Error: no such instruction: `movzbl ebp,cl'
echo64.S: echo64.c:473: Error: no such instruction: `movzbl esi,ch'
echo64.S: echo64.c:473: Error: no such instruction: `movzbl ebp,dh'
echo64.S: echo64.c:473: Error: no such instruction: `movzbl esi,dl'
echo64.S: ...

Number of similar (compiler,implementation) pairs: 4, namely:
CompilerImplementations
gcc -march=native -mtune=native -O2 -fomit-frame-pointer -fwrapv -fPIC -fPIE T:core2/core2v64
gcc -march=native -mtune=native -O3 -fomit-frame-pointer -fwrapv -fPIC -fPIE T:core2/core2v64
gcc -march=native -mtune=native -O -fomit-frame-pointer -fwrapv -fPIC -fPIE T:core2/core2v64
gcc -march=native -mtune=native -Os -fomit-frame-pointer -fwrapv -fPIC -fPIE T:core2/core2v64

Compiler output

Implementation: T:generic/opt64
Security model: timingleaks
Compiler: clang -march=native -O2 -fomit-frame-pointer -fwrapv -Qunused-arguments -fPIC -fPIE
echo64.c: echo64.c:501:29: warning: passing 'const unsigned char *' to parameter of type 'BitSequence *' (aka 'unsigned char *') discards qualifiers [-Wincompatible-pointer-types-discards-qualifiers]
echo64.c: if (Hash(CRYPTO_BYTES * 8,in,inlen * 8,out) == SUCCESS) return 0;
echo64.c: ^~
echo64.c: echo64.c:488:46: note: passing argument to parameter 'data' here
echo64.c: HashReturn Hash(int hashbitlen, BitSequence *data, DataLength databitlen, BitSequence *hashval)
echo64.c: ^
echo64.c: 1 warning generated.

Number of similar (compiler,implementation) pairs: 5, namely:
CompilerImplementations
clang -march=native -O2 -fomit-frame-pointer -fwrapv -Qunused-arguments -fPIC -fPIE T:generic/opt64
clang -march=native -O3 -fomit-frame-pointer -fwrapv -Qunused-arguments -fPIC -fPIE T:generic/opt64
clang -march=native -O -fomit-frame-pointer -fwrapv -Qunused-arguments -fPIC -fPIE T:generic/opt64
clang -march=native -Os -fomit-frame-pointer -fwrapv -Qunused-arguments -fPIC -fPIE T:generic/opt64
clang -mcpu=native -O3 -fomit-frame-pointer -fwrapv -Qunused-arguments -fPIC -fPIE T:generic/opt64

Compiler output

Implementation: T:generic/opt64
Security model: timingleaks
Compiler: gcc -march=native -mtune=native -O2 -fomit-frame-pointer -fwrapv -fPIC -fPIE
echo64.c: echo64.c: In function 'crypto_hash_echo512_generic_opt64_timingleaks':
echo64.c: echo64.c:501:29: warning: passing argument 2 of 'Hash' discards 'const' qualifier from pointer target type [-Wdiscarded-qualifiers]
echo64.c: 501 | if (Hash(CRYPTO_BYTES * 8,in,inlen * 8,out) == SUCCESS) return 0;
echo64.c: | ^~
echo64.c: echo64.c:488:46: note: expected 'BitSequence *' {aka 'unsigned char *'} but argument is of type 'const unsigned char *'
echo64.c: 488 | HashReturn Hash(int hashbitlen, BitSequence *data, DataLength databitlen, BitSequence *hashval)
echo64.c: | ~~~~~~~~~~~~~^~~~

Number of similar (compiler,implementation) pairs: 4, namely:
CompilerImplementations
gcc -march=native -mtune=native -O2 -fomit-frame-pointer -fwrapv -fPIC -fPIE T:generic/opt64
gcc -march=native -mtune=native -O3 -fomit-frame-pointer -fwrapv -fPIC -fPIE T:generic/opt64
gcc -march=native -mtune=native -O -fomit-frame-pointer -fwrapv -fPIC -fPIE T:generic/opt64
gcc -march=native -mtune=native -Os -fomit-frame-pointer -fwrapv -fPIC -fPIE T:generic/opt64

Compiler output

Implementation: T:pentium/pentium4v64v1
Security model: timingleaks
Compiler: clang -march=native -O2 -fomit-frame-pointer -fwrapv -Qunused-arguments -fPIC -fPIE
echo32.S: echo32.S:323:2: error: invalid instruction mnemonic 'addd'
echo32.S: addd [SHA3_CNT], 1
echo32.S: ^~~~
echo32.S: echo32.S:587:2: error: invalid instruction mnemonic 'addd'
echo32.S: addd [SHA3_CNT], 1
echo32.S: ^~~~
echo32.S: echo32.S:851:2: error: invalid instruction mnemonic 'addd'
echo32.S: addd [SHA3_CNT], 1
echo32.S: ^~~~
echo32.S: echo32.S:1115:2: error: invalid instruction mnemonic 'addd'
echo32.S: addd [SHA3_CNT], 1
echo32.S: ^~~~
echo32.S: echo32.S:1379:2: error: invalid instruction mnemonic 'addd'
echo32.S: addd [SHA3_CNT], 1
echo32.S: ^~~~
echo32.S: echo32.S:1643:2: error: invalid instruction mnemonic 'addd'
echo32.S: addd [SHA3_CNT], 1
echo32.S: ^~~~
echo32.S: echo32.S:1907:2: error: invalid instruction mnemonic 'addd'
echo32.S: addd [SHA3_CNT], 1
echo32.S: ^~~~
echo32.S: echo32.S:2171:2: error: invalid instruction mnemonic 'addd'
echo32.S: addd [SHA3_CNT], 1
echo32.S: ^~~~
echo32.S: echo32.S:2435:2: error: invalid instruction mnemonic 'addd'
echo32.S: ...

Number of similar (compiler,implementation) pairs: 5, namely:
CompilerImplementations
clang -march=native -O2 -fomit-frame-pointer -fwrapv -Qunused-arguments -fPIC -fPIE T:pentium/pentium4v64v1
clang -march=native -O3 -fomit-frame-pointer -fwrapv -Qunused-arguments -fPIC -fPIE T:pentium/pentium4v64v1
clang -march=native -O -fomit-frame-pointer -fwrapv -Qunused-arguments -fPIC -fPIE T:pentium/pentium4v64v1
clang -march=native -Os -fomit-frame-pointer -fwrapv -Qunused-arguments -fPIC -fPIE T:pentium/pentium4v64v1
clang -mcpu=native -O3 -fomit-frame-pointer -fwrapv -Qunused-arguments -fPIC -fPIE T:pentium/pentium4v64v1

Compiler output

Implementation: T:pentium/pentium4v64v1
Security model: timingleaks
Compiler: gcc -march=native -mtune=native -O2 -fomit-frame-pointer -fwrapv -fPIC -fPIE
try.c: /usr/bin/ld: libcrypto_hash_echo512.a(echo32.o): relocation R_X86_64_32S against symbol `SHA3_R' can not be used when making a PIE object; recompile with -fPIE
try.c: collect2: error: ld returned 1 exit status

Number of similar (compiler,implementation) pairs: 4, namely:
CompilerImplementations
gcc -march=native -mtune=native -O2 -fomit-frame-pointer -fwrapv -fPIC -fPIE T:pentium/pentium4v64v1
gcc -march=native -mtune=native -O3 -fomit-frame-pointer -fwrapv -fPIC -fPIE T:pentium/pentium4v64v1
gcc -march=native -mtune=native -O -fomit-frame-pointer -fwrapv -fPIC -fPIE T:pentium/pentium4v64v1
gcc -march=native -mtune=native -Os -fomit-frame-pointer -fwrapv -fPIC -fPIE T:pentium/pentium4v64v1

Compiler output

Implementation: T:pentium/pentium4v64v2
Security model: timingleaks
Compiler: clang -march=native -O2 -fomit-frame-pointer -fwrapv -Qunused-arguments -fPIC -fPIE
echo64.S: echo64.S:371:2: error: invalid instruction mnemonic 'addd'
echo64.S: addd [SHA3_CNT], 1
echo64.S: ^~~~
echo64.S: echo64.S:635:2: error: invalid instruction mnemonic 'addd'
echo64.S: addd [SHA3_CNT], 1
echo64.S: ^~~~
echo64.S: echo64.S:899:2: error: invalid instruction mnemonic 'addd'
echo64.S: addd [SHA3_CNT], 1
echo64.S: ^~~~
echo64.S: echo64.S:1163:2: error: invalid instruction mnemonic 'addd'
echo64.S: addd [SHA3_CNT], 1
echo64.S: ^~~~
echo64.S: echo64.S:1427:2: error: invalid instruction mnemonic 'addd'
echo64.S: addd [SHA3_CNT], 1
echo64.S: ^~~~
echo64.S: echo64.S:1691:2: error: invalid instruction mnemonic 'addd'
echo64.S: addd [SHA3_CNT], 1
echo64.S: ^~~~
echo64.S: echo64.S:1955:2: error: invalid instruction mnemonic 'addd'
echo64.S: addd [SHA3_CNT], 1
echo64.S: ^~~~
echo64.S: echo64.S:2219:2: error: invalid instruction mnemonic 'addd'
echo64.S: addd [SHA3_CNT], 1
echo64.S: ^~~~
echo64.S: echo64.S:2483:2: error: invalid instruction mnemonic 'addd'
echo64.S: ...

Number of similar (compiler,implementation) pairs: 5, namely:
CompilerImplementations
clang -march=native -O2 -fomit-frame-pointer -fwrapv -Qunused-arguments -fPIC -fPIE T:pentium/pentium4v64v2
clang -march=native -O3 -fomit-frame-pointer -fwrapv -Qunused-arguments -fPIC -fPIE T:pentium/pentium4v64v2
clang -march=native -O -fomit-frame-pointer -fwrapv -Qunused-arguments -fPIC -fPIE T:pentium/pentium4v64v2
clang -march=native -Os -fomit-frame-pointer -fwrapv -Qunused-arguments -fPIC -fPIE T:pentium/pentium4v64v2
clang -mcpu=native -O3 -fomit-frame-pointer -fwrapv -Qunused-arguments -fPIC -fPIE T:pentium/pentium4v64v2

Compiler output

Implementation: T:pentium/pentium4v64v2
Security model: timingleaks
Compiler: gcc -march=native -mtune=native -O2 -fomit-frame-pointer -fwrapv -fPIC -fPIE
try.c: /usr/bin/ld: libcrypto_hash_echo512.a(echo64.o): relocation R_X86_64_32S against symbol `SHA3_R' can not be used when making a PIE object; recompile with -fPIE
try.c: collect2: error: ld returned 1 exit status

Number of similar (compiler,implementation) pairs: 4, namely:
CompilerImplementations
gcc -march=native -mtune=native -O2 -fomit-frame-pointer -fwrapv -fPIC -fPIE T:pentium/pentium4v64v2
gcc -march=native -mtune=native -O3 -fomit-frame-pointer -fwrapv -fPIC -fPIE T:pentium/pentium4v64v2
gcc -march=native -mtune=native -O -fomit-frame-pointer -fwrapv -fPIC -fPIE T:pentium/pentium4v64v2
gcc -march=native -mtune=native -Os -fomit-frame-pointer -fwrapv -fPIC -fPIE T:pentium/pentium4v64v2