Implementation notes: amd64, cubi10, crypto_hash/blake3

Computer: cubi10
Microarchitecture: amd64; Comet Lake (806ec)
Architecture: amd64
CPU ID: GenuineIntel-000806ec-bfebfbff
SUPERCOP version: 20240625
Operation: crypto_hash
Primitive: blake3
TimeObject sizeTest sizeImplementationCompilerBenchmark dateSUPERCOP version
519324082 0 036956 820 888T:avx2clang_-mcpu=native_-O3_-fwrapv_-Qunused-arguments_-fPIC_-fPIE_-gdwarf-4_-Wall2024062720240625
519423866 0 036936 788 952T:avx2gcc_-march=native_-mtune=native_-O3_-fwrapv_-fPIC_-fPIE_-gdwarf-4_-Wall2024062720240625
519514198 0 027036 820 888T:sse41clang_-mcpu=native_-O3_-fwrapv_-Qunused-arguments_-fPIC_-fPIE_-gdwarf-4_-Wall2024062720240625
519623048 0 033663 780 952T:avx2gcc_-march=native_-mtune=native_-O_-fwrapv_-fPIC_-fPIE_-gdwarf-4_-Wall2024062720240625
519723042 0 034120 788 952T:avx2gcc_-march=native_-mtune=native_-O2_-fwrapv_-fPIC_-fPIE_-gdwarf-4_-Wall2024062720240625
521322350 0 032019 764 920T:avx2gcc_-march=native_-mtune=native_-Os_-fwrapv_-fPIC_-fPIE_-gdwarf-4_-Wall2024062720240625
521424619 0 038236 820 920T:avx2clang_-march=native_-O3_-fwrapv_-Qunused-arguments_-fPIC_-fPIE_-gdwarf-4_-Wall2024062720240625
522022579 0 033170 812 888T:avx2clang_-march=native_-O_-fwrapv_-Qunused-arguments_-fPIC_-fPIE_-gdwarf-4_-Wall2024062720240625
522522425 0 032778 812 888T:avx2clang_-march=native_-Os_-fwrapv_-Qunused-arguments_-fPIC_-fPIE_-gdwarf-4_-Wall2024062720240625
538124619 0 038108 820 920T:avx2clang_-march=native_-O2_-fwrapv_-Qunused-arguments_-fPIC_-fPIE_-gdwarf-4_-Wall2024062720240625
774110075 0 022900 820 888T:portableclang_-mcpu=native_-O3_-fwrapv_-Qunused-arguments_-fPIC_-fPIE_-gdwarf-4_-Wall2024062720240625

Test failure


error 111

Number of similar (implementation,compiler) pairs: 9, namely:
ImplementationCompiler
T:avx512clang -march=native -O2 -fwrapv -Qunused-arguments -fPIC -fPIE -gdwarf-4 -Wall (Debian_Clang_11.0.1)
T:avx512clang -march=native -O3 -fwrapv -Qunused-arguments -fPIC -fPIE -gdwarf-4 -Wall (Debian_Clang_11.0.1)
T:avx512clang -march=native -O -fwrapv -Qunused-arguments -fPIC -fPIE -gdwarf-4 -Wall (Debian_Clang_11.0.1)
T:avx512clang -march=native -Os -fwrapv -Qunused-arguments -fPIC -fPIE -gdwarf-4 -Wall (Debian_Clang_11.0.1)
T:avx512clang -mcpu=native -O3 -fwrapv -Qunused-arguments -fPIC -fPIE -gdwarf-4 -Wall (Debian_Clang_11.0.1)
T:avx512gcc -march=native -mtune=native -O2 -fwrapv -fPIC -fPIE -gdwarf-4 -Wall (10.2.1_20210110)
T:avx512gcc -march=native -mtune=native -O3 -fwrapv -fPIC -fPIE -gdwarf-4 -Wall (10.2.1_20210110)
T:avx512gcc -march=native -mtune=native -O -fwrapv -fPIC -fPIE -gdwarf-4 -Wall (10.2.1_20210110)
T:avx512gcc -march=native -mtune=native -Os -fwrapv -fPIC -fPIE -gdwarf-4 -Wall (10.2.1_20210110)

Compiler output


blake3_neon.c: In file included from blake3_neon.c:3:
blake3_neon.c: /usr/lib/llvm-11/lib/clang/11.0.1/include/arm_neon.h:28:2: error: "NEON intrinsics not available with the soft-float ABI. Please use -mfloat-abi=softfp or -mfloat-abi=hard"
blake3_neon.c: #error "NEON intrinsics not available with the soft-float ABI. Please use -mfloat-abi=softfp or -mfloat-abi=hard"
blake3_neon.c:  ^
blake3_neon.c: blake3_neon.c:11:8: error: unknown type name 'uint32x4_t'; did you mean 'uint32_t'?
blake3_neon.c: INLINE uint32x4_t loadu_128(const uint8_t src[16]) {
blake3_neon.c:        ^~~~~~~~~~
blake3_neon.c:        uint32_t
blake3_neon.c: /usr/include/x86_64-linux-gnu/bits/stdint-uintn.h:26:20: note: 'uint32_t' declared here
blake3_neon.c: typedef __uint32_t uint32_t;
blake3_neon.c:                    ^
blake3_neon.c: blake3_neon.c:13:3: error: unknown type name 'uint32x4_t'; did you mean 'uint32_t'?
blake3_neon.c:   uint32x4_t x;
blake3_neon.c:   ^~~~~~~~~~
blake3_neon.c:   uint32_t
blake3_neon.c: /usr/include/x86_64-linux-gnu/bits/stdint-uintn.h:26:20: note: 'uint32_t' declared here
blake3_neon.c: typedef __uint32_t uint32_t;
blake3_neon.c:                    ^
blake3_neon.c: blake3_neon.c:14:3: warning: 'memcpy' will always overflow; destination buffer has size 4, but size argument is 16 [-Wfortify-source]
blake3_neon.c:   memcpy(&x, src, 16);
blake3_neon.c:   ^
blake3_neon.c: blake3_neon.c:18:24: error: unknown type name 'uint32x4_t'; did you mean 'uint32_t'?
blake3_neon.c: INLINE void storeu_128(uint32x4_t src, uint8_t dest[16]) {
blake3_neon.c:                        ^~~~~~~~~~
blake3_neon.c:                        uint32_t
blake3_neon.c: ...

Number of similar (implementation,compiler) pairs: 5, namely:
ImplementationCompiler
T:neonclang -march=native -O2 -fwrapv -Qunused-arguments -fPIC -fPIE -gdwarf-4 -Wall (Debian_Clang_11.0.1)
T:neonclang -march=native -O3 -fwrapv -Qunused-arguments -fPIC -fPIE -gdwarf-4 -Wall (Debian_Clang_11.0.1)
T:neonclang -march=native -O -fwrapv -Qunused-arguments -fPIC -fPIE -gdwarf-4 -Wall (Debian_Clang_11.0.1)
T:neonclang -march=native -Os -fwrapv -Qunused-arguments -fPIC -fPIE -gdwarf-4 -Wall (Debian_Clang_11.0.1)
T:neonclang -mcpu=native -O3 -fwrapv -Qunused-arguments -fPIC -fPIE -gdwarf-4 -Wall (Debian_Clang_11.0.1)

Compiler output


blake3_neon.c: blake3_neon.c:3:10: fatal error: arm_neon.h: No such file or directory
blake3_neon.c:     3 | #include <arm_neon.h>
blake3_neon.c:       |          ^~~~~~~~~~~~
blake3_neon.c: compilation terminated.

Number of similar (implementation,compiler) pairs: 4, namely:
ImplementationCompiler
T:neongcc -march=native -mtune=native -O2 -fwrapv -fPIC -fPIE -gdwarf-4 -Wall (10.2.1_20210110)
T:neongcc -march=native -mtune=native -O3 -fwrapv -fPIC -fPIE -gdwarf-4 -Wall (10.2.1_20210110)
T:neongcc -march=native -mtune=native -O -fwrapv -fPIC -fPIE -gdwarf-4 -Wall (10.2.1_20210110)
T:neongcc -march=native -mtune=native -Os -fwrapv -fPIC -fPIE -gdwarf-4 -Wall (10.2.1_20210110)

Compiler output


blake3.c: In file included from blake3.c:12:
blake3.c: ./blake3_static_dispatch.h:8:2: error: "there are wider implementations on this platform; fail the build"
blake3.c: #error "there are wider implementations on this platform; fail the build"
blake3.c:  ^
blake3.c: 1 error generated.

Number of similar (implementation,compiler) pairs: 8, namely:
ImplementationCompiler
T:portableclang -march=native -O2 -fwrapv -Qunused-arguments -fPIC -fPIE -gdwarf-4 -Wall (Debian_Clang_11.0.1)
T:portableclang -march=native -O3 -fwrapv -Qunused-arguments -fPIC -fPIE -gdwarf-4 -Wall (Debian_Clang_11.0.1)
T:portableclang -march=native -O -fwrapv -Qunused-arguments -fPIC -fPIE -gdwarf-4 -Wall (Debian_Clang_11.0.1)
T:portableclang -march=native -Os -fwrapv -Qunused-arguments -fPIC -fPIE -gdwarf-4 -Wall (Debian_Clang_11.0.1)
T:sse41clang -march=native -O2 -fwrapv -Qunused-arguments -fPIC -fPIE -gdwarf-4 -Wall (Debian_Clang_11.0.1)
T:sse41clang -march=native -O3 -fwrapv -Qunused-arguments -fPIC -fPIE -gdwarf-4 -Wall (Debian_Clang_11.0.1)
T:sse41clang -march=native -O -fwrapv -Qunused-arguments -fPIC -fPIE -gdwarf-4 -Wall (Debian_Clang_11.0.1)
T:sse41clang -march=native -Os -fwrapv -Qunused-arguments -fPIC -fPIE -gdwarf-4 -Wall (Debian_Clang_11.0.1)

Compiler output


blake3.c: In file included from blake3.c:12:
blake3.c: blake3_static_dispatch.h:8:2: error: #error "there are wider implementations on this platform; fail the build"
blake3.c:     8 | #error "there are wider implementations on this platform; fail the build"
blake3.c:       |  ^~~~~

Number of similar (implementation,compiler) pairs: 8, namely:
ImplementationCompiler
T:portablegcc -march=native -mtune=native -O2 -fwrapv -fPIC -fPIE -gdwarf-4 -Wall (10.2.1_20210110)
T:portablegcc -march=native -mtune=native -O3 -fwrapv -fPIC -fPIE -gdwarf-4 -Wall (10.2.1_20210110)
T:portablegcc -march=native -mtune=native -O -fwrapv -fPIC -fPIE -gdwarf-4 -Wall (10.2.1_20210110)
T:portablegcc -march=native -mtune=native -Os -fwrapv -fPIC -fPIE -gdwarf-4 -Wall (10.2.1_20210110)
T:sse41gcc -march=native -mtune=native -O2 -fwrapv -fPIC -fPIE -gdwarf-4 -Wall (10.2.1_20210110)
T:sse41gcc -march=native -mtune=native -O3 -fwrapv -fPIC -fPIE -gdwarf-4 -Wall (10.2.1_20210110)
T:sse41gcc -march=native -mtune=native -O -fwrapv -fPIC -fPIE -gdwarf-4 -Wall (10.2.1_20210110)
T:sse41gcc -march=native -mtune=native -Os -fwrapv -fPIC -fPIE -gdwarf-4 -Wall (10.2.1_20210110)