Implementation notes: amd64, comet, crypto_stream/simon128256ctr

Computer: comet
Microarchitecture: amd64; CometLake (806ec)
Architecture: amd64
CPU ID: GenuineIntel-000806ec-bfebfbff
SUPERCOP version: 20221025
Operation: crypto_stream
Primitive: simon128256ctr
TimeObject sizeTest sizeImplementationCompilerBenchmark dateSUPERCOP version
5838142941 0 0158842 812 968T:avx2clang_-march=native_-O2_-fomit-frame-pointer_-fwrapv_-Qunused-arguments_-fPIC_-fPIE2021011520210114
5844143413 0 0159474 812 968T:avx2clang_-march=native_-O3_-fomit-frame-pointer_-fwrapv_-Qunused-arguments_-fPIC_-fPIE2021011520210114
5847142941 0 0158842 812 968T:avx2clang_-march=native_-O_-fomit-frame-pointer_-fwrapv_-Qunused-arguments_-fPIC_-fPIE2021011520210114
5865148734 0 0164583 828 1000T:avx2gcc_-march=native_-mtune=native_-O3_-fomit-frame-pointer_-fwrapv_-fPIC_-fPIE2021011520210114
8576141253 0 0153480 804 968T:avx2clang_-march=native_-Os_-fomit-frame-pointer_-fwrapv_-Qunused-arguments_-fPIC_-fPIE2021011520210114
8642140820 0 0153886 820 1000T:avx2gcc_-march=native_-mtune=native_-O_-fomit-frame-pointer_-fwrapv_-fPIC_-fPIE2021011520210114
8973140546 0 0153814 820 1000T:avx2gcc_-march=native_-mtune=native_-O2_-fomit-frame-pointer_-fwrapv_-fPIC_-fPIE2021011520210114
9044133494 0 0149642 812 968T:sse4clang_-march=native_-O3_-fomit-frame-pointer_-fwrapv_-Qunused-arguments_-fPIC_-fPIE2021011520210114
9058132998 0 0149002 812 968T:sse4clang_-march=native_-O2_-fomit-frame-pointer_-fwrapv_-Qunused-arguments_-fPIC_-fPIE2021011520210114
9074132998 0 0149002 812 968T:sse4clang_-march=native_-O_-fomit-frame-pointer_-fwrapv_-Qunused-arguments_-fPIC_-fPIE2021011520210114
9124137248 0 0153079 828 1000T:sse4gcc_-march=native_-mtune=native_-O3_-fomit-frame-pointer_-fwrapv_-fPIC_-fPIE2021011520210114
13688137752 0 0150790 820 1000T:sse4gcc_-march=native_-mtune=native_-O_-fomit-frame-pointer_-fwrapv_-fPIC_-fPIE2021011520210114
14726135563 0 0147936 804 968T:sse4clang_-march=native_-Os_-fomit-frame-pointer_-fwrapv_-Qunused-arguments_-fPIC_-fPIE2021011520210114
14727136760 0 0149998 820 1000T:sse4gcc_-march=native_-mtune=native_-O2_-fomit-frame-pointer_-fwrapv_-fPIC_-fPIE2021011520210114
16090135989 0 0147970 804 968T:sse4gcc_-march=native_-mtune=native_-Os_-fomit-frame-pointer_-fwrapv_-fPIC_-fPIE2021011520210114

Compiler output

Implementation: T:avx2
Security model: timingleaks
Compiler: clang -mcpu=native -O3 -fomit-frame-pointer -fwrapv -Qunused-arguments -fPIC -fPIE
stream.c: stream.c:128:3: error: always_inline function '_mm256_set_epi64x' requires target feature 'avx', but would be inlined into function 'Encrypt' that is compiled without support for 'avx'
stream.c: SET1(X[0],nonce[1]); SET4(Y[0],nonce[0]);
stream.c: ^
stream.c: ./Intrinsics_AVX2_128block.h:25:22: note: expanded from macro 'SET1'
stream.c: #define SET1(X,c) (X=SET(c,c,c,c))
stream.c: ^
stream.c: ./Intrinsics_AVX2_128block.h:24:13: note: expanded from macro 'SET'
stream.c: #define SET _mm256_set_epi64x
stream.c: ^
stream.c: stream.c:128:24: error: always_inline function '_mm256_set_epi64x' requires target feature 'avx', but would be inlined into function 'Encrypt' that is compiled without support for 'avx'
stream.c: SET1(X[0],nonce[1]); SET4(Y[0],nonce[0]);
stream.c: ^
stream.c: ./Intrinsics_AVX2_128block.h:26:22: note: expanded from macro 'SET4'
stream.c: #define SET4(X,c) (X=SET(c,c,c,c), X=ADD(X,_q))
stream.c: ^
stream.c: ./Intrinsics_AVX2_128block.h:24:13: note: expanded from macro 'SET'
stream.c: #define SET _mm256_set_epi64x
stream.c: ^
stream.c: stream.c:128:24: error: always_inline function '_mm256_add_epi64' requires target feature 'avx2', but would be inlined into function 'Encrypt' that is compiled without support for 'avx2'
stream.c: ./Intrinsics_AVX2_128block.h:26:38: note: expanded from macro 'SET4'
stream.c: #define SET4(X,c) (X=SET(c,c,c,c), X=ADD(X,_q))
stream.c: ^
stream.c: ./Intrinsics_AVX2_128block.h:17:13: note: expanded from macro 'ADD'
stream.c: #define ADD _mm256_add_epi64
stream.c: ^
stream.c: ...

Number of similar (compiler,implementation) pairs: 1, namely:
CompilerImplementations
clang -mcpu=native -O3 -fomit-frame-pointer -fwrapv -Qunused-arguments -fPIC -fPIE T:avx2

Compiler output

Implementation: T:avx2
Security model: timingleaks
Compiler: gcc -march=native -mtune=native -Os -fomit-frame-pointer -fwrapv -fPIC -fPIE
try.c: /usr/bin/ld: crypto_stream_simon128256ctr.a(stream.o): in function `Encrypt':
try.c: stream.c:(.text+0x...): undefined reference to `Transpose'
try.c: /usr/bin/ld: stream.c:(.text+0x...): undefined reference to `Transpose'
try.c: /usr/bin/ld: stream.c:(.text+0x...): undefined reference to `Transpose'
try.c: /usr/bin/ld: stream.c:(.text+0x...): undefined reference to `Transpose'
try.c: /usr/bin/ld: crypto_stream_simon128256ctr.a(stream.o): in function `Encrypt_Xor':
try.c: stream.c:(.text+0x...): undefined reference to `Transpose'
try.c: /usr/bin/ld: crypto_stream_simon128256ctr.a(stream.o):stream.c:(.text+0x...): more undefined references to `Transpose' follow
try.c: collect2: error: ld returned 1 exit status

Number of similar (compiler,implementation) pairs: 1, namely:
CompilerImplementations
gcc -march=native -mtune=native -Os -fomit-frame-pointer -fwrapv -fPIC -fPIE T:avx2

Compiler output

Implementation: T:sse4
Security model: timingleaks
Compiler: clang -mcpu=native -O3 -fomit-frame-pointer -fwrapv -Qunused-arguments -fPIC -fPIE
stream.c: stream.c:307:3: error: always_inline function '_mm_shuffle_epi8' requires target feature 'ssse3', but would be inlined into function 'ExpandKeyBS' that is compiled without support for 'ssse3'
stream.c: EKBS(rk);
stream.c: ^
stream.c: ./Simon128256SSE4.h:67:19: note: expanded from macro 'EKBS'
stream.c: #define EKBS(rk) (RKBS(rk,4,_D), RKBS(rk,5,_D), RKBS(rk,6,_C), RKBS(rk,7,_D), RKBS(rk,8,_C), RKBS(rk,9,_C), RKBS(rk,10,_C), RKBS(rk,11,_D), \
stream.c: ^
stream.c: ./Simon128256SSE4.h:57:52: note: expanded from macro 'RKBS'
stream.c: #define RKBS(rk,r,_V) (rk[r][7]= _D ^ rk[r-4][7] ^ ROR8(rk[r-1][2]) ^ rk[r-3][7] ^ ROR8(rk[r-1][3]) ^ ROR8(rk[r-3][0]), \
stream.c: ^
stream.c: ./Intrinsics_SSE4_128block.h:39:19: note: expanded from macro 'ROR8'
stream.c: #define ROR8(X) (SHFL(X,R8))
stream.c: ^
stream.c: ./Intrinsics_SSE4_128block.h:35:14: note: expanded from macro 'SHFL'
stream.c: #define SHFL _mm_shuffle_epi8
stream.c: ^
stream.c: stream.c:307:3: error: always_inline function '_mm_shuffle_epi8' requires target feature 'ssse3', but would be inlined into function 'ExpandKeyBS' that is compiled without support for 'ssse3'
stream.c: ./Simon128256SSE4.h:67:19: note: expanded from macro 'EKBS'
stream.c: #define EKBS(rk) (RKBS(rk,4,_D), RKBS(rk,5,_D), RKBS(rk,6,_C), RKBS(rk,7,_D), RKBS(rk,8,_C), RKBS(rk,9,_C), RKBS(rk,10,_C), RKBS(rk,11,_D), \
stream.c: ^
stream.c: ./Simon128256SSE4.h:57:85: note: expanded from macro 'RKBS'
stream.c: #define RKBS(rk,r,_V) (rk[r][7]= _D ^ rk[r-4][7] ^ ROR8(rk[r-1][2]) ^ rk[r-3][7] ^ ROR8(rk[r-1][3]) ^ ROR8(rk[r-3][0]), \
stream.c: ^
stream.c: ./Intrinsics_SSE4_128block.h:39:19: note: expanded from macro 'ROR8'
stream.c: #define ROR8(X) (SHFL(X,R8))
stream.c: ^
stream.c: ...

Number of similar (compiler,implementation) pairs: 1, namely:
CompilerImplementations
clang -mcpu=native -O3 -fomit-frame-pointer -fwrapv -Qunused-arguments -fPIC -fPIE T:sse4

Namespace violations

Implementation: T:avx2
Security model: timingleaks
Compiler: clang -march=native -O2 -fomit-frame-pointer -fwrapv -Qunused-arguments -fPIC -fPIE
stream.o Encrypt T
stream.o Encrypt_Xor T
stream.o ExpandKeyBS T
stream.o ExpandKeyNBS T

Number of similar (compiler,implementation) pairs: 7, namely:
CompilerImplementations
clang -march=native -O2 -fomit-frame-pointer -fwrapv -Qunused-arguments -fPIC -fPIE T:avx2
clang -march=native -O3 -fomit-frame-pointer -fwrapv -Qunused-arguments -fPIC -fPIE T:avx2
clang -march=native -O -fomit-frame-pointer -fwrapv -Qunused-arguments -fPIC -fPIE T:avx2
clang -march=native -Os -fomit-frame-pointer -fwrapv -Qunused-arguments -fPIC -fPIE T:avx2
gcc -march=native -mtune=native -O2 -fomit-frame-pointer -fwrapv -fPIC -fPIE T:avx2
gcc -march=native -mtune=native -O3 -fomit-frame-pointer -fwrapv -fPIC -fPIE T:avx2
gcc -march=native -mtune=native -O -fomit-frame-pointer -fwrapv -fPIC -fPIE T:avx2

Namespace violations

Implementation: T:sse4
Security model: timingleaks
Compiler: clang -march=native -O2 -fomit-frame-pointer -fwrapv -Qunused-arguments -fPIC -fPIE
stream.o ExpandKeyBS T
stream.o ExpandKeyNBS T

Number of similar (compiler,implementation) pairs: 8, namely:
CompilerImplementations
clang -march=native -O2 -fomit-frame-pointer -fwrapv -Qunused-arguments -fPIC -fPIE T:sse4
clang -march=native -O3 -fomit-frame-pointer -fwrapv -Qunused-arguments -fPIC -fPIE T:sse4
clang -march=native -O -fomit-frame-pointer -fwrapv -Qunused-arguments -fPIC -fPIE T:sse4
clang -march=native -Os -fomit-frame-pointer -fwrapv -Qunused-arguments -fPIC -fPIE T:sse4
gcc -march=native -mtune=native -O2 -fomit-frame-pointer -fwrapv -fPIC -fPIE T:sse4
gcc -march=native -mtune=native -O3 -fomit-frame-pointer -fwrapv -fPIC -fPIE T:sse4
gcc -march=native -mtune=native -O -fomit-frame-pointer -fwrapv -fPIC -fPIE T:sse4
gcc -march=native -mtune=native -Os -fomit-frame-pointer -fwrapv -fPIC -fPIE T:sse4