Implementation notes: amd64, comet, crypto_kem/rolloii256

Computer: comet
Microarchitecture: amd64; Comet Lake (806ec)
Architecture: amd64
CPU ID: GenuineIntel-000806ec-bfebfbff
SUPERCOP version: 20240425
Operation: crypto_kem
Primitive: rolloii256
TimeObject sizeTest sizeImplementationCompilerBenchmark dateSUPERCOP version
327734731157 0 2489255 884 1792T:avxgcc_-march=native_-mtune=native_-O3_-fomit-frame-pointer_-fwrapv_-fPIC_-fPIE2024050820240425
330714829323 0 2489043 948 1824T:avxclang_-march=native_-O3_-fomit-frame-pointer_-fwrapv_-Qunused-arguments_-fPIC_-fPIE2024050820240425
331402327645 0 2486995 948 1728T:avxclang_-march=native_-O2_-fomit-frame-pointer_-fwrapv_-Qunused-arguments_-fPIC_-fPIE2024050820240425
332676527256 0 2482915 948 1728T:avxclang_-march=native_-O_-fomit-frame-pointer_-fwrapv_-Qunused-arguments_-fPIC_-fPIE2024050820240425
335758029724 0 2485847 884 1792T:avxgcc_-march=native_-mtune=native_-O2_-fomit-frame-pointer_-fwrapv_-fPIC_-fPIE2024050820240425
341559922270 0 2478715 932 1824T:avxclang_-march=native_-Os_-fomit-frame-pointer_-fwrapv_-Qunused-arguments_-fPIC_-fPIE2024050820240425
360003023179 0 2478679 884 1792T:avxgcc_-march=native_-mtune=native_-O_-fomit-frame-pointer_-fwrapv_-fPIC_-fPIE2024050820240425
408642119977 0 2474303 876 1760T:avxgcc_-march=native_-mtune=native_-Os_-fomit-frame-pointer_-fwrapv_-fPIC_-fPIE2024050820240425

Compiler output

Implementation: T:avx
Security model: timingleaks
Compiler: clang -mcpu=native -O3 -fomit-frame-pointer -fwrapv -Qunused-arguments -fPIC -fPIE
rbc_elt.c: rbc_elt.c:467:19: error: '__builtin_ia32_pclmulqdq128' needs target feature pclmul
rbc_elt.c: __m128i a0_b0 = _mm_clmulepi64_si128(a, b, 0x00);
rbc_elt.c: ^
rbc_elt.c: /usr/lib/llvm-14/lib/clang/14.0.6/include/__wmmintrin_pclmul.h:45:13: note: expanded from macro '_mm_clmulepi64_si128'
rbc_elt.c: ((__m128i)__builtin_ia32_pclmulqdq128((__v2di)(__m128i)(X), \
rbc_elt.c: ^
rbc_elt.c: rbc_elt.c:469:19: error: '__builtin_ia32_pclmulqdq128' needs target feature pclmul
rbc_elt.c: __m128i a0_b1 = _mm_clmulepi64_si128(a, b, 0x10);
rbc_elt.c: ^
rbc_elt.c: /usr/lib/llvm-14/lib/clang/14.0.6/include/__wmmintrin_pclmul.h:45:13: note: expanded from macro '_mm_clmulepi64_si128'
rbc_elt.c: ((__m128i)__builtin_ia32_pclmulqdq128((__v2di)(__m128i)(X), \
rbc_elt.c: ^
rbc_elt.c: rbc_elt.c:470:19: error: '__builtin_ia32_pclmulqdq128' needs target feature pclmul
rbc_elt.c: __m128i a1_b0 = _mm_clmulepi64_si128(a, b, 0x01);
rbc_elt.c: ^
rbc_elt.c: /usr/lib/llvm-14/lib/clang/14.0.6/include/__wmmintrin_pclmul.h:45:13: note: expanded from macro '_mm_clmulepi64_si128'
rbc_elt.c: ((__m128i)__builtin_ia32_pclmulqdq128((__v2di)(__m128i)(X), \
rbc_elt.c: ^
rbc_elt.c: rbc_elt.c:472:19: error: '__builtin_ia32_pclmulqdq128' needs target feature pclmul
rbc_elt.c: __m128i a1_b1 = _mm_clmulepi64_si128(a, b, 0x11);
rbc_elt.c: ^
rbc_elt.c: /usr/lib/llvm-14/lib/clang/14.0.6/include/__wmmintrin_pclmul.h:45:13: note: expanded from macro '_mm_clmulepi64_si128'
rbc_elt.c: ((__m128i)__builtin_ia32_pclmulqdq128((__v2di)(__m128i)(X), \
rbc_elt.c: ^
rbc_elt.c: 4 errors generated.

Number of similar (compiler,implementation) pairs: 1, namely:
CompilerImplementations
clang -mcpu=native -O3 -fomit-frame-pointer -fwrapv -Qunused-arguments -fPIC -fPIE T:avx

Compiler output

Implementation: T:ref
Security model: timingleaks
Compiler: clang -march=native -O2 -fomit-frame-pointer -fwrapv -Qunused-arguments -fPIC -fPIE
try.c: /usr/bin/ld: libcrypto_kem_rolloii256.a(lrpc.o):(.bss+0x0): multiple definition of `RBC_SQR_LOOKUP_TABLE'; libcrypto_kem_rolloii256.a(kem.o):(.bss+0x0): first defined here
try.c: /usr/bin/ld: libcrypto_kem_rolloii256.a(parsing.o):(.bss+0x0): multiple definition of `RBC_SQR_LOOKUP_TABLE'; libcrypto_kem_rolloii256.a(kem.o):(.bss+0x0): first defined here
try.c: /usr/bin/ld: libcrypto_kem_rolloii256.a(rbc_elt.o):(.bss+0x10): multiple definition of `RBC_SQR_LOOKUP_TABLE'; libcrypto_kem_rolloii256.a(kem.o):(.bss+0x0): first defined here
try.c: /usr/bin/ld: libcrypto_kem_rolloii256.a(rbc_qre.o):(.bss+0x20): multiple definition of `RBC_SQR_LOOKUP_TABLE'; libcrypto_kem_rolloii256.a(kem.o):(.bss+0x0): first defined here
try.c: /usr/bin/ld: libcrypto_kem_rolloii256.a(rbc_vec.o):(.bss+0x0): multiple definition of `RBC_SQR_LOOKUP_TABLE'; libcrypto_kem_rolloii256.a(kem.o):(.bss+0x0): first defined here
try.c: /usr/bin/ld: libcrypto_kem_rolloii256.a(rbc_vspace.o):(.bss+0x0): multiple definition of `RBC_SQR_LOOKUP_TABLE'; libcrypto_kem_rolloii256.a(kem.o):(.bss+0x0): first defined here
try.c: /usr/bin/ld: libcrypto_kem_rolloii256.a(rbc_poly.o):(.bss+0x0): multiple definition of `RBC_SQR_LOOKUP_TABLE'; libcrypto_kem_rolloii256.a(kem.o):(.bss+0x0): first defined here
try.c: clang: error: linker command failed with exit code 1 (use -v to see invocation)

Number of similar (compiler,implementation) pairs: 5, namely:
CompilerImplementations
clang -march=native -O2 -fomit-frame-pointer -fwrapv -Qunused-arguments -fPIC -fPIE T:ref
clang -march=native -O3 -fomit-frame-pointer -fwrapv -Qunused-arguments -fPIC -fPIE T:ref
clang -march=native -O -fomit-frame-pointer -fwrapv -Qunused-arguments -fPIC -fPIE T:ref
clang -march=native -Os -fomit-frame-pointer -fwrapv -Qunused-arguments -fPIC -fPIE T:ref
clang -mcpu=native -O3 -fomit-frame-pointer -fwrapv -Qunused-arguments -fPIC -fPIE T:ref

Compiler output

Implementation: T:ref
Security model: timingleaks
Compiler: gcc -march=native -mtune=native -O2 -fomit-frame-pointer -fwrapv -fPIC -fPIE
try.c: /usr/bin/ld: libcrypto_kem_rolloii256.a(lrpc.o):(.bss+0x0): multiple definition of `RBC_SQR_LOOKUP_TABLE'; libcrypto_kem_rolloii256.a(kem.o):(.bss+0x0): first defined here
try.c: /usr/bin/ld: libcrypto_kem_rolloii256.a(parsing.o):(.bss+0x0): multiple definition of `RBC_SQR_LOOKUP_TABLE'; libcrypto_kem_rolloii256.a(kem.o):(.bss+0x0): first defined here
try.c: /usr/bin/ld: libcrypto_kem_rolloii256.a(rbc_elt.o):(.bss+0x0): multiple definition of `RBC_SQR_LOOKUP_TABLE'; libcrypto_kem_rolloii256.a(kem.o):(.bss+0x0): first defined here
try.c: /usr/bin/ld: libcrypto_kem_rolloii256.a(rbc_qre.o):(.bss+0x0): multiple definition of `RBC_SQR_LOOKUP_TABLE'; libcrypto_kem_rolloii256.a(kem.o):(.bss+0x0): first defined here
try.c: /usr/bin/ld: libcrypto_kem_rolloii256.a(rbc_vec.o):(.bss+0x0): multiple definition of `RBC_SQR_LOOKUP_TABLE'; libcrypto_kem_rolloii256.a(kem.o):(.bss+0x0): first defined here
try.c: /usr/bin/ld: libcrypto_kem_rolloii256.a(rbc_vspace.o):(.bss+0x0): multiple definition of `RBC_SQR_LOOKUP_TABLE'; libcrypto_kem_rolloii256.a(kem.o):(.bss+0x0): first defined here
try.c: /usr/bin/ld: libcrypto_kem_rolloii256.a(rbc_poly.o):(.bss+0x0): multiple definition of `RBC_SQR_LOOKUP_TABLE'; libcrypto_kem_rolloii256.a(kem.o):(.bss+0x0): first defined here
try.c: collect2: error: ld returned 1 exit status

Number of similar (compiler,implementation) pairs: 4, namely:
CompilerImplementations
gcc -march=native -mtune=native -O2 -fomit-frame-pointer -fwrapv -fPIC -fPIE T:ref
gcc -march=native -mtune=native -O3 -fomit-frame-pointer -fwrapv -fPIC -fPIE T:ref
gcc -march=native -mtune=native -O -fomit-frame-pointer -fwrapv -fPIC -fPIE T:ref
gcc -march=native -mtune=native -Os -fomit-frame-pointer -fwrapv -fPIC -fPIE T:ref