Implementation notes: amd64, comet, crypto_kem/rolloii128

Computer: comet
Microarchitecture: amd64; Comet Lake (806ec)
Architecture: amd64
CPU ID: GenuineIntel-000806ec-bfebfbff
SUPERCOP version: 20240425
Operation: crypto_kem
Primitive: rolloii128
TimeObject sizeTest sizeImplementationCompilerBenchmark dateSUPERCOP version
241279827520 0 2483187 948 1728T:avxclang_-march=native_-O_-fomit-frame-pointer_-fwrapv_-Qunused-arguments_-fPIC_-fPIE2024050820240425
244284327925 0 2487251 948 1728T:avxclang_-march=native_-O2_-fomit-frame-pointer_-fwrapv_-Qunused-arguments_-fPIC_-fPIE2024050820240425
245167729603 0 2489299 948 1824T:avxclang_-march=native_-O3_-fomit-frame-pointer_-fwrapv_-Qunused-arguments_-fPIC_-fPIE2024050820240425
248072831349 0 2489391 884 1792T:avxgcc_-march=native_-mtune=native_-O3_-fomit-frame-pointer_-fwrapv_-fPIC_-fPIE2024050820240425
252349822519 0 2478843 932 1824T:avxclang_-march=native_-Os_-fomit-frame-pointer_-fwrapv_-Qunused-arguments_-fPIC_-fPIE2024050820240425
255944529836 0 2485999 884 1792T:avxgcc_-march=native_-mtune=native_-O2_-fomit-frame-pointer_-fwrapv_-fPIC_-fPIE2024050820240425
278046623280 0 2478703 884 1792T:avxgcc_-march=native_-mtune=native_-O_-fomit-frame-pointer_-fwrapv_-fPIC_-fPIE2024050820240425
304782820110 0 2474327 876 1760T:avxgcc_-march=native_-mtune=native_-Os_-fomit-frame-pointer_-fwrapv_-fPIC_-fPIE2024050820240425

Compiler output

Implementation: T:avx
Security model: timingleaks
Compiler: clang -mcpu=native -O3 -fomit-frame-pointer -fwrapv -Qunused-arguments -fPIC -fPIE
rbc_elt.c: rbc_elt.c:466:19: error: '__builtin_ia32_pclmulqdq128' needs target feature pclmul
rbc_elt.c: __m128i a0_b0 = _mm_clmulepi64_si128(a, b, 0x00);
rbc_elt.c: ^
rbc_elt.c: /usr/lib/llvm-14/lib/clang/14.0.6/include/__wmmintrin_pclmul.h:45:13: note: expanded from macro '_mm_clmulepi64_si128'
rbc_elt.c: ((__m128i)__builtin_ia32_pclmulqdq128((__v2di)(__m128i)(X), \
rbc_elt.c: ^
rbc_elt.c: rbc_elt.c:468:19: error: '__builtin_ia32_pclmulqdq128' needs target feature pclmul
rbc_elt.c: __m128i a0_b1 = _mm_clmulepi64_si128(a, b, 0x10);
rbc_elt.c: ^
rbc_elt.c: /usr/lib/llvm-14/lib/clang/14.0.6/include/__wmmintrin_pclmul.h:45:13: note: expanded from macro '_mm_clmulepi64_si128'
rbc_elt.c: ((__m128i)__builtin_ia32_pclmulqdq128((__v2di)(__m128i)(X), \
rbc_elt.c: ^
rbc_elt.c: rbc_elt.c:469:19: error: '__builtin_ia32_pclmulqdq128' needs target feature pclmul
rbc_elt.c: __m128i a1_b0 = _mm_clmulepi64_si128(a, b, 0x01);
rbc_elt.c: ^
rbc_elt.c: /usr/lib/llvm-14/lib/clang/14.0.6/include/__wmmintrin_pclmul.h:45:13: note: expanded from macro '_mm_clmulepi64_si128'
rbc_elt.c: ((__m128i)__builtin_ia32_pclmulqdq128((__v2di)(__m128i)(X), \
rbc_elt.c: ^
rbc_elt.c: rbc_elt.c:471:19: error: '__builtin_ia32_pclmulqdq128' needs target feature pclmul
rbc_elt.c: __m128i a1_b1 = _mm_clmulepi64_si128(a, b, 0x11);
rbc_elt.c: ^
rbc_elt.c: /usr/lib/llvm-14/lib/clang/14.0.6/include/__wmmintrin_pclmul.h:45:13: note: expanded from macro '_mm_clmulepi64_si128'
rbc_elt.c: ((__m128i)__builtin_ia32_pclmulqdq128((__v2di)(__m128i)(X), \
rbc_elt.c: ^
rbc_elt.c: 4 errors generated.

Number of similar (compiler,implementation) pairs: 1, namely:
CompilerImplementations
clang -mcpu=native -O3 -fomit-frame-pointer -fwrapv -Qunused-arguments -fPIC -fPIE T:avx

Compiler output

Implementation: T:ref
Security model: timingleaks
Compiler: clang -march=native -O2 -fomit-frame-pointer -fwrapv -Qunused-arguments -fPIC -fPIE
try.c: /usr/bin/ld: libcrypto_kem_rolloii128.a(lrpc.o):(.bss+0x0): multiple definition of `RBC_SQR_LOOKUP_TABLE'; libcrypto_kem_rolloii128.a(kem.o):(.bss+0x0): first defined here
try.c: /usr/bin/ld: libcrypto_kem_rolloii128.a(parsing.o):(.bss+0x0): multiple definition of `RBC_SQR_LOOKUP_TABLE'; libcrypto_kem_rolloii128.a(kem.o):(.bss+0x0): first defined here
try.c: /usr/bin/ld: libcrypto_kem_rolloii128.a(rbc_elt.o):(.bss+0x10): multiple definition of `RBC_SQR_LOOKUP_TABLE'; libcrypto_kem_rolloii128.a(kem.o):(.bss+0x0): first defined here
try.c: /usr/bin/ld: libcrypto_kem_rolloii128.a(rbc_qre.o):(.bss+0x20): multiple definition of `RBC_SQR_LOOKUP_TABLE'; libcrypto_kem_rolloii128.a(kem.o):(.bss+0x0): first defined here
try.c: /usr/bin/ld: libcrypto_kem_rolloii128.a(rbc_vec.o):(.bss+0x0): multiple definition of `RBC_SQR_LOOKUP_TABLE'; libcrypto_kem_rolloii128.a(kem.o):(.bss+0x0): first defined here
try.c: /usr/bin/ld: libcrypto_kem_rolloii128.a(rbc_vspace.o):(.bss+0x0): multiple definition of `RBC_SQR_LOOKUP_TABLE'; libcrypto_kem_rolloii128.a(kem.o):(.bss+0x0): first defined here
try.c: /usr/bin/ld: libcrypto_kem_rolloii128.a(rbc_poly.o):(.bss+0x0): multiple definition of `RBC_SQR_LOOKUP_TABLE'; libcrypto_kem_rolloii128.a(kem.o):(.bss+0x0): first defined here
try.c: clang: error: linker command failed with exit code 1 (use -v to see invocation)

Number of similar (compiler,implementation) pairs: 5, namely:
CompilerImplementations
clang -march=native -O2 -fomit-frame-pointer -fwrapv -Qunused-arguments -fPIC -fPIE T:ref
clang -march=native -O3 -fomit-frame-pointer -fwrapv -Qunused-arguments -fPIC -fPIE T:ref
clang -march=native -O -fomit-frame-pointer -fwrapv -Qunused-arguments -fPIC -fPIE T:ref
clang -march=native -Os -fomit-frame-pointer -fwrapv -Qunused-arguments -fPIC -fPIE T:ref
clang -mcpu=native -O3 -fomit-frame-pointer -fwrapv -Qunused-arguments -fPIC -fPIE T:ref

Compiler output

Implementation: T:ref
Security model: timingleaks
Compiler: gcc -march=native -mtune=native -O2 -fomit-frame-pointer -fwrapv -fPIC -fPIE
try.c: /usr/bin/ld: libcrypto_kem_rolloii128.a(lrpc.o):(.bss+0x0): multiple definition of `RBC_SQR_LOOKUP_TABLE'; libcrypto_kem_rolloii128.a(kem.o):(.bss+0x0): first defined here
try.c: /usr/bin/ld: libcrypto_kem_rolloii128.a(parsing.o):(.bss+0x0): multiple definition of `RBC_SQR_LOOKUP_TABLE'; libcrypto_kem_rolloii128.a(kem.o):(.bss+0x0): first defined here
try.c: /usr/bin/ld: libcrypto_kem_rolloii128.a(rbc_elt.o):(.bss+0x0): multiple definition of `RBC_SQR_LOOKUP_TABLE'; libcrypto_kem_rolloii128.a(kem.o):(.bss+0x0): first defined here
try.c: /usr/bin/ld: libcrypto_kem_rolloii128.a(rbc_qre.o):(.bss+0x0): multiple definition of `RBC_SQR_LOOKUP_TABLE'; libcrypto_kem_rolloii128.a(kem.o):(.bss+0x0): first defined here
try.c: /usr/bin/ld: libcrypto_kem_rolloii128.a(rbc_vec.o):(.bss+0x0): multiple definition of `RBC_SQR_LOOKUP_TABLE'; libcrypto_kem_rolloii128.a(kem.o):(.bss+0x0): first defined here
try.c: /usr/bin/ld: libcrypto_kem_rolloii128.a(rbc_vspace.o):(.bss+0x0): multiple definition of `RBC_SQR_LOOKUP_TABLE'; libcrypto_kem_rolloii128.a(kem.o):(.bss+0x0): first defined here
try.c: /usr/bin/ld: libcrypto_kem_rolloii128.a(rbc_poly.o):(.bss+0x0): multiple definition of `RBC_SQR_LOOKUP_TABLE'; libcrypto_kem_rolloii128.a(kem.o):(.bss+0x0): first defined here
try.c: collect2: error: ld returned 1 exit status

Number of similar (compiler,implementation) pairs: 4, namely:
CompilerImplementations
gcc -march=native -mtune=native -O2 -fomit-frame-pointer -fwrapv -fPIC -fPIE T:ref
gcc -march=native -mtune=native -O3 -fomit-frame-pointer -fwrapv -fPIC -fPIE T:ref
gcc -march=native -mtune=native -O -fomit-frame-pointer -fwrapv -fPIC -fPIE T:ref
gcc -march=native -mtune=native -Os -fomit-frame-pointer -fwrapv -fPIC -fPIE T:ref