Implementation notes: amd64, comet, crypto_aead/morus1280128v1

Computer: comet
Microarchitecture: amd64; Comet Lake (806ec)
Architecture: amd64
CPU ID: GenuineIntel-000806ec-bfebfbff
SUPERCOP version: 20240625
Operation: crypto_aead
Primitive: morus1280128v1
TimeObject sizeTest sizeImplementationCompilerBenchmark dateSUPERCOP version
47615757 0 023513 852 1056T:avx2clang_-march=native_-O2_-fwrapv_-Qunused-arguments_-fPIC_-fPIE_-gdwarf-4_-Wall2024062920240625
47705757 0 023809 852 1088T:avx2clang_-march=native_-O3_-fwrapv_-Qunused-arguments_-fPIC_-fPIE_-gdwarf-4_-Wall2024062920240625
48386612 0 020537 852 1024T:avx2clang_-march=native_-O_-fwrapv_-Qunused-arguments_-fPIC_-fPIE_-gdwarf-4_-Wall2024062920240625
48874449 0 019223 844 1088T:avx2clang_-march=native_-Os_-fwrapv_-Qunused-arguments_-fPIC_-fPIE_-gdwarf-4_-Wall2024062920240625
52506229 0 022436 780 1088T:avx2gcc_-march=native_-mtune=native_-O3_-fwrapv_-fPIC_-fPIE_-gdwarf-4_-Wall2024062920240625
53203406 0 017356 780 1088T:avx2gcc_-march=native_-mtune=native_-O_-fwrapv_-fPIC_-fPIE_-gdwarf-4_-Wall2024062920240625
53553436 0 017740 780 1088T:avx2gcc_-march=native_-mtune=native_-O2_-fwrapv_-fPIC_-fPIE_-gdwarf-4_-Wall2024062920240625
66436794 0 021543 844 1088T:sse2clang_-march=native_-Os_-fwrapv_-Qunused-arguments_-fPIC_-fPIE_-gdwarf-4_-Wall2024062920240625
684310223 0 027921 852 1056T:sse2clang_-march=native_-O2_-fwrapv_-Qunused-arguments_-fPIC_-fPIE_-gdwarf-4_-Wall2024062920240625
685810255 0 028249 852 1088T:sse2clang_-march=native_-O3_-fwrapv_-Qunused-arguments_-fPIC_-fPIE_-gdwarf-4_-Wall2024062920240625
714012315 0 028697 852 1024T:sse2clang_-mcpu=native_-O3_-fwrapv_-Qunused-arguments_-fPIC_-fPIE_-gdwarf-4_-Wall2024062920240625
78088569 0 024764 780 1088T:sse2gcc_-march=native_-mtune=native_-O3_-fwrapv_-fPIC_-fPIE_-gdwarf-4_-Wall2024062920240625
800211440 0 025313 852 1024T:sse2clang_-march=native_-O_-fwrapv_-Qunused-arguments_-fPIC_-fPIE_-gdwarf-4_-Wall2024062920240625
1228614754 0 030964 780 1088T:ref64gcc_-march=native_-mtune=native_-O3_-fwrapv_-fPIC_-fPIE_-gdwarf-4_-Wall2024062920240625
1258711610 0 027796 780 1088T:refgcc_-march=native_-mtune=native_-O3_-fwrapv_-fPIC_-fPIE_-gdwarf-4_-Wall2024062920240625
1344018927 0 032905 852 1024T:refclang_-march=native_-O_-fwrapv_-Qunused-arguments_-fPIC_-fPIE_-gdwarf-4_-Wall2024062920240625
1409513483 0 029969 852 1024T:refclang_-mcpu=native_-O3_-fwrapv_-Qunused-arguments_-fPIC_-fPIE_-gdwarf-4_-Wall2024062920240625
1448813639 0 031753 852 1088T:refclang_-march=native_-O3_-fwrapv_-Qunused-arguments_-fPIC_-fPIE_-gdwarf-4_-Wall2024062920240625
1451213607 0 031425 852 1056T:refclang_-march=native_-O2_-fwrapv_-Qunused-arguments_-fPIC_-fPIE_-gdwarf-4_-Wall2024062920240625
145899205 0 023991 844 1088T:refclang_-march=native_-Os_-fwrapv_-Qunused-arguments_-fPIC_-fPIE_-gdwarf-4_-Wall2024062920240625
182475510 0 019820 780 1088T:ref64gcc_-march=native_-mtune=native_-O2_-fwrapv_-fPIC_-fPIE_-gdwarf-4_-Wall2024062920240625
183483303 0 015943 756 1056T:refgcc_-march=native_-mtune=native_-Os_-fwrapv_-fPIC_-fPIE_-gdwarf-4_-Wall2024062920240625
183865180 0 017823 756 1056T:ref64gcc_-march=native_-mtune=native_-Os_-fwrapv_-fPIC_-fPIE_-gdwarf-4_-Wall2024062920240625
184175537 0 019395 772 1088T:ref64gcc_-march=native_-mtune=native_-O_-fwrapv_-fPIC_-fPIE_-gdwarf-4_-Wall2024062920240625
184383903 0 017747 772 1088T:refgcc_-march=native_-mtune=native_-O_-fwrapv_-fPIC_-fPIE_-gdwarf-4_-Wall2024062920240625
195826730 0 023233 852 1024T:ref64clang_-mcpu=native_-O3_-fwrapv_-Qunused-arguments_-fPIC_-fPIE_-gdwarf-4_-Wall2024062920240625
200663462 0 017756 780 1088T:refgcc_-march=native_-mtune=native_-O2_-fwrapv_-fPIC_-fPIE_-gdwarf-4_-Wall2024062920240625
206706696 0 024529 852 1056T:ref64clang_-march=native_-O2_-fwrapv_-Qunused-arguments_-fPIC_-fPIE_-gdwarf-4_-Wall2024062920240625
206796696 0 024825 852 1088T:ref64clang_-march=native_-O3_-fwrapv_-Qunused-arguments_-fPIC_-fPIE_-gdwarf-4_-Wall2024062920240625
207845569 0 020359 844 1088T:ref64clang_-march=native_-Os_-fwrapv_-Qunused-arguments_-fPIC_-fPIE_-gdwarf-4_-Wall2024062920240625
237167478 0 021473 852 1024T:ref64clang_-march=native_-O_-fwrapv_-Qunused-arguments_-fPIC_-fPIE_-gdwarf-4_-Wall2024062920240625

Compiler output


morus1280128v1avx2.c: morus1280128v1avx2.c:306:23: warning: unused variable 'j' [-Wunused-variable]
morus1280128v1avx2.c:         unsigned long long i,j;
morus1280128v1avx2.c:                              ^
morus1280128v1avx2.c: morus1280128v1avx2.c:357:16: warning: unused variable 'check' [-Wunused-variable]
morus1280128v1avx2.c:         unsigned char check = 0;
morus1280128v1avx2.c:                       ^
morus1280128v1avx2.c: morus1280128v1avx2.c:356:16: warning: unused variable 'tag' [-Wunused-variable]
morus1280128v1avx2.c:         unsigned char tag[16];
morus1280128v1avx2.c:                       ^
morus1280128v1avx2.c: morus1280128v1avx2.c:354:23: warning: unused variable 'j' [-Wunused-variable]
morus1280128v1avx2.c:         unsigned long long i,j;
morus1280128v1avx2.c:                              ^
morus1280128v1avx2.c: 4 warnings generated.

Number of similar (implementation,compiler) pairs: 2, namely:
ImplementationCompiler
T:avx2clang -march=native -O2 -fwrapv -Qunused-arguments -fPIC -fPIE -gdwarf-4 -Wall (Debian_Clang_14.0.6)
T:avx2clang -march=native -O -fwrapv -Qunused-arguments -fPIC -fPIE -gdwarf-4 -Wall (Debian_Clang_14.0.6)

Compiler output


morus1280128v1avx2.c: morus1280128v1avx2.c:306:23: warning: unused variable 'j' [-Wunused-variable]
morus1280128v1avx2.c:         unsigned long long i,j;
morus1280128v1avx2.c:                              ^
morus1280128v1avx2.c: morus1280128v1avx2.c:356:16: warning: unused variable 'tag' [-Wunused-variable]
morus1280128v1avx2.c:         unsigned char tag[16];
morus1280128v1avx2.c:                       ^
morus1280128v1avx2.c: morus1280128v1avx2.c:354:23: warning: unused variable 'j' [-Wunused-variable]
morus1280128v1avx2.c:         unsigned long long i,j;
morus1280128v1avx2.c:                              ^
morus1280128v1avx2.c: morus1280128v1avx2.c:357:16: warning: unused variable 'check' [-Wunused-variable]
morus1280128v1avx2.c:         unsigned char check = 0;
morus1280128v1avx2.c:                       ^
morus1280128v1avx2.c: 4 warnings generated.

Number of similar (implementation,compiler) pairs: 2, namely:
ImplementationCompiler
T:avx2clang -march=native -O3 -fwrapv -Qunused-arguments -fPIC -fPIE -gdwarf-4 -Wall (Debian_Clang_14.0.6)
T:avx2clang -march=native -Os -fwrapv -Qunused-arguments -fPIC -fPIE -gdwarf-4 -Wall (Debian_Clang_14.0.6)

Compiler output


morus1280128v1avx2.c: morus1280128v1avx2.c:55:13: error: always_inline function '_mm256_xor_si256' requires target feature 'avx2', but would be inlined into function 'morus_stateupdate' that is compiled without support for 'avx2'
morus1280128v1avx2.c:         state[0] = XOR256(state[0], state[3]);
morus1280128v1avx2.c:                    ^
morus1280128v1avx2.c: morus1280128v1avx2.c:25:27: note: expanded from macro 'XOR256'
morus1280128v1avx2.c: #define XOR256(x,y)       _mm256_xor_si256((x),(y))        /*XOR256(x,y) = x ^ y, where x and y are two 256-bit word*/
morus1280128v1avx2.c:                           ^
morus1280128v1avx2.c: morus1280128v1avx2.c:55:13: error: AVX vector argument of type '__m256i' (vector of 4 'long long' values) without 'avx' enabled changes the ABI
morus1280128v1avx2.c: morus1280128v1avx2.c:25:27: note: expanded from macro 'XOR256'
morus1280128v1avx2.c: #define XOR256(x,y)       _mm256_xor_si256((x),(y))        /*XOR256(x,y) = x ^ y, where x and y are two 256-bit word*/
morus1280128v1avx2.c:                           ^
morus1280128v1avx2.c: morus1280128v1avx2.c:56:30: error: always_inline function '_mm256_and_si256' requires target feature 'avx2', but would be inlined into function 'morus_stateupdate' that is compiled without support for 'avx2'
morus1280128v1avx2.c:         state[0] = XOR256(state[0], AND256(state[1], state[2]));
morus1280128v1avx2.c:                                     ^
morus1280128v1avx2.c: morus1280128v1avx2.c:26:27: note: expanded from macro 'AND256'
morus1280128v1avx2.c: #define AND256(x,y)       _mm256_and_si256((x),(y))        /*AND(x,y) = x & y, where x and y are two 256-bit word*/
morus1280128v1avx2.c:                           ^
morus1280128v1avx2.c: morus1280128v1avx2.c:56:30: error: AVX vector argument of type '__m256i' (vector of 4 'long long' values) without 'avx' enabled changes the ABI
morus1280128v1avx2.c: morus1280128v1avx2.c:26:27: note: expanded from macro 'AND256'
morus1280128v1avx2.c: #define AND256(x,y)       _mm256_and_si256((x),(y))        /*AND(x,y) = x & y, where x and y are two 256-bit word*/
morus1280128v1avx2.c:                           ^
morus1280128v1avx2.c: morus1280128v1avx2.c:56:13: error: always_inline function '_mm256_xor_si256' requires target feature 'avx2', but would be inlined into function 'morus_stateupdate' that is compiled without support for 'avx2'
morus1280128v1avx2.c:         state[0] = XOR256(state[0], AND256(state[1], state[2]));
morus1280128v1avx2.c:                    ^
morus1280128v1avx2.c: morus1280128v1avx2.c:25:27: note: expanded from macro 'XOR256'
morus1280128v1avx2.c: #define XOR256(x,y)       _mm256_xor_si256((x),(y))        /*XOR256(x,y) = x ^ y, where x and y are two 256-bit word*/
morus1280128v1avx2.c: ...

Number of similar (implementation,compiler) pairs: 1, namely:
ImplementationCompiler
T:avx2clang -mcpu=native -O3 -fwrapv -Qunused-arguments -fPIC -fPIE -gdwarf-4 -Wall (Debian_Clang_14.0.6)

Compiler output


morus1280128v1avx2.c: morus1280128v1avx2.c: In function 'crypto_aead_morus1280128v1_avx2_timingleaks_encrypt':
morus1280128v1avx2.c: morus1280128v1avx2.c:306:30: warning: unused variable 'j' [-Wunused-variable]
morus1280128v1avx2.c:   306 |         unsigned long long i,j;
morus1280128v1avx2.c:       |                              ^
morus1280128v1avx2.c: morus1280128v1avx2.c: In function 'crypto_aead_morus1280128v1_avx2_timingleaks_decrypt':
morus1280128v1avx2.c: morus1280128v1avx2.c:357:23: warning: unused variable 'check' [-Wunused-variable]
morus1280128v1avx2.c:   357 |         unsigned char check = 0;
morus1280128v1avx2.c:       |                       ^~~~~
morus1280128v1avx2.c: morus1280128v1avx2.c:356:23: warning: unused variable 'tag' [-Wunused-variable]
morus1280128v1avx2.c:   356 |         unsigned char tag[16];
morus1280128v1avx2.c:       |                       ^~~
morus1280128v1avx2.c: morus1280128v1avx2.c:354:30: warning: unused variable 'j' [-Wunused-variable]
morus1280128v1avx2.c:   354 |         unsigned long long i,j;
morus1280128v1avx2.c:       |                              ^

Number of similar (implementation,compiler) pairs: 3, namely:
ImplementationCompiler
T:avx2gcc -march=native -mtune=native -O2 -fwrapv -fPIC -fPIE -gdwarf-4 -Wall (12.2.0)
T:avx2gcc -march=native -mtune=native -O3 -fwrapv -fPIC -fPIE -gdwarf-4 -Wall (12.2.0)
T:avx2gcc -march=native -mtune=native -O -fwrapv -fPIC -fPIE -gdwarf-4 -Wall (12.2.0)

Compiler output


morus1280128v1avx2.c: morus1280128v1avx2.c: In function 'crypto_aead_morus1280128v1_avx2_timingleaks_encrypt':
morus1280128v1avx2.c: morus1280128v1avx2.c:306:30: warning: unused variable 'j' [-Wunused-variable]
morus1280128v1avx2.c:   306 |         unsigned long long i,j;
morus1280128v1avx2.c:       |                              ^
morus1280128v1avx2.c: morus1280128v1avx2.c: In function 'crypto_aead_morus1280128v1_avx2_timingleaks_decrypt':
morus1280128v1avx2.c: morus1280128v1avx2.c:357:23: warning: unused variable 'check' [-Wunused-variable]
morus1280128v1avx2.c:   357 |         unsigned char check = 0;
morus1280128v1avx2.c:       |                       ^~~~~
morus1280128v1avx2.c: morus1280128v1avx2.c:356:23: warning: unused variable 'tag' [-Wunused-variable]
morus1280128v1avx2.c:   356 |         unsigned char tag[16];
morus1280128v1avx2.c:       |                       ^~~
morus1280128v1avx2.c: morus1280128v1avx2.c:354:30: warning: unused variable 'j' [-Wunused-variable]
morus1280128v1avx2.c:   354 |         unsigned long long i,j;
morus1280128v1avx2.c:       |                              ^
try.c: /usr/bin/ld: libcrypto_aead_morus1280128v1.a(morus1280128v1avx2.o): in function `crypto_aead_morus1280128v1_avx2_timingleaks_encrypt':
try.c: .../supercop-data/comet/amd64/try/c/gcc_-march=native_-mtune=native_-Os_-fwrapv_-fPIC_-fPIE_-gdwarf-4_-Wall/timingleaks/crypto_aead/morus1280128v1/avx2/work/morus1280128v1avx2.c:317: undefined reference to `morus_enc_aut_step'
try.c: /usr/bin/ld: .../supercop-data/comet/amd64/try/c/gcc_-march=native_-mtune=native_-Os_-fwrapv_-fPIC_-fPIE_-gdwarf-4_-Wall/timingleaks/crypto_aead/morus1280128v1/avx2/work/morus1280128v1avx2.c:329: undefined reference to `morus_enc_aut_step'
try.c: /usr/bin/ld: libcrypto_aead_morus1280128v1.a(morus1280128v1avx2.o): in function `crypto_aead_morus1280128v1_avx2_timingleaks_decrypt':
try.c: .../supercop-data/comet/amd64/try/c/gcc_-march=native_-mtune=native_-Os_-fwrapv_-fPIC_-fPIE_-gdwarf-4_-Wall/timingleaks/crypto_aead/morus1280128v1/avx2/work/morus1280128v1avx2.c:364: undefined reference to `morus_enc_aut_step'
try.c: /usr/bin/ld: .../supercop-data/comet/amd64/try/c/gcc_-march=native_-mtune=native_-Os_-fwrapv_-fPIC_-fPIE_-gdwarf-4_-Wall/timingleaks/crypto_aead/morus1280128v1/avx2/work/morus1280128v1avx2.c:376: undefined reference to `morus_dec_aut_step'
try.c: collect2: error: ld returned 1 exit status

Number of similar (implementation,compiler) pairs: 1, namely:
ImplementationCompiler
T:avx2gcc -march=native -mtune=native -Os -fwrapv -fPIC -fPIE -gdwarf-4 -Wall (12.2.0)

Compiler output


encrypt.c: encrypt.c:224:17: warning: unused variable 'plaintextblock' [-Wunused-variable]
encrypt.c:         uint8_t plaintextblock[32], ciphertextblock[32];
encrypt.c:                 ^
encrypt.c: encrypt.c:268:25: warning: unused variable 'j' [-Wunused-variable]
encrypt.c:         unsigned long i,j;
encrypt.c:                         ^
encrypt.c: encrypt.c:269:17: warning: unused variable 'plaintextblock' [-Wunused-variable]
encrypt.c:         uint8_t plaintextblock[32], ciphertextblock[32];
encrypt.c:                 ^
encrypt.c: encrypt.c:270:17: warning: unused variable 'tag' [-Wunused-variable]
encrypt.c:         uint8_t tag[16];
encrypt.c:                 ^
encrypt.c: encrypt.c:271:17: warning: unused variable 'check' [-Wunused-variable]
encrypt.c:         uint8_t check = 0;
encrypt.c:                 ^
encrypt.c: 5 warnings generated.

Number of similar (implementation,compiler) pairs: 5, namely:
ImplementationCompiler
T:refclang -march=native -O2 -fwrapv -Qunused-arguments -fPIC -fPIE -gdwarf-4 -Wall (Debian_Clang_14.0.6)
T:refclang -march=native -O3 -fwrapv -Qunused-arguments -fPIC -fPIE -gdwarf-4 -Wall (Debian_Clang_14.0.6)
T:refclang -march=native -O -fwrapv -Qunused-arguments -fPIC -fPIE -gdwarf-4 -Wall (Debian_Clang_14.0.6)
T:refclang -march=native -Os -fwrapv -Qunused-arguments -fPIC -fPIE -gdwarf-4 -Wall (Debian_Clang_14.0.6)
T:refclang -mcpu=native -O3 -fwrapv -Qunused-arguments -fPIC -fPIE -gdwarf-4 -Wall (Debian_Clang_14.0.6)

Compiler output


encrypt.c: encrypt.c: In function 'crypto_aead_morus1280128v1_ref_timingleaks_encrypt':
encrypt.c: encrypt.c:224:17: warning: unused variable 'plaintextblock' [-Wunused-variable]
encrypt.c:   224 |         uint8_t plaintextblock[32], ciphertextblock[32];
encrypt.c:       |                 ^~~~~~~~~~~~~~
encrypt.c: encrypt.c: In function 'crypto_aead_morus1280128v1_ref_timingleaks_decrypt':
encrypt.c: encrypt.c:271:17: warning: unused variable 'check' [-Wunused-variable]
encrypt.c:   271 |         uint8_t check = 0;
encrypt.c:       |                 ^~~~~
encrypt.c: encrypt.c:270:17: warning: unused variable 'tag' [-Wunused-variable]
encrypt.c:   270 |         uint8_t tag[16];
encrypt.c:       |                 ^~~
encrypt.c: encrypt.c:269:17: warning: unused variable 'plaintextblock' [-Wunused-variable]
encrypt.c:   269 |         uint8_t plaintextblock[32], ciphertextblock[32];
encrypt.c:       |                 ^~~~~~~~~~~~~~
encrypt.c: encrypt.c:268:25: warning: unused variable 'j' [-Wunused-variable]
encrypt.c:   268 |         unsigned long i,j;
encrypt.c:       |                         ^

Number of similar (implementation,compiler) pairs: 4, namely:
ImplementationCompiler
T:refgcc -march=native -mtune=native -O2 -fwrapv -fPIC -fPIE -gdwarf-4 -Wall (12.2.0)
T:refgcc -march=native -mtune=native -O3 -fwrapv -fPIC -fPIE -gdwarf-4 -Wall (12.2.0)
T:refgcc -march=native -mtune=native -O -fwrapv -fPIC -fPIE -gdwarf-4 -Wall (12.2.0)
T:refgcc -march=native -mtune=native -Os -fwrapv -fPIC -fPIE -gdwarf-4 -Wall (12.2.0)

Compiler output


morus1280128v1opt64.c: morus1280128v1opt64.c:286:17: warning: unused variable 'plaintextblock' [-Wunused-variable]
morus1280128v1opt64.c:         uint8_t plaintextblock[32], ciphertextblock[32];
morus1280128v1opt64.c:                 ^
morus1280128v1opt64.c: morus1280128v1opt64.c:331:25: warning: unused variable 'j' [-Wunused-variable]
morus1280128v1opt64.c:         unsigned long i,j;
morus1280128v1opt64.c:                         ^
morus1280128v1opt64.c: morus1280128v1opt64.c:332:17: warning: unused variable 'plaintextblock' [-Wunused-variable]
morus1280128v1opt64.c:         uint8_t plaintextblock[32], ciphertextblock[32];
morus1280128v1opt64.c:                 ^
morus1280128v1opt64.c: morus1280128v1opt64.c:333:17: warning: unused variable 'tag' [-Wunused-variable]
morus1280128v1opt64.c:         uint8_t tag[16];
morus1280128v1opt64.c:                 ^
morus1280128v1opt64.c: morus1280128v1opt64.c:334:17: warning: unused variable 'check' [-Wunused-variable]
morus1280128v1opt64.c:         uint8_t check = 0;
morus1280128v1opt64.c:                 ^
morus1280128v1opt64.c: 5 warnings generated.

Number of similar (implementation,compiler) pairs: 5, namely:
ImplementationCompiler
T:ref64clang -march=native -O2 -fwrapv -Qunused-arguments -fPIC -fPIE -gdwarf-4 -Wall (Debian_Clang_14.0.6)
T:ref64clang -march=native -O3 -fwrapv -Qunused-arguments -fPIC -fPIE -gdwarf-4 -Wall (Debian_Clang_14.0.6)
T:ref64clang -march=native -O -fwrapv -Qunused-arguments -fPIC -fPIE -gdwarf-4 -Wall (Debian_Clang_14.0.6)
T:ref64clang -march=native -Os -fwrapv -Qunused-arguments -fPIC -fPIE -gdwarf-4 -Wall (Debian_Clang_14.0.6)
T:ref64clang -mcpu=native -O3 -fwrapv -Qunused-arguments -fPIC -fPIE -gdwarf-4 -Wall (Debian_Clang_14.0.6)

Compiler output


morus1280128v1opt64.c: morus1280128v1opt64.c: In function 'crypto_aead_morus1280128v1_ref64_timingleaks_encrypt':
morus1280128v1opt64.c: morus1280128v1opt64.c:286:17: warning: unused variable 'plaintextblock' [-Wunused-variable]
morus1280128v1opt64.c:   286 |         uint8_t plaintextblock[32], ciphertextblock[32];
morus1280128v1opt64.c:       |                 ^~~~~~~~~~~~~~
morus1280128v1opt64.c: morus1280128v1opt64.c: In function 'crypto_aead_morus1280128v1_ref64_timingleaks_decrypt':
morus1280128v1opt64.c: morus1280128v1opt64.c:334:17: warning: unused variable 'check' [-Wunused-variable]
morus1280128v1opt64.c:   334 |         uint8_t check = 0;
morus1280128v1opt64.c:       |                 ^~~~~
morus1280128v1opt64.c: morus1280128v1opt64.c:333:17: warning: unused variable 'tag' [-Wunused-variable]
morus1280128v1opt64.c:   333 |         uint8_t tag[16];
morus1280128v1opt64.c:       |                 ^~~
morus1280128v1opt64.c: morus1280128v1opt64.c:332:17: warning: unused variable 'plaintextblock' [-Wunused-variable]
morus1280128v1opt64.c:   332 |         uint8_t plaintextblock[32], ciphertextblock[32];
morus1280128v1opt64.c:       |                 ^~~~~~~~~~~~~~
morus1280128v1opt64.c: morus1280128v1opt64.c:331:25: warning: unused variable 'j' [-Wunused-variable]
morus1280128v1opt64.c:   331 |         unsigned long i,j;
morus1280128v1opt64.c:       |                         ^

Number of similar (implementation,compiler) pairs: 4, namely:
ImplementationCompiler
T:ref64gcc -march=native -mtune=native -O2 -fwrapv -fPIC -fPIE -gdwarf-4 -Wall (12.2.0)
T:ref64gcc -march=native -mtune=native -O3 -fwrapv -fPIC -fPIE -gdwarf-4 -Wall (12.2.0)
T:ref64gcc -march=native -mtune=native -O -fwrapv -fPIC -fPIE -gdwarf-4 -Wall (12.2.0)
T:ref64gcc -march=native -mtune=native -Os -fwrapv -fPIC -fPIE -gdwarf-4 -Wall (12.2.0)

Compiler output


morus1280128v1sse2.c: morus1280128v1sse2.c:197:21: warning: unused variable 't2' [-Wunused-variable]
morus1280128v1sse2.c:     __m128i tt, t1, t2;
morus1280128v1sse2.c:                     ^
morus1280128v1sse2.c: morus1280128v1sse2.c:197:13: warning: unused variable 'tt' [-Wunused-variable]
morus1280128v1sse2.c:     __m128i tt, t1, t2;
morus1280128v1sse2.c:             ^
morus1280128v1sse2.c: morus1280128v1sse2.c:197:17: warning: unused variable 't1' [-Wunused-variable]
morus1280128v1sse2.c:     __m128i tt, t1, t2;
morus1280128v1sse2.c:                 ^
morus1280128v1sse2.c: morus1280128v1sse2.c:196:13: warning: unused variable 't' [-Wunused-variable]
morus1280128v1sse2.c:     __m128i t;
morus1280128v1sse2.c:             ^
morus1280128v1sse2.c: morus1280128v1sse2.c:222:13: warning: unused variable 't' [-Wunused-variable]
morus1280128v1sse2.c:     __m128i t;
morus1280128v1sse2.c:             ^
morus1280128v1sse2.c: morus1280128v1sse2.c:314:13: warning: unused variable 'plaintextblock' [-Wunused-variable]
morus1280128v1sse2.c:     uint8_t plaintextblock[32], ciphertextblock[32];
morus1280128v1sse2.c:             ^
morus1280128v1sse2.c: morus1280128v1sse2.c:359:16: warning: unused variable 'j' [-Wunused-variable]
morus1280128v1sse2.c:     uint64_t i,j;
morus1280128v1sse2.c:                ^
morus1280128v1sse2.c: morus1280128v1sse2.c:360:13: warning: unused variable 'plaintextblock' [-Wunused-variable]
morus1280128v1sse2.c:     uint8_t plaintextblock[32], ciphertextblock[32];
morus1280128v1sse2.c:             ^
morus1280128v1sse2.c: morus1280128v1sse2.c:361:13: warning: unused variable 'tag' [-Wunused-variable]
morus1280128v1sse2.c: ...

Number of similar (implementation,compiler) pairs: 1, namely:
ImplementationCompiler
T:sse2clang -march=native -O2 -fwrapv -Qunused-arguments -fPIC -fPIE -gdwarf-4 -Wall (Debian_Clang_14.0.6)

Compiler output


morus1280128v1sse2.c: morus1280128v1sse2.c:197:21: warning: unused variable 't2' [-Wunused-variable]
morus1280128v1sse2.c:     __m128i tt, t1, t2;
morus1280128v1sse2.c:                     ^
morus1280128v1sse2.c: morus1280128v1sse2.c:197:17: warning: unused variable 't1' [-Wunused-variable]
morus1280128v1sse2.c:     __m128i tt, t1, t2;
morus1280128v1sse2.c:                 ^
morus1280128v1sse2.c: morus1280128v1sse2.c:197:13: warning: unused variable 'tt' [-Wunused-variable]
morus1280128v1sse2.c:     __m128i tt, t1, t2;
morus1280128v1sse2.c:             ^
morus1280128v1sse2.c: morus1280128v1sse2.c:196:13: warning: unused variable 't' [-Wunused-variable]
morus1280128v1sse2.c:     __m128i t;
morus1280128v1sse2.c:             ^
morus1280128v1sse2.c: morus1280128v1sse2.c:222:13: warning: unused variable 't' [-Wunused-variable]
morus1280128v1sse2.c:     __m128i t;
morus1280128v1sse2.c:             ^
morus1280128v1sse2.c: morus1280128v1sse2.c:314:13: warning: unused variable 'plaintextblock' [-Wunused-variable]
morus1280128v1sse2.c:     uint8_t plaintextblock[32], ciphertextblock[32];
morus1280128v1sse2.c:             ^
morus1280128v1sse2.c: morus1280128v1sse2.c:359:16: warning: unused variable 'j' [-Wunused-variable]
morus1280128v1sse2.c:     uint64_t i,j;
morus1280128v1sse2.c:                ^
morus1280128v1sse2.c: morus1280128v1sse2.c:361:13: warning: unused variable 'tag' [-Wunused-variable]
morus1280128v1sse2.c:     uint8_t tag[16];
morus1280128v1sse2.c:             ^
morus1280128v1sse2.c: morus1280128v1sse2.c:360:13: warning: unused variable 'plaintextblock' [-Wunused-variable]
morus1280128v1sse2.c: ...

Number of similar (implementation,compiler) pairs: 1, namely:
ImplementationCompiler
T:sse2clang -march=native -O3 -fwrapv -Qunused-arguments -fPIC -fPIE -gdwarf-4 -Wall (Debian_Clang_14.0.6)

Compiler output


morus1280128v1sse2.c: morus1280128v1sse2.c:197:17: warning: unused variable 't1' [-Wunused-variable]
morus1280128v1sse2.c:     __m128i tt, t1, t2;
morus1280128v1sse2.c:                 ^
morus1280128v1sse2.c: morus1280128v1sse2.c:197:21: warning: unused variable 't2' [-Wunused-variable]
morus1280128v1sse2.c:     __m128i tt, t1, t2;
morus1280128v1sse2.c:                     ^
morus1280128v1sse2.c: morus1280128v1sse2.c:196:13: warning: unused variable 't' [-Wunused-variable]
morus1280128v1sse2.c:     __m128i t;
morus1280128v1sse2.c:             ^
morus1280128v1sse2.c: morus1280128v1sse2.c:197:13: warning: unused variable 'tt' [-Wunused-variable]
morus1280128v1sse2.c:     __m128i tt, t1, t2;
morus1280128v1sse2.c:             ^
morus1280128v1sse2.c: morus1280128v1sse2.c:222:13: warning: unused variable 't' [-Wunused-variable]
morus1280128v1sse2.c:     __m128i t;
morus1280128v1sse2.c:             ^
morus1280128v1sse2.c: morus1280128v1sse2.c:314:13: warning: unused variable 'plaintextblock' [-Wunused-variable]
morus1280128v1sse2.c:     uint8_t plaintextblock[32], ciphertextblock[32];
morus1280128v1sse2.c:             ^
morus1280128v1sse2.c: morus1280128v1sse2.c:361:13: warning: unused variable 'tag' [-Wunused-variable]
morus1280128v1sse2.c:     uint8_t tag[16];
morus1280128v1sse2.c:             ^
morus1280128v1sse2.c: morus1280128v1sse2.c:362:13: warning: unused variable 'check' [-Wunused-variable]
morus1280128v1sse2.c:     uint8_t check = 0;
morus1280128v1sse2.c:             ^
morus1280128v1sse2.c: morus1280128v1sse2.c:359:16: warning: unused variable 'j' [-Wunused-variable]
morus1280128v1sse2.c: ...

Number of similar (implementation,compiler) pairs: 1, namely:
ImplementationCompiler
T:sse2clang -march=native -O -fwrapv -Qunused-arguments -fPIC -fPIE -gdwarf-4 -Wall (Debian_Clang_14.0.6)

Compiler output


morus1280128v1sse2.c: morus1280128v1sse2.c:196:13: warning: unused variable 't' [-Wunused-variable]
morus1280128v1sse2.c:     __m128i t;
morus1280128v1sse2.c:             ^
morus1280128v1sse2.c: morus1280128v1sse2.c:197:13: warning: unused variable 'tt' [-Wunused-variable]
morus1280128v1sse2.c:     __m128i tt, t1, t2;
morus1280128v1sse2.c:             ^
morus1280128v1sse2.c: morus1280128v1sse2.c:197:17: warning: unused variable 't1' [-Wunused-variable]
morus1280128v1sse2.c:     __m128i tt, t1, t2;
morus1280128v1sse2.c:                 ^
morus1280128v1sse2.c: morus1280128v1sse2.c:197:21: warning: unused variable 't2' [-Wunused-variable]
morus1280128v1sse2.c:     __m128i tt, t1, t2;
morus1280128v1sse2.c:                     ^
morus1280128v1sse2.c: morus1280128v1sse2.c:222:13: warning: unused variable 't' [-Wunused-variable]
morus1280128v1sse2.c:     __m128i t;
morus1280128v1sse2.c:             ^
morus1280128v1sse2.c: morus1280128v1sse2.c:314:13: warning: unused variable 'plaintextblock' [-Wunused-variable]
morus1280128v1sse2.c:     uint8_t plaintextblock[32], ciphertextblock[32];
morus1280128v1sse2.c:             ^
morus1280128v1sse2.c: morus1280128v1sse2.c:362:13: warning: unused variable 'check' [-Wunused-variable]
morus1280128v1sse2.c:     uint8_t check = 0;
morus1280128v1sse2.c:             ^
morus1280128v1sse2.c: morus1280128v1sse2.c:360:13: warning: unused variable 'plaintextblock' [-Wunused-variable]
morus1280128v1sse2.c:     uint8_t plaintextblock[32], ciphertextblock[32];
morus1280128v1sse2.c:             ^
morus1280128v1sse2.c: morus1280128v1sse2.c:359:16: warning: unused variable 'j' [-Wunused-variable]
morus1280128v1sse2.c: ...

Number of similar (implementation,compiler) pairs: 1, namely:
ImplementationCompiler
T:sse2clang -march=native -Os -fwrapv -Qunused-arguments -fPIC -fPIE -gdwarf-4 -Wall (Debian_Clang_14.0.6)

Compiler output


morus1280128v1sse2.c: morus1280128v1sse2.c:197:21: warning: unused variable 't2' [-Wunused-variable]
morus1280128v1sse2.c:     __m128i tt, t1, t2;
morus1280128v1sse2.c:                     ^
morus1280128v1sse2.c: morus1280128v1sse2.c:197:17: warning: unused variable 't1' [-Wunused-variable]
morus1280128v1sse2.c:     __m128i tt, t1, t2;
morus1280128v1sse2.c:                 ^
morus1280128v1sse2.c: morus1280128v1sse2.c:197:13: warning: unused variable 'tt' [-Wunused-variable]
morus1280128v1sse2.c:     __m128i tt, t1, t2;
morus1280128v1sse2.c:             ^
morus1280128v1sse2.c: morus1280128v1sse2.c:196:13: warning: unused variable 't' [-Wunused-variable]
morus1280128v1sse2.c:     __m128i t;
morus1280128v1sse2.c:             ^
morus1280128v1sse2.c: morus1280128v1sse2.c:222:13: warning: unused variable 't' [-Wunused-variable]
morus1280128v1sse2.c:     __m128i t;
morus1280128v1sse2.c:             ^
morus1280128v1sse2.c: morus1280128v1sse2.c:314:13: warning: unused variable 'plaintextblock' [-Wunused-variable]
morus1280128v1sse2.c:     uint8_t plaintextblock[32], ciphertextblock[32];
morus1280128v1sse2.c:             ^
morus1280128v1sse2.c: morus1280128v1sse2.c:359:16: warning: unused variable 'j' [-Wunused-variable]
morus1280128v1sse2.c:     uint64_t i,j;
morus1280128v1sse2.c:                ^
morus1280128v1sse2.c: morus1280128v1sse2.c:362:13: warning: unused variable 'check' [-Wunused-variable]
morus1280128v1sse2.c:     uint8_t check = 0;
morus1280128v1sse2.c:             ^
morus1280128v1sse2.c: morus1280128v1sse2.c:361:13: warning: unused variable 'tag' [-Wunused-variable]
morus1280128v1sse2.c: ...

Number of similar (implementation,compiler) pairs: 1, namely:
ImplementationCompiler
T:sse2clang -mcpu=native -O3 -fwrapv -Qunused-arguments -fPIC -fPIE -gdwarf-4 -Wall (Debian_Clang_14.0.6)

Compiler output


morus1280128v1sse2.c: morus1280128v1sse2.c: In function 'morus_enc_aut_step':
morus1280128v1sse2.c: morus1280128v1sse2.c:197:21: warning: unused variable 't2' [-Wunused-variable]
morus1280128v1sse2.c:   197 |     __m128i tt, t1, t2;
morus1280128v1sse2.c:       |                     ^~
morus1280128v1sse2.c: morus1280128v1sse2.c:197:17: warning: unused variable 't1' [-Wunused-variable]
morus1280128v1sse2.c:   197 |     __m128i tt, t1, t2;
morus1280128v1sse2.c:       |                 ^~
morus1280128v1sse2.c: morus1280128v1sse2.c:197:13: warning: unused variable 'tt' [-Wunused-variable]
morus1280128v1sse2.c:   197 |     __m128i tt, t1, t2;
morus1280128v1sse2.c:       |             ^~
morus1280128v1sse2.c: morus1280128v1sse2.c:196:13: warning: unused variable 't' [-Wunused-variable]
morus1280128v1sse2.c:   196 |     __m128i t;
morus1280128v1sse2.c:       |             ^
morus1280128v1sse2.c: morus1280128v1sse2.c: In function 'morus_dec_aut_step':
morus1280128v1sse2.c: morus1280128v1sse2.c:222:13: warning: unused variable 't' [-Wunused-variable]
morus1280128v1sse2.c:   222 |     __m128i t;
morus1280128v1sse2.c:       |             ^
morus1280128v1sse2.c: morus1280128v1sse2.c: In function 'crypto_aead_morus1280128v1_sse2_timingleaks_encrypt':
morus1280128v1sse2.c: morus1280128v1sse2.c:314:13: warning: unused variable 'plaintextblock' [-Wunused-variable]
morus1280128v1sse2.c:   314 |     uint8_t plaintextblock[32], ciphertextblock[32];
morus1280128v1sse2.c:       |             ^~~~~~~~~~~~~~
morus1280128v1sse2.c: morus1280128v1sse2.c: In function 'crypto_aead_morus1280128v1_sse2_timingleaks_decrypt':
morus1280128v1sse2.c: morus1280128v1sse2.c:362:13: warning: unused variable 'check' [-Wunused-variable]
morus1280128v1sse2.c:   362 |     uint8_t check = 0;
morus1280128v1sse2.c:       |             ^~~~~
morus1280128v1sse2.c: ...
try.c: /usr/bin/ld: libcrypto_aead_morus1280128v1.a(morus1280128v1sse2.o): in function `morus_initialization':
try.c: .../supercop-data/comet/amd64/try/c/gcc_-march=native_-mtune=native_-O2_-fwrapv_-fPIC_-fPIE_-gdwarf-4_-Wall/timingleaks/crypto_aead/morus1280128v1/sse2/work/morus1280128v1sse2.c:98: undefined reference to `morus_stateupdate'
try.c: /usr/bin/ld: libcrypto_aead_morus1280128v1.a(morus1280128v1sse2.o): in function `morus_initialization_key_256':
try.c: .../supercop-data/comet/amd64/try/c/gcc_-march=native_-mtune=native_-O2_-fwrapv_-fPIC_-fPIE_-gdwarf-4_-Wall/timingleaks/crypto_aead/morus1280128v1/sse2/work/morus1280128v1sse2.c:118: undefined reference to `morus_stateupdate'
try.c: /usr/bin/ld: libcrypto_aead_morus1280128v1.a(morus1280128v1sse2.o): in function `morus_tag_generation':
try.c: .../supercop-data/comet/amd64/try/c/gcc_-march=native_-mtune=native_-O2_-fwrapv_-fPIC_-fPIE_-gdwarf-4_-Wall/timingleaks/crypto_aead/morus1280128v1/sse2/work/morus1280128v1sse2.c:143: undefined reference to `morus_stateupdate'
try.c: /usr/bin/ld: libcrypto_aead_morus1280128v1.a(morus1280128v1sse2.o): in function `morus_tag_verification':
try.c: .../supercop-data/comet/amd64/try/c/gcc_-march=native_-mtune=native_-O2_-fwrapv_-fPIC_-fPIE_-gdwarf-4_-Wall/timingleaks/crypto_aead/morus1280128v1/sse2/work/morus1280128v1sse2.c:174: undefined reference to `morus_stateupdate'
try.c: /usr/bin/ld: libcrypto_aead_morus1280128v1.a(morus1280128v1sse2.o): in function `morus_enc_aut_partialblock':
try.c: .../supercop-data/comet/amd64/try/c/gcc_-march=native_-mtune=native_-O2_-fwrapv_-fPIC_-fPIE_-gdwarf-4_-Wall/timingleaks/crypto_aead/morus1280128v1/sse2/work/morus1280128v1sse2.c:266: undefined reference to `morus_stateupdate'
try.c: /usr/bin/ld: libcrypto_aead_morus1280128v1.a(morus1280128v1sse2.o):.../supercop-data/comet/amd64/try/c/gcc_-march=native_-mtune=native_-O2_-fwrapv_-fPIC_-fPIE_-gdwarf-4_-Wall/timingleaks/crypto_aead/morus1280128v1/sse2/work/morus1280128v1sse2.c:298: more undefined references to `morus_stateupdate' follow
try.c: collect2: error: ld returned 1 exit status

Number of similar (implementation,compiler) pairs: 1, namely:
ImplementationCompiler
T:sse2gcc -march=native -mtune=native -O2 -fwrapv -fPIC -fPIE -gdwarf-4 -Wall (12.2.0)

Compiler output


morus1280128v1sse2.c: morus1280128v1sse2.c: In function 'morus_enc_aut_step':
morus1280128v1sse2.c: morus1280128v1sse2.c:197:21: warning: unused variable 't2' [-Wunused-variable]
morus1280128v1sse2.c:   197 |     __m128i tt, t1, t2;
morus1280128v1sse2.c:       |                     ^~
morus1280128v1sse2.c: morus1280128v1sse2.c:197:17: warning: unused variable 't1' [-Wunused-variable]
morus1280128v1sse2.c:   197 |     __m128i tt, t1, t2;
morus1280128v1sse2.c:       |                 ^~
morus1280128v1sse2.c: morus1280128v1sse2.c:197:13: warning: unused variable 'tt' [-Wunused-variable]
morus1280128v1sse2.c:   197 |     __m128i tt, t1, t2;
morus1280128v1sse2.c:       |             ^~
morus1280128v1sse2.c: morus1280128v1sse2.c:196:13: warning: unused variable 't' [-Wunused-variable]
morus1280128v1sse2.c:   196 |     __m128i t;
morus1280128v1sse2.c:       |             ^
morus1280128v1sse2.c: morus1280128v1sse2.c: In function 'morus_dec_aut_step':
morus1280128v1sse2.c: morus1280128v1sse2.c:222:13: warning: unused variable 't' [-Wunused-variable]
morus1280128v1sse2.c:   222 |     __m128i t;
morus1280128v1sse2.c:       |             ^
morus1280128v1sse2.c: morus1280128v1sse2.c: In function 'crypto_aead_morus1280128v1_sse2_timingleaks_encrypt':
morus1280128v1sse2.c: morus1280128v1sse2.c:314:13: warning: unused variable 'plaintextblock' [-Wunused-variable]
morus1280128v1sse2.c:   314 |     uint8_t plaintextblock[32], ciphertextblock[32];
morus1280128v1sse2.c:       |             ^~~~~~~~~~~~~~
morus1280128v1sse2.c: morus1280128v1sse2.c: In function 'crypto_aead_morus1280128v1_sse2_timingleaks_decrypt':
morus1280128v1sse2.c: morus1280128v1sse2.c:362:13: warning: unused variable 'check' [-Wunused-variable]
morus1280128v1sse2.c:   362 |     uint8_t check = 0;
morus1280128v1sse2.c:       |             ^~~~~
morus1280128v1sse2.c: ...

Number of similar (implementation,compiler) pairs: 1, namely:
ImplementationCompiler
T:sse2gcc -march=native -mtune=native -O3 -fwrapv -fPIC -fPIE -gdwarf-4 -Wall (12.2.0)

Compiler output


morus1280128v1sse2.c: morus1280128v1sse2.c: In function 'morus_enc_aut_step':
morus1280128v1sse2.c: morus1280128v1sse2.c:197:21: warning: unused variable 't2' [-Wunused-variable]
morus1280128v1sse2.c:   197 |     __m128i tt, t1, t2;
morus1280128v1sse2.c:       |                     ^~
morus1280128v1sse2.c: morus1280128v1sse2.c:197:17: warning: unused variable 't1' [-Wunused-variable]
morus1280128v1sse2.c:   197 |     __m128i tt, t1, t2;
morus1280128v1sse2.c:       |                 ^~
morus1280128v1sse2.c: morus1280128v1sse2.c:197:13: warning: unused variable 'tt' [-Wunused-variable]
morus1280128v1sse2.c:   197 |     __m128i tt, t1, t2;
morus1280128v1sse2.c:       |             ^~
morus1280128v1sse2.c: morus1280128v1sse2.c:196:13: warning: unused variable 't' [-Wunused-variable]
morus1280128v1sse2.c:   196 |     __m128i t;
morus1280128v1sse2.c:       |             ^
morus1280128v1sse2.c: morus1280128v1sse2.c: In function 'morus_dec_aut_step':
morus1280128v1sse2.c: morus1280128v1sse2.c:222:13: warning: unused variable 't' [-Wunused-variable]
morus1280128v1sse2.c:   222 |     __m128i t;
morus1280128v1sse2.c:       |             ^
morus1280128v1sse2.c: morus1280128v1sse2.c: In function 'crypto_aead_morus1280128v1_sse2_timingleaks_encrypt':
morus1280128v1sse2.c: morus1280128v1sse2.c:314:13: warning: unused variable 'plaintextblock' [-Wunused-variable]
morus1280128v1sse2.c:   314 |     uint8_t plaintextblock[32], ciphertextblock[32];
morus1280128v1sse2.c:       |             ^~~~~~~~~~~~~~
morus1280128v1sse2.c: morus1280128v1sse2.c: In function 'crypto_aead_morus1280128v1_sse2_timingleaks_decrypt':
morus1280128v1sse2.c: morus1280128v1sse2.c:362:13: warning: unused variable 'check' [-Wunused-variable]
morus1280128v1sse2.c:   362 |     uint8_t check = 0;
morus1280128v1sse2.c:       |             ^~~~~
morus1280128v1sse2.c: ...
try.c: /usr/bin/ld: libcrypto_aead_morus1280128v1.a(morus1280128v1sse2.o): in function `morus_initialization':
try.c: .../supercop-data/comet/amd64/try/c/gcc_-march=native_-mtune=native_-O_-fwrapv_-fPIC_-fPIE_-gdwarf-4_-Wall/timingleaks/crypto_aead/morus1280128v1/sse2/work/morus1280128v1sse2.c:98: undefined reference to `morus_stateupdate'
try.c: /usr/bin/ld: libcrypto_aead_morus1280128v1.a(morus1280128v1sse2.o): in function `morus_initialization_key_256':
try.c: .../supercop-data/comet/amd64/try/c/gcc_-march=native_-mtune=native_-O_-fwrapv_-fPIC_-fPIE_-gdwarf-4_-Wall/timingleaks/crypto_aead/morus1280128v1/sse2/work/morus1280128v1sse2.c:118: undefined reference to `morus_stateupdate'
try.c: /usr/bin/ld: libcrypto_aead_morus1280128v1.a(morus1280128v1sse2.o): in function `morus_tag_generation':
try.c: .../supercop-data/comet/amd64/try/c/gcc_-march=native_-mtune=native_-O_-fwrapv_-fPIC_-fPIE_-gdwarf-4_-Wall/timingleaks/crypto_aead/morus1280128v1/sse2/work/morus1280128v1sse2.c:143: undefined reference to `morus_stateupdate'
try.c: /usr/bin/ld: libcrypto_aead_morus1280128v1.a(morus1280128v1sse2.o): in function `morus_tag_verification':
try.c: .../supercop-data/comet/amd64/try/c/gcc_-march=native_-mtune=native_-O_-fwrapv_-fPIC_-fPIE_-gdwarf-4_-Wall/timingleaks/crypto_aead/morus1280128v1/sse2/work/morus1280128v1sse2.c:174: undefined reference to `morus_stateupdate'
try.c: /usr/bin/ld: libcrypto_aead_morus1280128v1.a(morus1280128v1sse2.o): in function `morus_enc_aut_partialblock':
try.c: .../supercop-data/comet/amd64/try/c/gcc_-march=native_-mtune=native_-O_-fwrapv_-fPIC_-fPIE_-gdwarf-4_-Wall/timingleaks/crypto_aead/morus1280128v1/sse2/work/morus1280128v1sse2.c:266: undefined reference to `morus_stateupdate'
try.c: /usr/bin/ld: libcrypto_aead_morus1280128v1.a(morus1280128v1sse2.o):.../supercop-data/comet/amd64/try/c/gcc_-march=native_-mtune=native_-O_-fwrapv_-fPIC_-fPIE_-gdwarf-4_-Wall/timingleaks/crypto_aead/morus1280128v1/sse2/work/morus1280128v1sse2.c:298: more undefined references to `morus_stateupdate' follow
try.c: collect2: error: ld returned 1 exit status

Number of similar (implementation,compiler) pairs: 1, namely:
ImplementationCompiler
T:sse2gcc -march=native -mtune=native -O -fwrapv -fPIC -fPIE -gdwarf-4 -Wall (12.2.0)

Compiler output


morus1280128v1sse2.c: morus1280128v1sse2.c: In function 'morus_enc_aut_step':
morus1280128v1sse2.c: morus1280128v1sse2.c:197:21: warning: unused variable 't2' [-Wunused-variable]
morus1280128v1sse2.c:   197 |     __m128i tt, t1, t2;
morus1280128v1sse2.c:       |                     ^~
morus1280128v1sse2.c: morus1280128v1sse2.c:197:17: warning: unused variable 't1' [-Wunused-variable]
morus1280128v1sse2.c:   197 |     __m128i tt, t1, t2;
morus1280128v1sse2.c:       |                 ^~
morus1280128v1sse2.c: morus1280128v1sse2.c:197:13: warning: unused variable 'tt' [-Wunused-variable]
morus1280128v1sse2.c:   197 |     __m128i tt, t1, t2;
morus1280128v1sse2.c:       |             ^~
morus1280128v1sse2.c: morus1280128v1sse2.c:196:13: warning: unused variable 't' [-Wunused-variable]
morus1280128v1sse2.c:   196 |     __m128i t;
morus1280128v1sse2.c:       |             ^
morus1280128v1sse2.c: morus1280128v1sse2.c: In function 'morus_dec_aut_step':
morus1280128v1sse2.c: morus1280128v1sse2.c:222:13: warning: unused variable 't' [-Wunused-variable]
morus1280128v1sse2.c:   222 |     __m128i t;
morus1280128v1sse2.c:       |             ^
morus1280128v1sse2.c: morus1280128v1sse2.c: In function 'crypto_aead_morus1280128v1_sse2_timingleaks_encrypt':
morus1280128v1sse2.c: morus1280128v1sse2.c:314:13: warning: unused variable 'plaintextblock' [-Wunused-variable]
morus1280128v1sse2.c:   314 |     uint8_t plaintextblock[32], ciphertextblock[32];
morus1280128v1sse2.c:       |             ^~~~~~~~~~~~~~
morus1280128v1sse2.c: morus1280128v1sse2.c: In function 'crypto_aead_morus1280128v1_sse2_timingleaks_decrypt':
morus1280128v1sse2.c: morus1280128v1sse2.c:362:13: warning: unused variable 'check' [-Wunused-variable]
morus1280128v1sse2.c:   362 |     uint8_t check = 0;
morus1280128v1sse2.c:       |             ^~~~~
morus1280128v1sse2.c: ...
try.c: /usr/bin/ld: libcrypto_aead_morus1280128v1.a(morus1280128v1sse2.o): in function `morus_initialization':
try.c: .../supercop-data/comet/amd64/try/c/gcc_-march=native_-mtune=native_-Os_-fwrapv_-fPIC_-fPIE_-gdwarf-4_-Wall/timingleaks/crypto_aead/morus1280128v1/sse2/work/morus1280128v1sse2.c:98: undefined reference to `morus_stateupdate'
try.c: /usr/bin/ld: libcrypto_aead_morus1280128v1.a(morus1280128v1sse2.o): in function `morus_initialization_key_256':
try.c: .../supercop-data/comet/amd64/try/c/gcc_-march=native_-mtune=native_-Os_-fwrapv_-fPIC_-fPIE_-gdwarf-4_-Wall/timingleaks/crypto_aead/morus1280128v1/sse2/work/morus1280128v1sse2.c:118: undefined reference to `morus_stateupdate'
try.c: /usr/bin/ld: libcrypto_aead_morus1280128v1.a(morus1280128v1sse2.o): in function `morus_tag_generation':
try.c: .../supercop-data/comet/amd64/try/c/gcc_-march=native_-mtune=native_-Os_-fwrapv_-fPIC_-fPIE_-gdwarf-4_-Wall/timingleaks/crypto_aead/morus1280128v1/sse2/work/morus1280128v1sse2.c:143: undefined reference to `morus_stateupdate'
try.c: /usr/bin/ld: libcrypto_aead_morus1280128v1.a(morus1280128v1sse2.o): in function `morus_tag_verification':
try.c: .../supercop-data/comet/amd64/try/c/gcc_-march=native_-mtune=native_-Os_-fwrapv_-fPIC_-fPIE_-gdwarf-4_-Wall/timingleaks/crypto_aead/morus1280128v1/sse2/work/morus1280128v1sse2.c:174: undefined reference to `morus_stateupdate'
try.c: /usr/bin/ld: libcrypto_aead_morus1280128v1.a(morus1280128v1sse2.o): in function `morus_enc_aut_partialblock':
try.c: .../supercop-data/comet/amd64/try/c/gcc_-march=native_-mtune=native_-Os_-fwrapv_-fPIC_-fPIE_-gdwarf-4_-Wall/timingleaks/crypto_aead/morus1280128v1/sse2/work/morus1280128v1sse2.c:266: undefined reference to `morus_stateupdate'
try.c: /usr/bin/ld: libcrypto_aead_morus1280128v1.a(morus1280128v1sse2.o):.../supercop-data/comet/amd64/try/c/gcc_-march=native_-mtune=native_-Os_-fwrapv_-fPIC_-fPIE_-gdwarf-4_-Wall/timingleaks/crypto_aead/morus1280128v1/sse2/work/morus1280128v1sse2.c:298: more undefined references to `morus_stateupdate' follow
try.c: /usr/bin/ld: libcrypto_aead_morus1280128v1.a(morus1280128v1sse2.o): in function `crypto_aead_morus1280128v1_sse2_timingleaks_encrypt':
try.c: .../supercop-data/comet/amd64/try/c/gcc_-march=native_-mtune=native_-Os_-fwrapv_-fPIC_-fPIE_-gdwarf-4_-Wall/timingleaks/crypto_aead/morus1280128v1/sse2/work/morus1280128v1sse2.c:323: undefined reference to `morus_enc_aut_step'
try.c: /usr/bin/ld: .../supercop-data/comet/amd64/try/c/gcc_-march=native_-mtune=native_-Os_-fwrapv_-fPIC_-fPIE_-gdwarf-4_-Wall/timingleaks/crypto_aead/morus1280128v1/sse2/work/morus1280128v1sse2.c:334: undefined reference to `morus_enc_aut_step'
try.c: /usr/bin/ld: libcrypto_aead_morus1280128v1.a(morus1280128v1sse2.o): in function `crypto_aead_morus1280128v1_sse2_timingleaks_decrypt':
try.c: .../supercop-data/comet/amd64/try/c/gcc_-march=native_-mtune=native_-Os_-fwrapv_-fPIC_-fPIE_-gdwarf-4_-Wall/timingleaks/crypto_aead/morus1280128v1/sse2/work/morus1280128v1sse2.c:369: undefined reference to `morus_enc_aut_step'
try.c: /usr/bin/ld: .../supercop-data/comet/amd64/try/c/gcc_-march=native_-mtune=native_-Os_-fwrapv_-fPIC_-fPIE_-gdwarf-4_-Wall/timingleaks/crypto_aead/morus1280128v1/sse2/work/morus1280128v1sse2.c:381: undefined reference to `morus_dec_aut_step'
try.c: collect2: error: ld returned 1 exit status

Number of similar (implementation,compiler) pairs: 1, namely:
ImplementationCompiler
T:sse2gcc -march=native -mtune=native -Os -fwrapv -fPIC -fPIE -gdwarf-4 -Wall (12.2.0)