Implementation notes: amd64, comet, crypto_aead/aegis128

Computer: comet
Architecture: amd64
CPU ID: GenuineIntel-000806ec-bfebfbff
SUPERCOP version: 20211108
Operation: crypto_aead
Primitive: aegis128
TimeObject sizeTest sizeImplementationCompilerBenchmark dateSUPERCOP version
31562521 0 016096 804 1008T:aesniclang_-march=native_-Os_-fomit-frame-pointer_-fwrapv_-Qunused-arguments_-fPIC_-fPIE2021011520210114
31733848 0 021210 812 1040T:aesniclang_-march=native_-O_-fomit-frame-pointer_-fwrapv_-Qunused-arguments_-fPIC_-fPIE2021011520210114
31773848 0 021210 812 1040T:aesniclang_-march=native_-O2_-fomit-frame-pointer_-fwrapv_-Qunused-arguments_-fPIC_-fPIE2021011520210114
31783896 0 021402 812 1040T:aesniclang_-march=native_-O3_-fomit-frame-pointer_-fwrapv_-Qunused-arguments_-fPIC_-fPIE2021011520210114
32664126 0 020911 828 1040T:aesnigcc_-march=native_-mtune=native_-O3_-fomit-frame-pointer_-fwrapv_-fPIC_-fPIE2021011520210114
33263068 0 017262 820 1040T:aesnigcc_-march=native_-mtune=native_-O_-fomit-frame-pointer_-fwrapv_-fPIC_-fPIE2021011520210114
33333273 0 017542 820 1040T:aesnigcc_-march=native_-mtune=native_-O2_-fomit-frame-pointer_-fwrapv_-fPIC_-fPIE2021011520210114
452355077 4096 021778 4916 1008T:refclang_-mcpu=native_-O3_-fomit-frame-pointer_-fwrapv_-Qunused-arguments_-fPIC_-fPIE2021011520210114
456403815 4096 021242 4916 1040T:refclang_-march=native_-O_-fomit-frame-pointer_-fwrapv_-Qunused-arguments_-fPIC_-fPIE2021011520210114
457213595 4096 017232 4908 1008T:refclang_-march=native_-Os_-fomit-frame-pointer_-fwrapv_-Qunused-arguments_-fPIC_-fPIE2021011520210114
457225185 4096 019430 4924 1040T:refgcc_-march=native_-mtune=native_-O2_-fomit-frame-pointer_-fwrapv_-fPIC_-fPIE2021011520210114
460274945 4096 021727 4932 1040T:refgcc_-march=native_-mtune=native_-O3_-fomit-frame-pointer_-fwrapv_-fPIC_-fPIE2021011520210114
461195247 4096 022834 4916 1040T:refclang_-march=native_-O3_-fomit-frame-pointer_-fwrapv_-Qunused-arguments_-fPIC_-fPIE2021011520210114
464884944 4096 019094 4924 1040T:refgcc_-march=native_-mtune=native_-O_-fomit-frame-pointer_-fwrapv_-fPIC_-fPIE2021011520210114
476923815 4096 021242 4916 1040T:refclang_-march=native_-O2_-fomit-frame-pointer_-fwrapv_-Qunused-arguments_-fPIC_-fPIE2021011520210114

Compiler output

Implementation: T:aesni
Security model: timingleaks
Compiler: clang -mcpu=native -O3 -fomit-frame-pointer -fwrapv -Qunused-arguments -fPIC -fPIE
encrypt.c: encrypt.c:34:25: error: always_inline function '_mm_aesenc_si128' requires target feature 'aes', but would be inlined into function 'aegis128_initialization' that is compiled without support for 'aes'
encrypt.c: state[4] = _mm_aesenc_si128(state[3], state[4]);
encrypt.c: ^
encrypt.c: encrypt.c:35:25: error: always_inline function '_mm_aesenc_si128' requires target feature 'aes', but would be inlined into function 'aegis128_initialization' that is compiled without support for 'aes'
encrypt.c: state[3] = _mm_aesenc_si128(state[2], state[3]);
encrypt.c: ^
encrypt.c: encrypt.c:36:25: error: always_inline function '_mm_aesenc_si128' requires target feature 'aes', but would be inlined into function 'aegis128_initialization' that is compiled without support for 'aes'
encrypt.c: state[2] = _mm_aesenc_si128(state[1], state[2]);
encrypt.c: ^
encrypt.c: encrypt.c:37:25: error: always_inline function '_mm_aesenc_si128' requires target feature 'aes', but would be inlined into function 'aegis128_initialization' that is compiled without support for 'aes'
encrypt.c: state[1] = _mm_aesenc_si128(state[0], state[1]);
encrypt.c: ^
encrypt.c: encrypt.c:38:25: error: always_inline function '_mm_aesenc_si128' requires target feature 'aes', but would be inlined into function 'aegis128_initialization' that is compiled without support for 'aes'
encrypt.c: state[0] = _mm_aesenc_si128(tmp, state[0]);
encrypt.c: ^
encrypt.c: 5 errors generated.

Number of similar (compiler,implementation) pairs: 1, namely:
CompilerImplementations
clang -mcpu=native -O3 -fomit-frame-pointer -fwrapv -Qunused-arguments -fPIC -fPIE T:aesni

Compiler output

Implementation: T:aesni
Security model: timingleaks
Compiler: gcc -march=native -mtune=native -Os -fomit-frame-pointer -fwrapv -fPIC -fPIE
try.c: /usr/bin/ld: crypto_aead_aegis128.a(encrypt.o): in function `crypto_aead_aegis128_aesni_timingleaks_encrypt':
try.c: encrypt.c:(.text+0x...): undefined reference to `aegis128_enc_aut_step'
try.c: /usr/bin/ld: encrypt.c:(.text+0x...): undefined reference to `aegis128_enc_aut_step'
try.c: /usr/bin/ld: encrypt.c:(.text+0x...): undefined reference to `aegis128_enc_aut_step'
try.c: /usr/bin/ld: encrypt.c:(.text+0x...): undefined reference to `aegis128_enc_aut_step'
try.c: /usr/bin/ld: crypto_aead_aegis128.a(encrypt.o): in function `crypto_aead_aegis128_aesni_timingleaks_decrypt':
try.c: encrypt.c:(.text+0x...): undefined reference to `aegis128_enc_aut_step'
try.c: /usr/bin/ld: crypto_aead_aegis128.a(encrypt.o):encrypt.c:(.text+0x...): more undefined references to `aegis128_enc_aut_step' follow
try.c: /usr/bin/ld: crypto_aead_aegis128.a(encrypt.o): in function `crypto_aead_aegis128_aesni_timingleaks_decrypt':
try.c: encrypt.c:(.text+0x...): undefined reference to `aegis128_dec_aut_step'
try.c: /usr/bin/ld: encrypt.c:(.text+0x...): undefined reference to `aegis128_dec_aut_step'
try.c: collect2: error: ld returned 1 exit status

Number of similar (compiler,implementation) pairs: 1, namely:
CompilerImplementations
gcc -march=native -mtune=native -Os -fomit-frame-pointer -fwrapv -fPIC -fPIE T:aesni

Compiler output

Implementation: T:ref
Security model: timingleaks
Compiler: gcc -march=native -mtune=native -Os -fomit-frame-pointer -fwrapv -fPIC -fPIE
try.c: /usr/bin/ld: crypto_aead_aegis128.a(encrypt.o): in function `crypto_aead_aegis128_ref_timingleaks_encrypt':
try.c: encrypt.c:(.text+0x...): undefined reference to `aegis128_enc_aut_step'
try.c: /usr/bin/ld: encrypt.c:(.text+0x...): undefined reference to `aegis128_enc_aut_step'
try.c: /usr/bin/ld: encrypt.c:(.text+0x...): undefined reference to `aegis128_enc_aut_step'
try.c: /usr/bin/ld: encrypt.c:(.text+0x...): undefined reference to `aegis128_enc_aut_step'
try.c: /usr/bin/ld: crypto_aead_aegis128.a(encrypt.o): in function `crypto_aead_aegis128_ref_timingleaks_decrypt':
try.c: encrypt.c:(.text+0x...): undefined reference to `aegis128_enc_aut_step'
try.c: /usr/bin/ld: crypto_aead_aegis128.a(encrypt.o):encrypt.c:(.text+0x...): more undefined references to `aegis128_enc_aut_step' follow
try.c: /usr/bin/ld: crypto_aead_aegis128.a(encrypt.o): in function `crypto_aead_aegis128_ref_timingleaks_decrypt':
try.c: encrypt.c:(.text+0x...): undefined reference to `aegis128_dec_aut_step'
try.c: /usr/bin/ld: encrypt.c:(.text+0x...): undefined reference to `aegis128_dec_aut_step'
try.c: collect2: error: ld returned 1 exit status

Number of similar (compiler,implementation) pairs: 1, namely:
CompilerImplementations
gcc -march=native -mtune=native -Os -fomit-frame-pointer -fwrapv -fPIC -fPIE T:ref

Namespace violations

Implementation: T:aesni
Security model: timingleaks
Compiler: clang -march=native -O2 -fomit-frame-pointer -fwrapv -Qunused-arguments -fPIC -fPIE
encrypt.o aegis128_initialization T
encrypt.o aegis128_tag_generation T

Number of similar (compiler,implementation) pairs: 7, namely:
CompilerImplementations
clang -march=native -O2 -fomit-frame-pointer -fwrapv -Qunused-arguments -fPIC -fPIE T:aesni
clang -march=native -O3 -fomit-frame-pointer -fwrapv -Qunused-arguments -fPIC -fPIE T:aesni
clang -march=native -O -fomit-frame-pointer -fwrapv -Qunused-arguments -fPIC -fPIE T:aesni
clang -march=native -Os -fomit-frame-pointer -fwrapv -Qunused-arguments -fPIC -fPIE T:aesni
gcc -march=native -mtune=native -O2 -fomit-frame-pointer -fwrapv -fPIC -fPIE T:aesni
gcc -march=native -mtune=native -O3 -fomit-frame-pointer -fwrapv -fPIC -fPIE T:aesni
gcc -march=native -mtune=native -O -fomit-frame-pointer -fwrapv -fPIC -fPIE T:aesni

Namespace violations

Implementation: T:ref
Security model: timingleaks
Compiler: clang -march=native -O2 -fomit-frame-pointer -fwrapv -Qunused-arguments -fPIC -fPIE
aes.o AESROUND T
aes.o TE0 D
aes.o TE1 D
aes.o TE2 D
aes.o TE3 D
encrypt.o aegis128_initialization T
encrypt.o aegis128_tag_generation T

Number of similar (compiler,implementation) pairs: 8, namely:
CompilerImplementations
clang -march=native -O2 -fomit-frame-pointer -fwrapv -Qunused-arguments -fPIC -fPIE T:ref
clang -march=native -O3 -fomit-frame-pointer -fwrapv -Qunused-arguments -fPIC -fPIE T:ref
clang -march=native -O -fomit-frame-pointer -fwrapv -Qunused-arguments -fPIC -fPIE T:ref
clang -march=native -Os -fomit-frame-pointer -fwrapv -Qunused-arguments -fPIC -fPIE T:ref
clang -mcpu=native -O3 -fomit-frame-pointer -fwrapv -Qunused-arguments -fPIC -fPIE T:ref
gcc -march=native -mtune=native -O2 -fomit-frame-pointer -fwrapv -fPIC -fPIE T:ref
gcc -march=native -mtune=native -O3 -fomit-frame-pointer -fwrapv -fPIC -fPIE T:ref
gcc -march=native -mtune=native -O -fomit-frame-pointer -fwrapv -fPIC -fPIE T:ref