Implementation notes: amd64, cherry, crypto_hash/luffa512

Computer: cherry
Microarchitecture: amd64; Silvermont (406c4)
Architecture: amd64
CPU ID: GenuineIntel-000406c4-bfebfbff
SUPERCOP version: 20240625
Operation: crypto_hash
Primitive: luffa512
TimeObject sizeTest sizeImplementationCompilerBenchmark dateSUPERCOP version
5389610291 0 54423336 812 1432T:sse2clang_-march=native_-O3_-fwrapv_-Qunused-arguments_-fPIC_-fPIE_-gdwarf-4_-Wall2024062720240625
5390410195 0 54421584 812 1432T:sse2clang_-march=native_-O2_-fwrapv_-Qunused-arguments_-fPIC_-fPIE_-gdwarf-4_-Wall2024062720240625
551988971 0 54419014 804 1432T:sse2clang_-march=native_-Os_-fwrapv_-Qunused-arguments_-fPIC_-fPIE_-gdwarf-4_-Wall2024062720240625
5587611018 0 54423392 780 1496T:sse2gcc_-march=native_-mtune=native_-O3_-fwrapv_-fPIC_-fPIE_-gdwarf-4_-Wall2024062720240625
567319718 0 54420896 780 1496T:sse2gcc_-march=native_-mtune=native_-O2_-fwrapv_-fPIC_-fPIE_-gdwarf-4_-Wall2024062720240625
579168143 0 54417755 756 1464T:sse2gcc_-march=native_-mtune=native_-Os_-fwrapv_-fPIC_-fPIE_-gdwarf-4_-Wall2024062720240625
6298010573 0 54421214 804 1432T:sse2clang_-march=native_-O_-fwrapv_-Qunused-arguments_-fPIC_-fPIE_-gdwarf-4_-Wall2024062720240625
6614311327 0 54423968 812 1432T:sse2clang_-mcpu=native_-O3_-fwrapv_-Qunused-arguments_-fPIC_-fPIE_-gdwarf-4_-Wall2024062720240625
8012810507 0 54421119 772 1496T:sse2gcc_-march=native_-mtune=native_-O_-fwrapv_-fPIC_-fPIE_-gdwarf-4_-Wall2024062720240625
12644027095 0 039560 780 952T:sphlibgcc_-march=native_-mtune=native_-O3_-fwrapv_-fPIC_-fPIE_-gdwarf-4_-Wall2024062720240625
12838227767 0 039048 780 952T:sphlibgcc_-march=native_-mtune=native_-O2_-fwrapv_-fPIC_-fPIE_-gdwarf-4_-Wall2024062720240625
12983026090 0 036856 780 952T:sphlibgcc_-march=native_-mtune=native_-O_-fwrapv_-fPIC_-fPIE_-gdwarf-4_-Wall2024062720240625
13284326672 0 036822 804 888T:sphlibclang_-march=native_-Os_-fwrapv_-Qunused-arguments_-fPIC_-fPIE_-gdwarf-4_-Wall2024062720240625
13292927290 0 040608 812 888T:sphlibclang_-march=native_-O3_-fwrapv_-Qunused-arguments_-fPIC_-fPIE_-gdwarf-4_-Wall2024062720240625
13330427274 0 038944 812 888T:sphlibclang_-march=native_-O2_-fwrapv_-Qunused-arguments_-fPIC_-fPIE_-gdwarf-4_-Wall2024062720240625
13420026469 0 039384 812 888T:sphlibclang_-mcpu=native_-O3_-fwrapv_-Qunused-arguments_-fPIC_-fPIE_-gdwarf-4_-Wall2024062720240625
13860416579 320 028160 1140 888T:opt32clang_-march=native_-O2_-fwrapv_-Qunused-arguments_-fPIC_-fPIE_-gdwarf-4_-Wall2024062720240625
13872622239 0 031931 756 920T:sphlibgcc_-march=native_-mtune=native_-Os_-fwrapv_-fPIC_-fPIE_-gdwarf-4_-Wall2024062720240625
13928618067 320 031120 1140 888T:opt32clang_-march=native_-O3_-fwrapv_-Qunused-arguments_-fPIC_-fPIE_-gdwarf-4_-Wall2024062720240625
13964129531 0 040230 804 888T:sphlibclang_-march=native_-O_-fwrapv_-Qunused-arguments_-fPIC_-fPIE_-gdwarf-4_-Wall2024062720240625
13992019827 320 032568 1140 888T:opt32clang_-mcpu=native_-O3_-fwrapv_-Qunused-arguments_-fPIC_-fPIE_-gdwarf-4_-Wall2024062720240625
1657149716 320 019790 1132 888T:opt32clang_-march=native_-Os_-fwrapv_-Qunused-arguments_-fPIC_-fPIE_-gdwarf-4_-Wall2024062720240625
17935210186 320 020838 1132 888T:opt32clang_-march=native_-O_-fwrapv_-Qunused-arguments_-fPIC_-fPIE_-gdwarf-4_-Wall2024062720240625
19436810359 320 021624 1108 952T:opt32gcc_-march=native_-mtune=native_-O2_-fwrapv_-fPIC_-fPIE_-gdwarf-4_-Wall2024062720240625
2157148856 320 018539 1084 920T:opt32gcc_-march=native_-mtune=native_-Os_-fwrapv_-fPIC_-fPIE_-gdwarf-4_-Wall2024062720240625
21587010020 320 020703 1100 952T:opt32gcc_-march=native_-mtune=native_-O_-fwrapv_-fPIC_-fPIE_-gdwarf-4_-Wall2024062720240625

Test failure


error 111

Number of similar (implementation,compiler) pairs: 1, namely:
ImplementationCompiler
T:opt32gcc -march=native -mtune=native -O3 -fwrapv -fPIC -fPIE -gdwarf-4 -Wall (10.2.1_20210110)

Compiler output


luffa.c: luffa.c:76:22: warning: unused variable 'RC00' [-Wunused-const-variable]
luffa.c: static const sph_u32 RC00[8] = {
luffa.c:                      ^
luffa.c: luffa.c:83:22: warning: unused variable 'RC04' [-Wunused-const-variable]
luffa.c: static const sph_u32 RC04[8] = {
luffa.c:                      ^
luffa.c: luffa.c:90:22: warning: unused variable 'RC10' [-Wunused-const-variable]
luffa.c: static const sph_u32 RC10[8] = {
luffa.c:                      ^
luffa.c: luffa.c:97:22: warning: unused variable 'RC14' [-Wunused-const-variable]
luffa.c: static const sph_u32 RC14[8] = {
luffa.c:                      ^
luffa.c: luffa.c:136:22: warning: unused variable 'RC30' [-Wunused-const-variable]
luffa.c: static const sph_u32 RC30[8] = {
luffa.c:                      ^
luffa.c: luffa.c:143:22: warning: unused variable 'RC34' [-Wunused-const-variable]
luffa.c: static const sph_u32 RC34[8] = {
luffa.c:                      ^
luffa.c: 6 warnings generated.

Number of similar (implementation,compiler) pairs: 5, namely:
ImplementationCompiler
T:sphlibclang -march=native -O2 -fwrapv -Qunused-arguments -fPIC -fPIE -gdwarf-4 -Wall (Debian_Clang_11.0.1)
T:sphlibclang -march=native -O3 -fwrapv -Qunused-arguments -fPIC -fPIE -gdwarf-4 -Wall (Debian_Clang_11.0.1)
T:sphlibclang -march=native -O -fwrapv -Qunused-arguments -fPIC -fPIE -gdwarf-4 -Wall (Debian_Clang_11.0.1)
T:sphlibclang -march=native -Os -fwrapv -Qunused-arguments -fPIC -fPIE -gdwarf-4 -Wall (Debian_Clang_11.0.1)
T:sphlibclang -mcpu=native -O3 -fwrapv -Qunused-arguments -fPIC -fPIE -gdwarf-4 -Wall (Debian_Clang_11.0.1)

Compiler output


luffa.c: luffa.c:143:22: warning: 'RC34' defined but not used [-Wunused-const-variable=]
luffa.c:   143 | static const sph_u32 RC34[8] = {
luffa.c:       |                      ^~~~
luffa.c: luffa.c:136:22: warning: 'RC30' defined but not used [-Wunused-const-variable=]
luffa.c:   136 | static const sph_u32 RC30[8] = {
luffa.c:       |                      ^~~~
luffa.c: luffa.c:97:22: warning: 'RC14' defined but not used [-Wunused-const-variable=]
luffa.c:    97 | static const sph_u32 RC14[8] = {
luffa.c:       |                      ^~~~
luffa.c: luffa.c:90:22: warning: 'RC10' defined but not used [-Wunused-const-variable=]
luffa.c:    90 | static const sph_u32 RC10[8] = {
luffa.c:       |                      ^~~~
luffa.c: luffa.c:83:22: warning: 'RC04' defined but not used [-Wunused-const-variable=]
luffa.c:    83 | static const sph_u32 RC04[8] = {
luffa.c:       |                      ^~~~
luffa.c: luffa.c:76:22: warning: 'RC00' defined but not used [-Wunused-const-variable=]
luffa.c:    76 | static const sph_u32 RC00[8] = {
luffa.c:       |                      ^~~~

Number of similar (implementation,compiler) pairs: 4, namely:
ImplementationCompiler
T:sphlibgcc -march=native -mtune=native -O2 -fwrapv -fPIC -fPIE -gdwarf-4 -Wall (10.2.1_20210110)
T:sphlibgcc -march=native -mtune=native -O3 -fwrapv -fPIC -fPIE -gdwarf-4 -Wall (10.2.1_20210110)
T:sphlibgcc -march=native -mtune=native -O -fwrapv -fPIC -fPIE -gdwarf-4 -Wall (10.2.1_20210110)
T:sphlibgcc -march=native -mtune=native -Os -fwrapv -fPIC -fPIE -gdwarf-4 -Wall (10.2.1_20210110)

Compiler output


luffa_x64asm.s: luffa_x64asm.s:780:13: error: unknown token in expression
luffa_x64asm.s:     movaps  %xmm0, [IV   ]
luffa_x64asm.s:             ^
luffa_x64asm.s: luffa_x64asm.s:781:13: error: unknown token in expression
luffa_x64asm.s:     movaps  %xmm1, [IV+16]
luffa_x64asm.s:             ^
luffa_x64asm.s: luffa_x64asm.s:782:13: error: unknown token in expression
luffa_x64asm.s:     movaps  %xmm2, [IV+32]
luffa_x64asm.s:             ^
luffa_x64asm.s: luffa_x64asm.s:783:13: error: unknown token in expression
luffa_x64asm.s:     movaps  %xmm3, [IV+48]
luffa_x64asm.s:             ^
luffa_x64asm.s: luffa_x64asm.s:784:13: error: unknown token in expression
luffa_x64asm.s:     movaps  %xmm4, [IV+64]
luffa_x64asm.s:             ^
luffa_x64asm.s: luffa_x64asm.s:785:13: error: unknown token in expression
luffa_x64asm.s:     movaps  %xmm5, [IV+80]
luffa_x64asm.s:             ^
luffa_x64asm.s: luffa_x64asm.s:786:14: error: unknown token in expression
luffa_x64asm.s:     movups  [%rdi   ], %xmm0
luffa_x64asm.s:              ^
luffa_x64asm.s: luffa_x64asm.s:787:14: error: unknown token in expression
luffa_x64asm.s:     movups  [%rdi+16], %xmm1
luffa_x64asm.s:              ^
luffa_x64asm.s: luffa_x64asm.s:788:14: error: unknown token in expression
luffa_x64asm.s: ...

Number of similar (implementation,compiler) pairs: 10, namely:
ImplementationCompiler
T:sse2_x64asmclang -march=native -O2 -fwrapv -Qunused-arguments -fPIC -fPIE -gdwarf-4 -Wall (Debian_Clang_11.0.1)
T:sse2_x64asmclang -march=native -O3 -fwrapv -Qunused-arguments -fPIC -fPIE -gdwarf-4 -Wall (Debian_Clang_11.0.1)
T:sse2_x64asmclang -march=native -O -fwrapv -Qunused-arguments -fPIC -fPIE -gdwarf-4 -Wall (Debian_Clang_11.0.1)
T:sse2_x64asmclang -march=native -Os -fwrapv -Qunused-arguments -fPIC -fPIE -gdwarf-4 -Wall (Debian_Clang_11.0.1)
T:sse2_x64asmclang -mcpu=native -O3 -fwrapv -Qunused-arguments -fPIC -fPIE -gdwarf-4 -Wall (Debian_Clang_11.0.1)
T:ssse3_x64asmclang -march=native -O2 -fwrapv -Qunused-arguments -fPIC -fPIE -gdwarf-4 -Wall (Debian_Clang_11.0.1)
T:ssse3_x64asmclang -march=native -O3 -fwrapv -Qunused-arguments -fPIC -fPIE -gdwarf-4 -Wall (Debian_Clang_11.0.1)
T:ssse3_x64asmclang -march=native -O -fwrapv -Qunused-arguments -fPIC -fPIE -gdwarf-4 -Wall (Debian_Clang_11.0.1)
T:ssse3_x64asmclang -march=native -Os -fwrapv -Qunused-arguments -fPIC -fPIE -gdwarf-4 -Wall (Debian_Clang_11.0.1)
T:ssse3_x64asmclang -mcpu=native -O3 -fwrapv -Qunused-arguments -fPIC -fPIE -gdwarf-4 -Wall (Debian_Clang_11.0.1)

Compiler output


try.c: /usr/bin/ld: libcrypto_hash_luffa512.a(luffa_x64asm.o): relocation R_X86_64_32S against symbol `IV' can not be used when making a PIE object; recompile with -fPIE
try.c: collect2: error: ld returned 1 exit status

Number of similar (implementation,compiler) pairs: 16, namely:
ImplementationCompiler
T:sse2_x64asmgcc -march=native -mtune=native -O2 -fwrapv -fPIC -fPIE -gdwarf-4 -Wall (10.2.1_20210110)
T:sse2_x64asmgcc -march=native -mtune=native -O3 -fwrapv -fPIC -fPIE -gdwarf-4 -Wall (10.2.1_20210110)
T:sse2_x64asmgcc -march=native -mtune=native -O -fwrapv -fPIC -fPIE -gdwarf-4 -Wall (10.2.1_20210110)
T:sse2_x64asmgcc -march=native -mtune=native -Os -fwrapv -fPIC -fPIE -gdwarf-4 -Wall (10.2.1_20210110)
T:sse2_x64asm-2gcc -march=native -mtune=native -O2 -fwrapv -fPIC -fPIE -gdwarf-4 -Wall (10.2.1_20210110)
T:sse2_x64asm-2gcc -march=native -mtune=native -O3 -fwrapv -fPIC -fPIE -gdwarf-4 -Wall (10.2.1_20210110)
T:sse2_x64asm-2gcc -march=native -mtune=native -O -fwrapv -fPIC -fPIE -gdwarf-4 -Wall (10.2.1_20210110)
T:sse2_x64asm-2gcc -march=native -mtune=native -Os -fwrapv -fPIC -fPIE -gdwarf-4 -Wall (10.2.1_20210110)
T:ssse3_x64asmgcc -march=native -mtune=native -O2 -fwrapv -fPIC -fPIE -gdwarf-4 -Wall (10.2.1_20210110)
T:ssse3_x64asmgcc -march=native -mtune=native -O3 -fwrapv -fPIC -fPIE -gdwarf-4 -Wall (10.2.1_20210110)
T:ssse3_x64asmgcc -march=native -mtune=native -O -fwrapv -fPIC -fPIE -gdwarf-4 -Wall (10.2.1_20210110)
T:ssse3_x64asmgcc -march=native -mtune=native -Os -fwrapv -fPIC -fPIE -gdwarf-4 -Wall (10.2.1_20210110)
T:ssse3_x64asm-2gcc -march=native -mtune=native -O2 -fwrapv -fPIC -fPIE -gdwarf-4 -Wall (10.2.1_20210110)
T:ssse3_x64asm-2gcc -march=native -mtune=native -O3 -fwrapv -fPIC -fPIE -gdwarf-4 -Wall (10.2.1_20210110)
T:ssse3_x64asm-2gcc -march=native -mtune=native -O -fwrapv -fPIC -fPIE -gdwarf-4 -Wall (10.2.1_20210110)
T:ssse3_x64asm-2gcc -march=native -mtune=native -Os -fwrapv -fPIC -fPIE -gdwarf-4 -Wall (10.2.1_20210110)

Compiler output


luffa_x64asm.s: luffa_x64asm.s:780:13: error: unknown token in expression
luffa_x64asm.s:     movdqa  %xmm0, [IV   ]
luffa_x64asm.s:             ^
luffa_x64asm.s: luffa_x64asm.s:781:13: error: unknown token in expression
luffa_x64asm.s:     movdqa  %xmm1, [IV+16]
luffa_x64asm.s:             ^
luffa_x64asm.s: luffa_x64asm.s:782:13: error: unknown token in expression
luffa_x64asm.s:     movdqa  %xmm2, [IV+32]
luffa_x64asm.s:             ^
luffa_x64asm.s: luffa_x64asm.s:783:13: error: unknown token in expression
luffa_x64asm.s:     movdqa  %xmm3, [IV+48]
luffa_x64asm.s:             ^
luffa_x64asm.s: luffa_x64asm.s:784:13: error: unknown token in expression
luffa_x64asm.s:     movdqa  %xmm4, [IV+64]
luffa_x64asm.s:             ^
luffa_x64asm.s: luffa_x64asm.s:785:13: error: unknown token in expression
luffa_x64asm.s:     movdqa  %xmm5, [IV+80]
luffa_x64asm.s:             ^
luffa_x64asm.s: luffa_x64asm.s:786:14: error: unknown token in expression
luffa_x64asm.s:     movups  [%rdi   ], %xmm0
luffa_x64asm.s:              ^
luffa_x64asm.s: luffa_x64asm.s:787:14: error: unknown token in expression
luffa_x64asm.s:     movups  [%rdi+16], %xmm1
luffa_x64asm.s:              ^
luffa_x64asm.s: luffa_x64asm.s:788:14: error: unknown token in expression
luffa_x64asm.s: ...

Number of similar (implementation,compiler) pairs: 10, namely:
ImplementationCompiler
T:sse2_x64asm-2clang -march=native -O2 -fwrapv -Qunused-arguments -fPIC -fPIE -gdwarf-4 -Wall (Debian_Clang_11.0.1)
T:sse2_x64asm-2clang -march=native -O3 -fwrapv -Qunused-arguments -fPIC -fPIE -gdwarf-4 -Wall (Debian_Clang_11.0.1)
T:sse2_x64asm-2clang -march=native -O -fwrapv -Qunused-arguments -fPIC -fPIE -gdwarf-4 -Wall (Debian_Clang_11.0.1)
T:sse2_x64asm-2clang -march=native -Os -fwrapv -Qunused-arguments -fPIC -fPIE -gdwarf-4 -Wall (Debian_Clang_11.0.1)
T:sse2_x64asm-2clang -mcpu=native -O3 -fwrapv -Qunused-arguments -fPIC -fPIE -gdwarf-4 -Wall (Debian_Clang_11.0.1)
T:ssse3_x64asm-2clang -march=native -O2 -fwrapv -Qunused-arguments -fPIC -fPIE -gdwarf-4 -Wall (Debian_Clang_11.0.1)
T:ssse3_x64asm-2clang -march=native -O3 -fwrapv -Qunused-arguments -fPIC -fPIE -gdwarf-4 -Wall (Debian_Clang_11.0.1)
T:ssse3_x64asm-2clang -march=native -O -fwrapv -Qunused-arguments -fPIC -fPIE -gdwarf-4 -Wall (Debian_Clang_11.0.1)
T:ssse3_x64asm-2clang -march=native -Os -fwrapv -Qunused-arguments -fPIC -fPIE -gdwarf-4 -Wall (Debian_Clang_11.0.1)
T:ssse3_x64asm-2clang -mcpu=native -O3 -fwrapv -Qunused-arguments -fPIC -fPIE -gdwarf-4 -Wall (Debian_Clang_11.0.1)

Compiler output


luffa256_x64asm.s: luffa256_x64asm.s:297:9: error: unknown token in expression
luffa256_x64asm.s:         movaps  %xmm0, [IV   ]
luffa256_x64asm.s:                 ^
luffa256_x64asm.s: luffa256_x64asm.s:298:9: error: unknown token in expression
luffa256_x64asm.s:         movaps  %xmm1, [IV+16]
luffa256_x64asm.s:                 ^
luffa256_x64asm.s: luffa256_x64asm.s:299:9: error: unknown token in expression
luffa256_x64asm.s:         movaps  %xmm2, [IV+32]
luffa256_x64asm.s:                 ^
luffa256_x64asm.s: luffa256_x64asm.s:300:9: error: unknown token in expression
luffa256_x64asm.s:         movaps  %xmm3, [IV+48]
luffa256_x64asm.s:                 ^
luffa256_x64asm.s: luffa256_x64asm.s:301:9: error: unknown token in expression
luffa256_x64asm.s:         movaps  %xmm4, [IV+64]
luffa256_x64asm.s:                 ^
luffa256_x64asm.s: luffa256_x64asm.s:302:9: error: unknown token in expression
luffa256_x64asm.s:         movaps  %xmm5, [IV+80]
luffa256_x64asm.s:                 ^
luffa256_x64asm.s: luffa256_x64asm.s:303:10: error: unknown token in expression
luffa256_x64asm.s:         movups  [%rdi   ], %xmm0
luffa256_x64asm.s:                  ^
luffa256_x64asm.s: luffa256_x64asm.s:304:10: error: unknown token in expression
luffa256_x64asm.s:         movups  [%rdi+16], %xmm1
luffa256_x64asm.s:                  ^
luffa256_x64asm.s: luffa256_x64asm.s:305:10: error: unknown token in expression
luffa256_x64asm.s: ...

Number of similar (implementation,compiler) pairs: 5, namely:
ImplementationCompiler
T:ssse3_x64asm-PSclang -march=native -O2 -fwrapv -Qunused-arguments -fPIC -fPIE -gdwarf-4 -Wall (Debian_Clang_11.0.1)
T:ssse3_x64asm-PSclang -march=native -O3 -fwrapv -Qunused-arguments -fPIC -fPIE -gdwarf-4 -Wall (Debian_Clang_11.0.1)
T:ssse3_x64asm-PSclang -march=native -O -fwrapv -Qunused-arguments -fPIC -fPIE -gdwarf-4 -Wall (Debian_Clang_11.0.1)
T:ssse3_x64asm-PSclang -march=native -Os -fwrapv -Qunused-arguments -fPIC -fPIE -gdwarf-4 -Wall (Debian_Clang_11.0.1)
T:ssse3_x64asm-PSclang -mcpu=native -O3 -fwrapv -Qunused-arguments -fPIC -fPIE -gdwarf-4 -Wall (Debian_Clang_11.0.1)

Compiler output


try.c: /usr/bin/ld: libcrypto_hash_luffa512.a(luffa256_x64asm.o): relocation R_X86_64_32S against `.rodata' can not be used when making a PIE object; recompile with -fPIE
try.c: /usr/bin/ld: libcrypto_hash_luffa512.a(luffa384_x64asm.o): relocation R_X86_64_32S against `.rodata' can not be used when making a PIE object; recompile with -fPIE
try.c: /usr/bin/ld: libcrypto_hash_luffa512.a(luffa512_x64asm.o): relocation R_X86_64_32S against `.rodata' can not be used when making a PIE object; recompile with -fPIE
try.c: collect2: error: ld returned 1 exit status

Number of similar (implementation,compiler) pairs: 8, namely:
ImplementationCompiler
T:ssse3_x64asm-PSgcc -march=native -mtune=native -O2 -fwrapv -fPIC -fPIE -gdwarf-4 -Wall (10.2.1_20210110)
T:ssse3_x64asm-PSgcc -march=native -mtune=native -O3 -fwrapv -fPIC -fPIE -gdwarf-4 -Wall (10.2.1_20210110)
T:ssse3_x64asm-PSgcc -march=native -mtune=native -O -fwrapv -fPIC -fPIE -gdwarf-4 -Wall (10.2.1_20210110)
T:ssse3_x64asm-PSgcc -march=native -mtune=native -Os -fwrapv -fPIC -fPIE -gdwarf-4 -Wall (10.2.1_20210110)
T:ssse3_x64asm-PS-2gcc -march=native -mtune=native -O2 -fwrapv -fPIC -fPIE -gdwarf-4 -Wall (10.2.1_20210110)
T:ssse3_x64asm-PS-2gcc -march=native -mtune=native -O3 -fwrapv -fPIC -fPIE -gdwarf-4 -Wall (10.2.1_20210110)
T:ssse3_x64asm-PS-2gcc -march=native -mtune=native -O -fwrapv -fPIC -fPIE -gdwarf-4 -Wall (10.2.1_20210110)
T:ssse3_x64asm-PS-2gcc -march=native -mtune=native -Os -fwrapv -fPIC -fPIE -gdwarf-4 -Wall (10.2.1_20210110)

Compiler output


luffa256_x64asm.s: luffa256_x64asm.s:297:9: error: unknown token in expression
luffa256_x64asm.s:         movdqa  %xmm0, [IV   ]
luffa256_x64asm.s:                 ^
luffa256_x64asm.s: luffa256_x64asm.s:298:9: error: unknown token in expression
luffa256_x64asm.s:         movdqa  %xmm1, [IV+16]
luffa256_x64asm.s:                 ^
luffa256_x64asm.s: luffa256_x64asm.s:299:9: error: unknown token in expression
luffa256_x64asm.s:         movdqa  %xmm2, [IV+32]
luffa256_x64asm.s:                 ^
luffa256_x64asm.s: luffa256_x64asm.s:300:9: error: unknown token in expression
luffa256_x64asm.s:         movdqa  %xmm3, [IV+48]
luffa256_x64asm.s:                 ^
luffa256_x64asm.s: luffa256_x64asm.s:301:9: error: unknown token in expression
luffa256_x64asm.s:         movdqa  %xmm4, [IV+64]
luffa256_x64asm.s:                 ^
luffa256_x64asm.s: luffa256_x64asm.s:302:9: error: unknown token in expression
luffa256_x64asm.s:         movdqa  %xmm5, [IV+80]
luffa256_x64asm.s:                 ^
luffa256_x64asm.s: luffa256_x64asm.s:303:10: error: unknown token in expression
luffa256_x64asm.s:         movdqu  [%rdi   ], %xmm0
luffa256_x64asm.s:                  ^
luffa256_x64asm.s: luffa256_x64asm.s:304:10: error: unknown token in expression
luffa256_x64asm.s:         movdqu  [%rdi+16], %xmm1
luffa256_x64asm.s:                  ^
luffa256_x64asm.s: luffa256_x64asm.s:305:10: error: unknown token in expression
luffa256_x64asm.s: ...

Number of similar (implementation,compiler) pairs: 5, namely:
ImplementationCompiler
T:ssse3_x64asm-PS-2clang -march=native -O2 -fwrapv -Qunused-arguments -fPIC -fPIE -gdwarf-4 -Wall (Debian_Clang_11.0.1)
T:ssse3_x64asm-PS-2clang -march=native -O3 -fwrapv -Qunused-arguments -fPIC -fPIE -gdwarf-4 -Wall (Debian_Clang_11.0.1)
T:ssse3_x64asm-PS-2clang -march=native -O -fwrapv -Qunused-arguments -fPIC -fPIE -gdwarf-4 -Wall (Debian_Clang_11.0.1)
T:ssse3_x64asm-PS-2clang -march=native -Os -fwrapv -Qunused-arguments -fPIC -fPIE -gdwarf-4 -Wall (Debian_Clang_11.0.1)
T:ssse3_x64asm-PS-2clang -mcpu=native -O3 -fwrapv -Qunused-arguments -fPIC -fPIE -gdwarf-4 -Wall (Debian_Clang_11.0.1)

Compiler output


hash.c: hash.c:32:12: warning: passing 'const unsigned char *' to parameter of type 'unsigned char *' discards qualifiers [-Wincompatible-pointer-types-discards-qualifiers]
hash.c:         fLuffa512(in, out, inlen);
hash.c:                   ^~
hash.c: hash.c:29:31: note: passing argument to parameter 'input' here
hash.c: void fLuffa512(unsigned char *input, unsigned char *output, int len);
hash.c:                               ^
hash.c: 1 warning generated.
luffa_512.s: <instantiation>:1:8: error: unknown token in expression
luffa_512.s: pshufb %xmm10, maskShufLittleEndian
luffa_512.s:        ^
luffa_512.s: <instantiation>:1:1: note: while in macro instantiation
luffa_512.s: mPSSTEPI %xmm10, %xmm11, maskShufLittleEndian
luffa_512.s: ^
luffa_512.s: luffa_512.s:303:2: note: while in macro instantiation
luffa_512.s:         mPS %xmm10, %xmm11, %xmm12, %xmm13, %xmm14, %xmm15
luffa_512.s:         ^
luffa_512.s: <instantiation>:2:9: error: unknown token in expression
luffa_512.s:         pshufb %xmm11, maskShufLittleEndian
luffa_512.s:                ^
luffa_512.s: <instantiation>:1:1: note: while in macro instantiation
luffa_512.s: mPSSTEPI %xmm10, %xmm11, maskShufLittleEndian
luffa_512.s: ^
luffa_512.s: luffa_512.s:303:2: note: while in macro instantiation
luffa_512.s:         mPS %xmm10, %xmm11, %xmm12, %xmm13, %xmm14, %xmm15
luffa_512.s:         ^
luffa_512.s: <instantiation>:1:8: error: unknown token in expression
luffa_512.s: movaps %xmm12, %xmm10
luffa_512.s:        ^
luffa_512.s: <instantiation>:2:2: note: while in macro instantiation
luffa_512.s:         mPSSTEPII %xmm10, %xmm11, %xmm12, %xmm13, %xmm14, %xmm15
luffa_512.s:         ^
luffa_512.s: luffa_512.s:303:2: note: while in macro instantiation
luffa_512.s: ...

Number of similar (implementation,compiler) pairs: 5, namely:
ImplementationCompiler
T:thomaz/asm-PSclang -march=native -O2 -fwrapv -Qunused-arguments -fPIC -fPIE -gdwarf-4 -Wall (Debian_Clang_11.0.1)
T:thomaz/asm-PSclang -march=native -O3 -fwrapv -Qunused-arguments -fPIC -fPIE -gdwarf-4 -Wall (Debian_Clang_11.0.1)
T:thomaz/asm-PSclang -march=native -O -fwrapv -Qunused-arguments -fPIC -fPIE -gdwarf-4 -Wall (Debian_Clang_11.0.1)
T:thomaz/asm-PSclang -march=native -Os -fwrapv -Qunused-arguments -fPIC -fPIE -gdwarf-4 -Wall (Debian_Clang_11.0.1)
T:thomaz/asm-PSclang -mcpu=native -O3 -fwrapv -Qunused-arguments -fPIC -fPIE -gdwarf-4 -Wall (Debian_Clang_11.0.1)

Compiler output


hash.c: hash.c: In function 'crypto_hash_luffa512_thomaz_asm_PS_timingleaks':
hash.c: hash.c:32:12: warning: passing argument 1 of 'fLuffa512' discards 'const' qualifier from pointer target type [-Wdiscarded-qualifiers]
hash.c:    32 |  fLuffa512(in, out, inlen);
hash.c:       |            ^~
hash.c: hash.c:29:31: note: expected 'unsigned char *' but argument is of type 'const unsigned char *'
hash.c:    29 | void fLuffa512(unsigned char *input, unsigned char *output, int len);
hash.c:       |                ~~~~~~~~~~~~~~~^~~~~
try.c: /usr/bin/ld: libcrypto_hash_luffa512.a(luffa_512.o): relocation R_X86_64_32S against `.rodata' can not be used when making a PIE object; recompile with -fPIE
try.c: collect2: error: ld returned 1 exit status

Number of similar (implementation,compiler) pairs: 4, namely:
ImplementationCompiler
T:thomaz/asm-PSgcc -march=native -mtune=native -O2 -fwrapv -fPIC -fPIE -gdwarf-4 -Wall (10.2.1_20210110)
T:thomaz/asm-PSgcc -march=native -mtune=native -O3 -fwrapv -fPIC -fPIE -gdwarf-4 -Wall (10.2.1_20210110)
T:thomaz/asm-PSgcc -march=native -mtune=native -O -fwrapv -fPIC -fPIE -gdwarf-4 -Wall (10.2.1_20210110)
T:thomaz/asm-PSgcc -march=native -mtune=native -Os -fwrapv -fPIC -fPIE -gdwarf-4 -Wall (10.2.1_20210110)

Compiler output


hash.c: hash.c:32:12: warning: passing 'const unsigned char *' to parameter of type 'unsigned char *' discards qualifiers [-Wincompatible-pointer-types-discards-qualifiers]
hash.c:         fLuffa512(in, out, inlen);
hash.c:                   ^~
hash.c: hash.c:29:31: note: passing argument to parameter 'input' here
hash.c: void fLuffa512(unsigned char *input, unsigned char *output, int len);
hash.c:                               ^
hash.c: 1 warning generated.
luffa_512.s: <instantiation>:1:8: error: unknown token in expression
luffa_512.s: pshufb %xmm10, maskShufLittleEndian
luffa_512.s:        ^
luffa_512.s: <instantiation>:1:1: note: while in macro instantiation
luffa_512.s: mPSSTEPI %xmm10, %xmm11, maskShufLittleEndian
luffa_512.s: ^
luffa_512.s: luffa_512.s:302:2: note: while in macro instantiation
luffa_512.s:         mPS %xmm10, %xmm11, %xmm12, %xmm13, %xmm14, %xmm15
luffa_512.s:         ^
luffa_512.s: <instantiation>:2:9: error: unknown token in expression
luffa_512.s:         pshufb %xmm11, maskShufLittleEndian
luffa_512.s:                ^
luffa_512.s: <instantiation>:1:1: note: while in macro instantiation
luffa_512.s: mPSSTEPI %xmm10, %xmm11, maskShufLittleEndian
luffa_512.s: ^
luffa_512.s: luffa_512.s:302:2: note: while in macro instantiation
luffa_512.s:         mPS %xmm10, %xmm11, %xmm12, %xmm13, %xmm14, %xmm15
luffa_512.s:         ^
luffa_512.s: <instantiation>:1:8: error: unknown token in expression
luffa_512.s: movaps %xmm12, %xmm10
luffa_512.s:        ^
luffa_512.s: <instantiation>:2:2: note: while in macro instantiation
luffa_512.s:         mPSSTEPII %xmm10, %xmm11, %xmm12, %xmm13, %xmm14, %xmm15
luffa_512.s:         ^
luffa_512.s: luffa_512.s:302:2: note: while in macro instantiation
luffa_512.s: ...

Number of similar (implementation,compiler) pairs: 5, namely:
ImplementationCompiler
T:thomaz/asm-PS-v2-FPclang -march=native -O2 -fwrapv -Qunused-arguments -fPIC -fPIE -gdwarf-4 -Wall (Debian_Clang_11.0.1)
T:thomaz/asm-PS-v2-FPclang -march=native -O3 -fwrapv -Qunused-arguments -fPIC -fPIE -gdwarf-4 -Wall (Debian_Clang_11.0.1)
T:thomaz/asm-PS-v2-FPclang -march=native -O -fwrapv -Qunused-arguments -fPIC -fPIE -gdwarf-4 -Wall (Debian_Clang_11.0.1)
T:thomaz/asm-PS-v2-FPclang -march=native -Os -fwrapv -Qunused-arguments -fPIC -fPIE -gdwarf-4 -Wall (Debian_Clang_11.0.1)
T:thomaz/asm-PS-v2-FPclang -mcpu=native -O3 -fwrapv -Qunused-arguments -fPIC -fPIE -gdwarf-4 -Wall (Debian_Clang_11.0.1)

Compiler output


hash.c: hash.c: In function 'crypto_hash_luffa512_thomaz_asm_PS_v2_FP_timingleaks':
hash.c: hash.c:32:12: warning: passing argument 1 of 'fLuffa512' discards 'const' qualifier from pointer target type [-Wdiscarded-qualifiers]
hash.c:    32 |  fLuffa512(in, out, inlen);
hash.c:       |            ^~
hash.c: hash.c:29:31: note: expected 'unsigned char *' but argument is of type 'const unsigned char *'
hash.c:    29 | void fLuffa512(unsigned char *input, unsigned char *output, int len);
hash.c:       |                ~~~~~~~~~~~~~~~^~~~~
try.c: /usr/bin/ld: libcrypto_hash_luffa512.a(luffa_512.o): relocation R_X86_64_32S against `.rodata' can not be used when making a PIE object; recompile with -fPIE
try.c: collect2: error: ld returned 1 exit status

Number of similar (implementation,compiler) pairs: 4, namely:
ImplementationCompiler
T:thomaz/asm-PS-v2-FPgcc -march=native -mtune=native -O2 -fwrapv -fPIC -fPIE -gdwarf-4 -Wall (10.2.1_20210110)
T:thomaz/asm-PS-v2-FPgcc -march=native -mtune=native -O3 -fwrapv -fPIC -fPIE -gdwarf-4 -Wall (10.2.1_20210110)
T:thomaz/asm-PS-v2-FPgcc -march=native -mtune=native -O -fwrapv -fPIC -fPIE -gdwarf-4 -Wall (10.2.1_20210110)
T:thomaz/asm-PS-v2-FPgcc -march=native -mtune=native -Os -fwrapv -fPIC -fPIE -gdwarf-4 -Wall (10.2.1_20210110)

Compiler output


hash.c: hash.c:32:12: warning: passing 'const unsigned char *' to parameter of type 'unsigned char *' discards qualifiers [-Wincompatible-pointer-types-discards-qualifiers]
hash.c:         fLuffa512(in, out, inlen);
hash.c:                   ^~
hash.c: hash.c:29:31: note: passing argument to parameter 'input' here
hash.c: void fLuffa512(unsigned char *input, unsigned char *output, int len);
hash.c:                               ^
hash.c: 1 warning generated.
luffa_512.s: <instantiation>:1:8: error: unknown token in expression
luffa_512.s: pshufb %xmm10, maskShufLittleEndian
luffa_512.s:        ^
luffa_512.s: <instantiation>:1:1: note: while in macro instantiation
luffa_512.s: mPSSTEPI %xmm10, %xmm11, maskShufLittleEndian
luffa_512.s: ^
luffa_512.s: luffa_512.s:305:2: note: while in macro instantiation
luffa_512.s:         mPS %xmm10, %xmm11, %xmm12, %xmm13, %xmm14, %xmm15
luffa_512.s:         ^
luffa_512.s: <instantiation>:2:9: error: unknown token in expression
luffa_512.s:         pshufb %xmm11, maskShufLittleEndian
luffa_512.s:                ^
luffa_512.s: <instantiation>:1:1: note: while in macro instantiation
luffa_512.s: mPSSTEPI %xmm10, %xmm11, maskShufLittleEndian
luffa_512.s: ^
luffa_512.s: luffa_512.s:305:2: note: while in macro instantiation
luffa_512.s:         mPS %xmm10, %xmm11, %xmm12, %xmm13, %xmm14, %xmm15
luffa_512.s:         ^
luffa_512.s: <instantiation>:1:8: error: unknown token in expression
luffa_512.s: movdqa %xmm12, %xmm10
luffa_512.s:        ^
luffa_512.s: <instantiation>:2:2: note: while in macro instantiation
luffa_512.s:         mPSSTEPII %xmm10, %xmm11, %xmm12, %xmm13, %xmm14, %xmm15
luffa_512.s:         ^
luffa_512.s: luffa_512.s:305:2: note: while in macro instantiation
luffa_512.s: ...

Number of similar (implementation,compiler) pairs: 5, namely:
ImplementationCompiler
T:thomaz/asm-PS-v2-INTclang -march=native -O2 -fwrapv -Qunused-arguments -fPIC -fPIE -gdwarf-4 -Wall (Debian_Clang_11.0.1)
T:thomaz/asm-PS-v2-INTclang -march=native -O3 -fwrapv -Qunused-arguments -fPIC -fPIE -gdwarf-4 -Wall (Debian_Clang_11.0.1)
T:thomaz/asm-PS-v2-INTclang -march=native -O -fwrapv -Qunused-arguments -fPIC -fPIE -gdwarf-4 -Wall (Debian_Clang_11.0.1)
T:thomaz/asm-PS-v2-INTclang -march=native -Os -fwrapv -Qunused-arguments -fPIC -fPIE -gdwarf-4 -Wall (Debian_Clang_11.0.1)
T:thomaz/asm-PS-v2-INTclang -mcpu=native -O3 -fwrapv -Qunused-arguments -fPIC -fPIE -gdwarf-4 -Wall (Debian_Clang_11.0.1)

Compiler output


hash.c: hash.c: In function 'crypto_hash_luffa512_thomaz_asm_PS_v2_INT_timingleaks':
hash.c: hash.c:32:12: warning: passing argument 1 of 'fLuffa512' discards 'const' qualifier from pointer target type [-Wdiscarded-qualifiers]
hash.c:    32 |  fLuffa512(in, out, inlen);
hash.c:       |            ^~
hash.c: hash.c:29:31: note: expected 'unsigned char *' but argument is of type 'const unsigned char *'
hash.c:    29 | void fLuffa512(unsigned char *input, unsigned char *output, int len);
hash.c:       |                ~~~~~~~~~~~~~~~^~~~~
try.c: /usr/bin/ld: libcrypto_hash_luffa512.a(luffa_512.o): relocation R_X86_64_32S against `.rodata' can not be used when making a PIE object; recompile with -fPIE
try.c: collect2: error: ld returned 1 exit status

Number of similar (implementation,compiler) pairs: 4, namely:
ImplementationCompiler
T:thomaz/asm-PS-v2-INTgcc -march=native -mtune=native -O2 -fwrapv -fPIC -fPIE -gdwarf-4 -Wall (10.2.1_20210110)
T:thomaz/asm-PS-v2-INTgcc -march=native -mtune=native -O3 -fwrapv -fPIC -fPIE -gdwarf-4 -Wall (10.2.1_20210110)
T:thomaz/asm-PS-v2-INTgcc -march=native -mtune=native -O -fwrapv -fPIC -fPIE -gdwarf-4 -Wall (10.2.1_20210110)
T:thomaz/asm-PS-v2-INTgcc -march=native -mtune=native -Os -fwrapv -fPIC -fPIE -gdwarf-4 -Wall (10.2.1_20210110)

Compiler output


hash.c: hash.c:32:12: warning: passing 'const unsigned char *' to parameter of type 'unsigned char *' discards qualifiers [-Wincompatible-pointer-types-discards-qualifiers]
hash.c:         fLuffa512(in, out, inlen);
hash.c:                   ^~
hash.c: hash.c:29:31: note: passing argument to parameter 'input' here
hash.c: void fLuffa512(unsigned char *input, unsigned char *output, int len);
hash.c:                               ^
hash.c: 1 warning generated.
luffa512.s: <instantiation>:1:8: error: unknown token in expression
luffa512.s: pshufb %xmm10, maskShufLittleEndian
luffa512.s:        ^
luffa512.s: <instantiation>:1:1: note: while in macro instantiation
luffa512.s: mPSSTEPI %xmm10, %xmm11, maskShufLittleEndian
luffa512.s: ^
luffa512.s: luffa512.s:449:2: note: while in macro instantiation
luffa512.s:         mPS %xmm10, %xmm11, %xmm12, %xmm13, %xmm14, %xmm15
luffa512.s:         ^
luffa512.s: <instantiation>:2:9: error: unknown token in expression
luffa512.s:         pshufb %xmm11, maskShufLittleEndian
luffa512.s:                ^
luffa512.s: <instantiation>:1:1: note: while in macro instantiation
luffa512.s: mPSSTEPI %xmm10, %xmm11, maskShufLittleEndian
luffa512.s: ^
luffa512.s: luffa512.s:449:2: note: while in macro instantiation
luffa512.s:         mPS %xmm10, %xmm11, %xmm12, %xmm13, %xmm14, %xmm15
luffa512.s:         ^
luffa512.s: <instantiation>:1:8: error: unknown token in expression
luffa512.s: movaps %xmm12, %xmm10
luffa512.s:        ^
luffa512.s: <instantiation>:2:2: note: while in macro instantiation
luffa512.s:         mPSSTEPII %xmm10, %xmm11, %xmm12, %xmm13, %xmm14, %xmm15
luffa512.s:         ^
luffa512.s: luffa512.s:449:2: note: while in macro instantiation
luffa512.s: ...

Number of similar (implementation,compiler) pairs: 5, namely:
ImplementationCompiler
T:thomaz/asm-PSPar-v2-FPclang -march=native -O2 -fwrapv -Qunused-arguments -fPIC -fPIE -gdwarf-4 -Wall (Debian_Clang_11.0.1)
T:thomaz/asm-PSPar-v2-FPclang -march=native -O3 -fwrapv -Qunused-arguments -fPIC -fPIE -gdwarf-4 -Wall (Debian_Clang_11.0.1)
T:thomaz/asm-PSPar-v2-FPclang -march=native -O -fwrapv -Qunused-arguments -fPIC -fPIE -gdwarf-4 -Wall (Debian_Clang_11.0.1)
T:thomaz/asm-PSPar-v2-FPclang -march=native -Os -fwrapv -Qunused-arguments -fPIC -fPIE -gdwarf-4 -Wall (Debian_Clang_11.0.1)
T:thomaz/asm-PSPar-v2-FPclang -mcpu=native -O3 -fwrapv -Qunused-arguments -fPIC -fPIE -gdwarf-4 -Wall (Debian_Clang_11.0.1)

Compiler output


hash.c: hash.c: In function 'crypto_hash_luffa512_thomaz_asm_PSPar_v2_FP_timingleaks':
hash.c: hash.c:32:12: warning: passing argument 1 of 'fLuffa512' discards 'const' qualifier from pointer target type [-Wdiscarded-qualifiers]
hash.c:    32 |  fLuffa512(in, out, inlen);
hash.c:       |            ^~
hash.c: hash.c:29:31: note: expected 'unsigned char *' but argument is of type 'const unsigned char *'
hash.c:    29 | void fLuffa512(unsigned char *input, unsigned char *output, int len);
hash.c:       |                ~~~~~~~~~~~~~~~^~~~~
try.c: /usr/bin/ld: libcrypto_hash_luffa512.a(luffa512.o): relocation R_X86_64_32S against `.rodata' can not be used when making a PIE object; recompile with -fPIE
try.c: collect2: error: ld returned 1 exit status

Number of similar (implementation,compiler) pairs: 4, namely:
ImplementationCompiler
T:thomaz/asm-PSPar-v2-FPgcc -march=native -mtune=native -O2 -fwrapv -fPIC -fPIE -gdwarf-4 -Wall (10.2.1_20210110)
T:thomaz/asm-PSPar-v2-FPgcc -march=native -mtune=native -O3 -fwrapv -fPIC -fPIE -gdwarf-4 -Wall (10.2.1_20210110)
T:thomaz/asm-PSPar-v2-FPgcc -march=native -mtune=native -O -fwrapv -fPIC -fPIE -gdwarf-4 -Wall (10.2.1_20210110)
T:thomaz/asm-PSPar-v2-FPgcc -march=native -mtune=native -Os -fwrapv -fPIC -fPIE -gdwarf-4 -Wall (10.2.1_20210110)

Compiler output


hash.c: hash.c:32:12: warning: passing 'const unsigned char *' to parameter of type 'unsigned char *' discards qualifiers [-Wincompatible-pointer-types-discards-qualifiers]
hash.c:         fLuffa512(in, out, inlen);
hash.c:                   ^~
hash.c: hash.c:29:31: note: passing argument to parameter 'input' here
hash.c: void fLuffa512(unsigned char *input, unsigned char *output, int len);
hash.c:                               ^
hash.c: 1 warning generated.
luffa512.s: <instantiation>:1:8: error: unknown token in expression
luffa512.s: pshufb %xmm10, maskShufLittleEndian
luffa512.s:        ^
luffa512.s: <instantiation>:1:1: note: while in macro instantiation
luffa512.s: mPSSTEPI %xmm10, %xmm11, maskShufLittleEndian
luffa512.s: ^
luffa512.s: luffa512.s:449:2: note: while in macro instantiation
luffa512.s:         mPS %xmm10, %xmm11, %xmm12, %xmm13, %xmm14, %xmm15
luffa512.s:         ^
luffa512.s: <instantiation>:2:9: error: unknown token in expression
luffa512.s:         pshufb %xmm11, maskShufLittleEndian
luffa512.s:                ^
luffa512.s: <instantiation>:1:1: note: while in macro instantiation
luffa512.s: mPSSTEPI %xmm10, %xmm11, maskShufLittleEndian
luffa512.s: ^
luffa512.s: luffa512.s:449:2: note: while in macro instantiation
luffa512.s:         mPS %xmm10, %xmm11, %xmm12, %xmm13, %xmm14, %xmm15
luffa512.s:         ^
luffa512.s: <instantiation>:1:8: error: unknown token in expression
luffa512.s: movdqa %xmm12, %xmm10
luffa512.s:        ^
luffa512.s: <instantiation>:2:2: note: while in macro instantiation
luffa512.s:         mPSSTEPII %xmm10, %xmm11, %xmm12, %xmm13, %xmm14, %xmm15
luffa512.s:         ^
luffa512.s: luffa512.s:449:2: note: while in macro instantiation
luffa512.s: ...

Number of similar (implementation,compiler) pairs: 5, namely:
ImplementationCompiler
T:thomaz/asm-PSPar-v2-INTclang -march=native -O2 -fwrapv -Qunused-arguments -fPIC -fPIE -gdwarf-4 -Wall (Debian_Clang_11.0.1)
T:thomaz/asm-PSPar-v2-INTclang -march=native -O3 -fwrapv -Qunused-arguments -fPIC -fPIE -gdwarf-4 -Wall (Debian_Clang_11.0.1)
T:thomaz/asm-PSPar-v2-INTclang -march=native -O -fwrapv -Qunused-arguments -fPIC -fPIE -gdwarf-4 -Wall (Debian_Clang_11.0.1)
T:thomaz/asm-PSPar-v2-INTclang -march=native -Os -fwrapv -Qunused-arguments -fPIC -fPIE -gdwarf-4 -Wall (Debian_Clang_11.0.1)
T:thomaz/asm-PSPar-v2-INTclang -mcpu=native -O3 -fwrapv -Qunused-arguments -fPIC -fPIE -gdwarf-4 -Wall (Debian_Clang_11.0.1)

Compiler output


hash.c: hash.c: In function 'crypto_hash_luffa512_thomaz_asm_PSPar_v2_INT_timingleaks':
hash.c: hash.c:32:12: warning: passing argument 1 of 'fLuffa512' discards 'const' qualifier from pointer target type [-Wdiscarded-qualifiers]
hash.c:    32 |  fLuffa512(in, out, inlen);
hash.c:       |            ^~
hash.c: hash.c:29:31: note: expected 'unsigned char *' but argument is of type 'const unsigned char *'
hash.c:    29 | void fLuffa512(unsigned char *input, unsigned char *output, int len);
hash.c:       |                ~~~~~~~~~~~~~~~^~~~~
try.c: /usr/bin/ld: libcrypto_hash_luffa512.a(luffa512.o): relocation R_X86_64_32S against `.rodata' can not be used when making a PIE object; recompile with -fPIE
try.c: collect2: error: ld returned 1 exit status

Number of similar (implementation,compiler) pairs: 4, namely:
ImplementationCompiler
T:thomaz/asm-PSPar-v2-INTgcc -march=native -mtune=native -O2 -fwrapv -fPIC -fPIE -gdwarf-4 -Wall (10.2.1_20210110)
T:thomaz/asm-PSPar-v2-INTgcc -march=native -mtune=native -O3 -fwrapv -fPIC -fPIE -gdwarf-4 -Wall (10.2.1_20210110)
T:thomaz/asm-PSPar-v2-INTgcc -march=native -mtune=native -O -fwrapv -fPIC -fPIE -gdwarf-4 -Wall (10.2.1_20210110)
T:thomaz/asm-PSPar-v2-INTgcc -march=native -mtune=native -Os -fwrapv -fPIC -fPIE -gdwarf-4 -Wall (10.2.1_20210110)