Implementation notes: amd64, cherry, crypto_hash/k12

Computer: cherry
Microarchitecture: amd64; Silvermont (406c4)
Architecture: amd64
CPU ID: GenuineIntel-000406c4-bfebfbff
SUPERCOP version: 20240425
Operation: crypto_hash
Primitive: k12
TimeObject sizeTest sizeImplementationCompilerBenchmark dateSUPERCOP version
1655375013 0 086640 812 888T:kcp/optimized1600AsmX86-64clang_-march=native_-O2_-fomit-frame-pointer_-fwrapv_-Qunused-arguments_-fPIC_-fPIE2024042720240425
1661775133 0 088000 812 888T:kcp/optimized1600AsmX86-64clang_-mcpu=native_-O3_-fomit-frame-pointer_-fwrapv_-Qunused-arguments_-fPIC_-fPIE2024042720240425
1662675133 0 088408 812 888T:kcp/optimized1600AsmX86-64clang_-march=native_-O3_-fomit-frame-pointer_-fwrapv_-Qunused-arguments_-fPIC_-fPIE2024042720240425
1666074476 0 084598 804 888T:kcp/optimized1600AsmX86-64clang_-march=native_-Os_-fomit-frame-pointer_-fwrapv_-Qunused-arguments_-fPIC_-fPIE2024042720240425
1669274864 0 085478 804 888T:kcp/optimized1600AsmX86-64clang_-march=native_-O_-fomit-frame-pointer_-fwrapv_-Qunused-arguments_-fPIC_-fPIE2024042720240425
1751131133 0 042904 812 888T:kcp/optimized1600lcu6clang_-march=native_-O2_-fomit-frame-pointer_-fwrapv_-Qunused-arguments_-fPIC_-fPIE2024042720240425
1752331333 0 044752 812 888T:kcp/optimized1600lcu6clang_-march=native_-O3_-fomit-frame-pointer_-fwrapv_-Qunused-arguments_-fPIC_-fPIE2024042720240425
1752957523 0 067291 756 920T:kcp/optimized1600lcufullgcc_-march=native_-mtune=native_-Os_-fomit-frame-pointer_-fwrapv_-fPIC_-fPIE2024042720240425
1755065835 0 078856 812 888T:kcp/optimized1600lcufullclang_-mcpu=native_-O3_-fomit-frame-pointer_-fwrapv_-Qunused-arguments_-fPIC_-fPIE2024042720240425
1755963784 0 075560 812 888T:kcp/optimized1600lcufullclang_-march=native_-O2_-fomit-frame-pointer_-fwrapv_-Qunused-arguments_-fPIC_-fPIE2024042720240425
1758463984 0 077408 812 888T:kcp/optimized1600lcufullclang_-march=native_-O3_-fomit-frame-pointer_-fwrapv_-Qunused-arguments_-fPIC_-fPIE2024042720240425
1759828907 0 039158 804 888T:kcp/optimized1600lcu6clang_-march=native_-Os_-fomit-frame-pointer_-fwrapv_-Qunused-arguments_-fPIC_-fPIE2024042720240425
1764129294 0 040054 804 888T:kcp/optimized1600lcu6clang_-march=native_-O_-fomit-frame-pointer_-fwrapv_-Qunused-arguments_-fPIC_-fPIE2024042720240425
1767461412 0 071670 804 888T:kcp/optimized1600lcufullclang_-march=native_-Os_-fomit-frame-pointer_-fwrapv_-Qunused-arguments_-fPIC_-fPIE2024042720240425
1785761892 0 072654 804 888T:kcp/optimized1600lcufullclang_-march=native_-O_-fomit-frame-pointer_-fwrapv_-Qunused-arguments_-fPIC_-fPIE2024042720240425
1809333250 0 046272 812 888T:kcp/optimized1600lcu6clang_-mcpu=native_-O3_-fomit-frame-pointer_-fwrapv_-Qunused-arguments_-fPIC_-fPIE2024042720240425
1817161540 0 072343 772 952T:kcp/optimized1600lcufullgcc_-march=native_-mtune=native_-O_-fomit-frame-pointer_-fwrapv_-fPIC_-fPIE2024042720240425
1851465192 0 077656 780 952T:kcp/optimized1600lcufullgcc_-march=native_-mtune=native_-O3_-fomit-frame-pointer_-fwrapv_-fPIC_-fPIE2024042720240425
1852730161 0 041440 780 952T:kcp/optimized1600lcu6gcc_-march=native_-mtune=native_-O2_-fomit-frame-pointer_-fwrapv_-fPIC_-fPIE2024042720240425
1861127051 0 036827 756 920T:kcp/optimized1600lcu6gcc_-march=native_-mtune=native_-Os_-fomit-frame-pointer_-fwrapv_-fPIC_-fPIE2024042720240425
1862862808 0 074080 780 952T:kcp/optimized1600lcufullgcc_-march=native_-mtune=native_-O2_-fomit-frame-pointer_-fwrapv_-fPIC_-fPIE2024042720240425
1871460490 0 070259 756 920T:kcp/optimized1600ufullgcc_-march=native_-mtune=native_-Os_-fomit-frame-pointer_-fwrapv_-fPIC_-fPIE2024042720240425
1895432667 0 045128 780 952T:kcp/optimized1600lcu6gcc_-march=native_-mtune=native_-O3_-fomit-frame-pointer_-fwrapv_-fPIC_-fPIE2024042720240425
1895467459 0 080880 812 888T:kcp/optimized1600ufullclang_-march=native_-O3_-fomit-frame-pointer_-fwrapv_-Qunused-arguments_-fPIC_-fPIE2024042720240425
1897067259 0 079032 812 888T:kcp/optimized1600ufullclang_-march=native_-O2_-fomit-frame-pointer_-fwrapv_-Qunused-arguments_-fPIC_-fPIE2024042720240425
1897229171 0 039975 772 952T:kcp/optimized1600lcu6gcc_-march=native_-mtune=native_-O_-fomit-frame-pointer_-fwrapv_-fPIC_-fPIE2024042720240425
1900269190 0 082208 812 888T:kcp/optimized1600ufullclang_-mcpu=native_-O3_-fomit-frame-pointer_-fwrapv_-Qunused-arguments_-fPIC_-fPIE2024042720240425
1909864809 0 075062 804 888T:kcp/optimized1600ufullclang_-march=native_-Os_-fomit-frame-pointer_-fwrapv_-Qunused-arguments_-fPIC_-fPIE2024042720240425
1914465932 0 076694 804 888T:kcp/optimized1600ufullclang_-march=native_-O_-fomit-frame-pointer_-fwrapv_-Qunused-arguments_-fPIC_-fPIE2024042720240425
1945533524 0 046544 812 888T:kcp/optimized1600u6clang_-mcpu=native_-O3_-fomit-frame-pointer_-fwrapv_-Qunused-arguments_-fPIC_-fPIE2024042720240425
1962565642 0 076520 780 952T:kcp/optimized1600ufullgcc_-march=native_-mtune=native_-O_-fomit-frame-pointer_-fwrapv_-fPIC_-fPIE2024042720240425
1969927903 0 037683 756 920T:kcp/optimized1600u6gcc_-march=native_-mtune=native_-Os_-fomit-frame-pointer_-fwrapv_-fPIC_-fPIE2024042720240425
1992831181 0 042456 780 952T:kcp/optimized1600u6gcc_-march=native_-mtune=native_-O2_-fomit-frame-pointer_-fwrapv_-fPIC_-fPIE2024042720240425
2014733334 0 045120 812 888T:kcp/optimized1600u6clang_-march=native_-O2_-fomit-frame-pointer_-fwrapv_-Qunused-arguments_-fPIC_-fPIE2024042720240425
2015033534 0 046968 812 888T:kcp/optimized1600u6clang_-march=native_-O3_-fomit-frame-pointer_-fwrapv_-Qunused-arguments_-fPIC_-fPIE2024042720240425
2021331319 0 041574 804 888T:kcp/optimized1600u6clang_-march=native_-Os_-fomit-frame-pointer_-fwrapv_-Qunused-arguments_-fPIC_-fPIE2024042720240425
2028632007 0 042782 804 888T:kcp/optimized1600u6clang_-march=native_-O_-fomit-frame-pointer_-fwrapv_-Qunused-arguments_-fPIC_-fPIE2024042720240425
2032668029 0 080488 780 952T:kcp/optimized1600ufullgcc_-march=native_-mtune=native_-O3_-fomit-frame-pointer_-fwrapv_-fPIC_-fPIE2024042720240425
2034567221 0 078488 780 952T:kcp/optimized1600ufullgcc_-march=native_-mtune=native_-O2_-fomit-frame-pointer_-fwrapv_-fPIC_-fPIE2024042720240425
2084632490 0 044952 780 952T:kcp/optimized1600u6gcc_-march=native_-mtune=native_-O3_-fomit-frame-pointer_-fwrapv_-fPIC_-fPIE2024042720240425
2107530456 0 041320 780 952T:kcp/optimized1600u6gcc_-march=native_-mtune=native_-O_-fomit-frame-pointer_-fwrapv_-fPIC_-fPIE2024042720240425
240439616 0 021523 828 888T:kcp/reference1600clang_-march=native_-O2_-fomit-frame-pointer_-fwrapv_-Qunused-arguments_-fPIC_-fPIE2024042720240425
240499672 0 023227 828 888T:kcp/reference1600clang_-march=native_-O3_-fomit-frame-pointer_-fwrapv_-Qunused-arguments_-fPIC_-fPIE2024042720240425
2415710081 0 023227 828 888T:kcp/reference1600clang_-mcpu=native_-O3_-fomit-frame-pointer_-fwrapv_-Qunused-arguments_-fPIC_-fPIE2024042720240425
2495810096 0 023512 812 888T:kcp/compact1600clang_-march=native_-O3_-fomit-frame-pointer_-fwrapv_-Qunused-arguments_-fPIC_-fPIE2024042620240425
2605011323 0 024336 812 888T:kcp/compact1600clang_-mcpu=native_-O3_-fomit-frame-pointer_-fwrapv_-Qunused-arguments_-fPIC_-fPIE2024042620240425
312609500 0 022067 796 952T:kcp/reference1600gcc_-march=native_-mtune=native_-O3_-fomit-frame-pointer_-fwrapv_-fPIC_-fPIE2024042720240425
4578916555 0 028992 780 952T:kcp/compact1600gcc_-march=native_-mtune=native_-O3_-fomit-frame-pointer_-fwrapv_-fPIC_-fPIE2024042620240425
4746722723 0 035968 812 888T:kcp/inplace1600biclang_-march=native_-O3_-fomit-frame-pointer_-fwrapv_-Qunused-arguments_-fPIC_-fPIE2024042720240425
4767922379 0 033976 812 888T:kcp/inplace1600biclang_-march=native_-O2_-fomit-frame-pointer_-fwrapv_-Qunused-arguments_-fPIC_-fPIE2024042720240425
4877226374 0 038832 780 952T:kcp/inplace1600bigcc_-march=native_-mtune=native_-O3_-fomit-frame-pointer_-fwrapv_-fPIC_-fPIE2024042720240425
4948859472 0 069243 756 920T:kcp/optimized1600lcufullshldgcc_-march=native_-mtune=native_-Os_-fomit-frame-pointer_-fwrapv_-fPIC_-fPIE2024042720240425
4974466608 0 079096 780 952T:kcp/optimized1600lcufullshldgcc_-march=native_-mtune=native_-O3_-fomit-frame-pointer_-fwrapv_-fPIC_-fPIE2024042720240425
4982064232 0 075536 780 952T:kcp/optimized1600lcufullshldgcc_-march=native_-mtune=native_-O2_-fomit-frame-pointer_-fwrapv_-fPIC_-fPIE2024042720240425
5040916838 0 027720 780 952T:kcp/inplace1600bigcc_-march=native_-mtune=native_-O_-fomit-frame-pointer_-fwrapv_-fPIC_-fPIE2024042720240425
5102978077 0 091352 812 888T:kcp/optimized1600AsmX86-64shldclang_-march=native_-O3_-fomit-frame-pointer_-fwrapv_-Qunused-arguments_-fPIC_-fPIE2024042720240425
5104377957 0 089584 812 888T:kcp/optimized1600AsmX86-64shldclang_-march=native_-O2_-fomit-frame-pointer_-fwrapv_-Qunused-arguments_-fPIC_-fPIE2024042720240425
5106278077 0 090944 812 888T:kcp/optimized1600AsmX86-64shldclang_-mcpu=native_-O3_-fomit-frame-pointer_-fwrapv_-Qunused-arguments_-fPIC_-fPIE2024042720240425
5106477808 0 088422 804 888T:kcp/optimized1600AsmX86-64shldclang_-march=native_-O_-fomit-frame-pointer_-fwrapv_-Qunused-arguments_-fPIC_-fPIE2024042720240425
5113477420 0 087542 804 888T:kcp/optimized1600AsmX86-64shldclang_-march=native_-Os_-fomit-frame-pointer_-fwrapv_-Qunused-arguments_-fPIC_-fPIE2024042720240425
5125565395 0 077176 812 888T:kcp/optimized1600lcufullshldclang_-march=native_-O2_-fomit-frame-pointer_-fwrapv_-Qunused-arguments_-fPIC_-fPIE2024042720240425
512799832 0 021600 812 888T:kcp/compact1600clang_-march=native_-O2_-fomit-frame-pointer_-fwrapv_-Qunused-arguments_-fPIC_-fPIE2024042620240425
5133565595 0 079024 812 888T:kcp/optimized1600lcufullshldclang_-march=native_-O3_-fomit-frame-pointer_-fwrapv_-Qunused-arguments_-fPIC_-fPIE2024042720240425
5133963127 0 073382 804 888T:kcp/optimized1600lcufullshldclang_-march=native_-Os_-fomit-frame-pointer_-fwrapv_-Qunused-arguments_-fPIC_-fPIE2024042720240425
5186123195 0 035936 812 888T:kcp/inplace1600biclang_-mcpu=native_-O3_-fomit-frame-pointer_-fwrapv_-Qunused-arguments_-fPIC_-fPIE2024042720240425
5209867324 0 080344 812 888T:kcp/optimized1600lcufullshldclang_-mcpu=native_-O3_-fomit-frame-pointer_-fwrapv_-Qunused-arguments_-fPIC_-fPIE2024042720240425
5214763396 0 074158 804 888T:kcp/optimized1600lcufullshldclang_-march=native_-O_-fomit-frame-pointer_-fwrapv_-Qunused-arguments_-fPIC_-fPIE2024042720240425
5243717565 0 027838 804 888T:kcp/inplace1600biclang_-march=native_-Os_-fomit-frame-pointer_-fwrapv_-Qunused-arguments_-fPIC_-fPIE2024042720240425
5291517575 0 028350 804 888T:kcp/inplace1600biclang_-march=native_-O_-fomit-frame-pointer_-fwrapv_-Qunused-arguments_-fPIC_-fPIE2024042720240425
5294017113 0 026907 756 920T:kcp/inplace1600bigcc_-march=native_-mtune=native_-Os_-fomit-frame-pointer_-fwrapv_-fPIC_-fPIE2024042720240425
5321362933 0 073767 772 952T:kcp/optimized1600lcufullshldgcc_-march=native_-mtune=native_-O_-fomit-frame-pointer_-fwrapv_-fPIC_-fPIE2024042720240425
5685820324 0 031608 780 952T:kcp/inplace1600bigcc_-march=native_-mtune=native_-O2_-fomit-frame-pointer_-fwrapv_-fPIC_-fPIE2024042720240425
904346363 0 016614 804 888T:kcp/compact1600clang_-march=native_-Os_-fomit-frame-pointer_-fwrapv_-Qunused-arguments_-fPIC_-fPIE2024042620240425
938998504 0 019768 780 952T:kcp/compact1600gcc_-march=native_-mtune=native_-O2_-fomit-frame-pointer_-fwrapv_-fPIC_-fPIE2024042620240425
951996392 0 016163 756 920T:kcp/compact1600gcc_-march=native_-mtune=native_-Os_-fomit-frame-pointer_-fwrapv_-fPIC_-fPIE2024042620240425
1014047249 0 018006 804 888T:kcp/compact1600clang_-march=native_-O_-fomit-frame-pointer_-fwrapv_-Qunused-arguments_-fPIC_-fPIE2024042620240425
1049277250 0 018112 780 952T:kcp/compact1600gcc_-march=native_-mtune=native_-O_-fomit-frame-pointer_-fwrapv_-fPIC_-fPIE2024042620240425
1712648530 0 019883 796 952T:kcp/reference1600gcc_-march=native_-mtune=native_-O2_-fomit-frame-pointer_-fwrapv_-fPIC_-fPIE2024042720240425
1820968266 0 019206 820 888T:kcp/reference1600clang_-march=native_-O_-fomit-frame-pointer_-fwrapv_-Qunused-arguments_-fPIC_-fPIE2024042720240425
3204878018 0 018898 788 952T:kcp/reference1600gcc_-march=native_-mtune=native_-O_-fomit-frame-pointer_-fwrapv_-fPIC_-fPIE2024042720240425
3410576789 0 016659 772 920T:kcp/reference1600gcc_-march=native_-mtune=native_-Os_-fomit-frame-pointer_-fwrapv_-fPIC_-fPIE2024042720240425
3423047682 0 018070 820 888T:kcp/reference1600clang_-march=native_-Os_-fomit-frame-pointer_-fwrapv_-Qunused-arguments_-fPIC_-fPIE2024042720240425
64098116062 0 029243 828 888T:kcp/reference1600-32bitsclang_-mcpu=native_-O3_-fomit-frame-pointer_-fwrapv_-Qunused-arguments_-fPIC_-fPIE2024042720240425
68482417133 0 030499 828 888T:kcp/reference1600-32bitsclang_-march=native_-O3_-fomit-frame-pointer_-fwrapv_-Qunused-arguments_-fPIC_-fPIE2024042720240425
68963213789 0 026459 796 952T:kcp/reference1600-32bitsgcc_-march=native_-mtune=native_-O3_-fomit-frame-pointer_-fwrapv_-fPIC_-fPIE2024042720240425
78352814389 0 026219 828 888T:kcp/reference1600-32bitsclang_-march=native_-O2_-fomit-frame-pointer_-fwrapv_-Qunused-arguments_-fPIC_-fPIE2024042720240425
91976111347 0 022787 796 952T:kcp/reference1600-32bitsgcc_-march=native_-mtune=native_-O2_-fomit-frame-pointer_-fwrapv_-fPIC_-fPIE2024042720240425
10776918730 0 018667 772 920T:kcp/reference1600-32bitsgcc_-march=native_-mtune=native_-Os_-fomit-frame-pointer_-fwrapv_-fPIC_-fPIE2024042720240425
112445310085 0 021034 788 952T:kcp/reference1600-32bitsgcc_-march=native_-mtune=native_-O_-fomit-frame-pointer_-fwrapv_-fPIC_-fPIE2024042720240425
113055710764 0 021078 820 888T:kcp/reference1600-32bitsclang_-march=native_-Os_-fomit-frame-pointer_-fwrapv_-Qunused-arguments_-fPIC_-fPIE2024042720240425
113709810561 0 021534 820 888T:kcp/reference1600-32bitsclang_-march=native_-O_-fomit-frame-pointer_-fwrapv_-Qunused-arguments_-fPIC_-fPIE2024042720240425

Compiler output

Implementation: T:kcp/inplace1600ARMv6M
Security model: timingleaks
Compiler: clang -march=native -O2 -fomit-frame-pointer -fwrapv -Qunused-arguments -fPIC -fPIE
keccak.s: keccak.s:1:1: error: unexpected token at start of statement
keccak.s: @
keccak.s: ^
keccak.s: keccak.s:2:1: error: unexpected token at start of statement
keccak.s: @ Implementation by the Keccak, Keyak and Ketje Teams, namely, Guido Bertoni,
keccak.s: ^
keccak.s: keccak.s:3:1: error: unexpected token at start of statement
keccak.s: @ Joan Daemen, Michaƫl Peeters, Gilles Van Assche and Ronny Van Keer, hereby
keccak.s: keccak.s:4:1: error: unexpected token at start of statement
keccak.s: @ denoted as "the implementer".
keccak.s: ^
keccak.s: keccak.s:5:1: error: unexpected token at start of statement
keccak.s: @
keccak.s: ^
keccak.s: keccak.s:6:1: error: unexpected token at start of statement
keccak.s: @ For more information, feedback or questions, please refer to our websites:
keccak.s: ^
keccak.s: keccak.s:7:1: error: unexpected token at start of statement
keccak.s: @ http://keccak.noekeon.org/
keccak.s: ^
keccak.s: keccak.s:8:1: error: unexpected token at start of statement
keccak.s: @ http://keyak.noekeon.org/
keccak.s: ^
keccak.s: keccak.s:9:1: error: unexpected token at start of statement
keccak.s: @ http://ketje.noekeon.org/
keccak.s: ...

Number of similar (compiler,implementation) pairs: 30, namely:
CompilerImplementations
clang -march=native -O2 -fomit-frame-pointer -fwrapv -Qunused-arguments -fPIC -fPIE T:kcp/inplace1600ARMv6M
clang -march=native -O3 -fomit-frame-pointer -fwrapv -Qunused-arguments -fPIC -fPIE T:kcp/inplace1600ARMv6M
clang -march=native -O -fomit-frame-pointer -fwrapv -Qunused-arguments -fPIC -fPIE T:kcp/inplace1600ARMv6M
clang -march=native -Os -fomit-frame-pointer -fwrapv -Qunused-arguments -fPIC -fPIE T:kcp/inplace1600ARMv6M
clang -mcpu=native -O3 -fomit-frame-pointer -fwrapv -Qunused-arguments -fPIC -fPIE T:kcp/inplace1600ARMv6M
clang -march=native -O2 -fomit-frame-pointer -fwrapv -Qunused-arguments -fPIC -fPIE T:kcp/inplace1600ARMv7A
clang -march=native -O3 -fomit-frame-pointer -fwrapv -Qunused-arguments -fPIC -fPIE T:kcp/inplace1600ARMv7A
clang -march=native -O -fomit-frame-pointer -fwrapv -Qunused-arguments -fPIC -fPIE T:kcp/inplace1600ARMv7A
clang -march=native -Os -fomit-frame-pointer -fwrapv -Qunused-arguments -fPIC -fPIE T:kcp/inplace1600ARMv7A
clang -mcpu=native -O3 -fomit-frame-pointer -fwrapv -Qunused-arguments -fPIC -fPIE T:kcp/inplace1600ARMv7A
clang -march=native -O2 -fomit-frame-pointer -fwrapv -Qunused-arguments -fPIC -fPIE T:kcp/inplace1600ARMv7M
clang -march=native -O3 -fomit-frame-pointer -fwrapv -Qunused-arguments -fPIC -fPIE T:kcp/inplace1600ARMv7M
clang -march=native -O -fomit-frame-pointer -fwrapv -Qunused-arguments -fPIC -fPIE T:kcp/inplace1600ARMv7M
clang -march=native -Os -fomit-frame-pointer -fwrapv -Qunused-arguments -fPIC -fPIE T:kcp/inplace1600ARMv7M
clang -mcpu=native -O3 -fomit-frame-pointer -fwrapv -Qunused-arguments -fPIC -fPIE T:kcp/inplace1600ARMv7M
clang -march=native -O2 -fomit-frame-pointer -fwrapv -Qunused-arguments -fPIC -fPIE T:kcp/optimized1600ARMv6Mu1
clang -march=native -O3 -fomit-frame-pointer -fwrapv -Qunused-arguments -fPIC -fPIE T:kcp/optimized1600ARMv6Mu1
clang -march=native -O -fomit-frame-pointer -fwrapv -Qunused-arguments -fPIC -fPIE T:kcp/optimized1600ARMv6Mu1
clang -march=native -Os -fomit-frame-pointer -fwrapv -Qunused-arguments -fPIC -fPIE T:kcp/optimized1600ARMv6Mu1
clang -mcpu=native -O3 -fomit-frame-pointer -fwrapv -Qunused-arguments -fPIC -fPIE T:kcp/optimized1600ARMv6Mu1
clang -march=native -O2 -fomit-frame-pointer -fwrapv -Qunused-arguments -fPIC -fPIE T:kcp/optimized1600ARMv6Mu2
clang -march=native -O3 -fomit-frame-pointer -fwrapv -Qunused-arguments -fPIC -fPIE T:kcp/optimized1600ARMv6Mu2
clang -march=native -O -fomit-frame-pointer -fwrapv -Qunused-arguments -fPIC -fPIE T:kcp/optimized1600ARMv6Mu2
clang -march=native -Os -fomit-frame-pointer -fwrapv -Qunused-arguments -fPIC -fPIE T:kcp/optimized1600ARMv6Mu2
clang -mcpu=native -O3 -fomit-frame-pointer -fwrapv -Qunused-arguments -fPIC -fPIE T:kcp/optimized1600ARMv6Mu2
clang -march=native -O2 -fomit-frame-pointer -fwrapv -Qunused-arguments -fPIC -fPIE T:kcp/optimized1600ARMv7A
clang -march=native -O3 -fomit-frame-pointer -fwrapv -Qunused-arguments -fPIC -fPIE T:kcp/optimized1600ARMv7A
clang -march=native -O -fomit-frame-pointer -fwrapv -Qunused-arguments -fPIC -fPIE T:kcp/optimized1600ARMv7A
clang -march=native -Os -fomit-frame-pointer -fwrapv -Qunused-arguments -fPIC -fPIE T:kcp/optimized1600ARMv7A
clang -mcpu=native -O3 -fomit-frame-pointer -fwrapv -Qunused-arguments -fPIC -fPIE T:kcp/optimized1600ARMv7A

Compiler output

Implementation: T:kcp/inplace1600ARMv6M
Security model: timingleaks
Compiler: gcc -march=native -mtune=native -O2 -fomit-frame-pointer -fwrapv -fPIC -fPIE
keccak.s: keccak.s: Assembler messages:
keccak.s: keccak.s:1: Error: junk at end of line, first unrecognized character is `@'
keccak.s: keccak.s:2: Error: junk at end of line, first unrecognized character is `@'
keccak.s: keccak.s:3: Error: junk at end of line, first unrecognized character is `@'
keccak.s: keccak.s:4: Error: junk at end of line, first unrecognized character is `@'
keccak.s: keccak.s:5: Error: junk at end of line, first unrecognized character is `@'
keccak.s: keccak.s:6: Error: junk at end of line, first unrecognized character is `@'
keccak.s: keccak.s:7: Error: junk at end of line, first unrecognized character is `@'
keccak.s: keccak.s:8: Error: junk at end of line, first unrecognized character is `@'
keccak.s: keccak.s:9: Error: junk at end of line, first unrecognized character is `@'
keccak.s: keccak.s:10: Error: junk at end of line, first unrecognized character is `@'
keccak.s: keccak.s:11: Error: junk at end of line, first unrecognized character is `@'
keccak.s: keccak.s:12: Error: junk at end of line, first unrecognized character is `@'
keccak.s: keccak.s:13: Error: junk at end of line, first unrecognized character is `@'
keccak.s: keccak.s:14: Error: junk at end of line, first unrecognized character is `@'
keccak.s: keccak.s:16: Error: junk at end of line, first unrecognized character is `@'
keccak.s: keccak.s:19: Error: unknown pseudo-op: `.thumb'
keccak.s: keccak.s:20: Error: unknown pseudo-op: `.syntax'
keccak.s: keccak.s:23: Error: junk at end of line, first unrecognized character is `@'
keccak.s: keccak.s:109: Error: junk at end of line, first unrecognized character is `@'
keccak.s: keccak.s:142: Error: junk at end of line, first unrecognized character is `@'
keccak.s: keccak.s:194: Error: junk at end of line, first unrecognized character is `@'
keccak.s: keccak.s:203: Error: junk at end of line, first unrecognized character is `@'
keccak.s: keccak.s:611: Error: junk at end of line, first unrecognized character is `@'
keccak.s: keccak.s:612: Error: junk at end of line, first unrecognized character is `@'
keccak.s: ...

Number of similar (compiler,implementation) pairs: 4, namely:
CompilerImplementations
gcc -march=native -mtune=native -O2 -fomit-frame-pointer -fwrapv -fPIC -fPIE T:kcp/inplace1600ARMv6M
gcc -march=native -mtune=native -O3 -fomit-frame-pointer -fwrapv -fPIC -fPIE T:kcp/inplace1600ARMv6M
gcc -march=native -mtune=native -O -fomit-frame-pointer -fwrapv -fPIC -fPIE T:kcp/inplace1600ARMv6M
gcc -march=native -mtune=native -Os -fomit-frame-pointer -fwrapv -fPIC -fPIE T:kcp/inplace1600ARMv6M

Compiler output

Implementation: T:kcp/inplace1600ARMv7A
Security model: timingleaks
Compiler: gcc -march=native -mtune=native -O2 -fomit-frame-pointer -fwrapv -fPIC -fPIE
keccak.s: keccak.s: Assembler messages:
keccak.s: keccak.s:1: Error: junk at end of line, first unrecognized character is `@'
keccak.s: keccak.s:2: Error: junk at end of line, first unrecognized character is `@'
keccak.s: keccak.s:3: Error: junk at end of line, first unrecognized character is `@'
keccak.s: keccak.s:4: Error: junk at end of line, first unrecognized character is `@'
keccak.s: keccak.s:5: Error: junk at end of line, first unrecognized character is `@'
keccak.s: keccak.s:6: Error: junk at end of line, first unrecognized character is `@'
keccak.s: keccak.s:7: Error: junk at end of line, first unrecognized character is `@'
keccak.s: keccak.s:8: Error: junk at end of line, first unrecognized character is `@'
keccak.s: keccak.s:9: Error: junk at end of line, first unrecognized character is `@'
keccak.s: keccak.s:10: Error: junk at end of line, first unrecognized character is `@'
keccak.s: keccak.s:11: Error: junk at end of line, first unrecognized character is `@'
keccak.s: keccak.s:12: Error: junk at end of line, first unrecognized character is `@'
keccak.s: keccak.s:13: Error: junk at end of line, first unrecognized character is `@'
keccak.s: keccak.s:14: Error: junk at end of line, first unrecognized character is `@'
keccak.s: keccak.s:16: Error: junk at end of line, first unrecognized character is `@'
keccak.s: keccak.s:18: Error: junk at end of line, first unrecognized character is `@'
keccak.s: keccak.s:21: Error: unknown pseudo-op: `.syntax'
keccak.s: keccak.s:22: Error: unknown pseudo-op: `.thumb'
keccak.s: keccak.s:25: Error: junk at end of line, first unrecognized character is `@'
keccak.s: keccak.s:78: Error: junk at end of line, first unrecognized character is `@'
keccak.s: keccak.s:127: Error: junk at end of line, first unrecognized character is `@'
keccak.s: keccak.s:179: Error: junk at end of line, first unrecognized character is `@'
keccak.s: keccak.s:471: Error: junk at end of line, first unrecognized character is `@'
keccak.s: keccak.s:472: Error: junk at end of line, first unrecognized character is `@'
keccak.s: ...

Number of similar (compiler,implementation) pairs: 4, namely:
CompilerImplementations
gcc -march=native -mtune=native -O2 -fomit-frame-pointer -fwrapv -fPIC -fPIE T:kcp/inplace1600ARMv7A
gcc -march=native -mtune=native -O3 -fomit-frame-pointer -fwrapv -fPIC -fPIE T:kcp/inplace1600ARMv7A
gcc -march=native -mtune=native -O -fomit-frame-pointer -fwrapv -fPIC -fPIE T:kcp/inplace1600ARMv7A
gcc -march=native -mtune=native -Os -fomit-frame-pointer -fwrapv -fPIC -fPIE T:kcp/inplace1600ARMv7A

Compiler output

Implementation: T:kcp/inplace1600ARMv7M
Security model: timingleaks
Compiler: gcc -march=native -mtune=native -O2 -fomit-frame-pointer -fwrapv -fPIC -fPIE
keccak.s: keccak.s: Assembler messages:
keccak.s: keccak.s:1: Error: junk at end of line, first unrecognized character is `@'
keccak.s: keccak.s:2: Error: junk at end of line, first unrecognized character is `@'
keccak.s: keccak.s:3: Error: junk at end of line, first unrecognized character is `@'
keccak.s: keccak.s:4: Error: junk at end of line, first unrecognized character is `@'
keccak.s: keccak.s:5: Error: junk at end of line, first unrecognized character is `@'
keccak.s: keccak.s:6: Error: junk at end of line, first unrecognized character is `@'
keccak.s: keccak.s:7: Error: junk at end of line, first unrecognized character is `@'
keccak.s: keccak.s:8: Error: junk at end of line, first unrecognized character is `@'
keccak.s: keccak.s:9: Error: junk at end of line, first unrecognized character is `@'
keccak.s: keccak.s:10: Error: junk at end of line, first unrecognized character is `@'
keccak.s: keccak.s:11: Error: junk at end of line, first unrecognized character is `@'
keccak.s: keccak.s:12: Error: junk at end of line, first unrecognized character is `@'
keccak.s: keccak.s:13: Error: junk at end of line, first unrecognized character is `@'
keccak.s: keccak.s:14: Error: junk at end of line, first unrecognized character is `@'
keccak.s: keccak.s:16: Error: junk at end of line, first unrecognized character is `@'
keccak.s: keccak.s:19: Error: unknown pseudo-op: `.thumb'
keccak.s: keccak.s:20: Error: unknown pseudo-op: `.syntax'
keccak.s: keccak.s:23: Error: junk at end of line, first unrecognized character is `@'
keccak.s: keccak.s:76: Error: junk at end of line, first unrecognized character is `@'
keccak.s: keccak.s:125: Error: junk at end of line, first unrecognized character is `@'
keccak.s: keccak.s:177: Error: junk at end of line, first unrecognized character is `@'
keccak.s: keccak.s:470: Error: junk at end of line, first unrecognized character is `@'
keccak.s: keccak.s:471: Error: junk at end of line, first unrecognized character is `@'
keccak.s: keccak.s:472: Error: junk at end of line, first unrecognized character is `@'
keccak.s: ...

Number of similar (compiler,implementation) pairs: 4, namely:
CompilerImplementations
gcc -march=native -mtune=native -O2 -fomit-frame-pointer -fwrapv -fPIC -fPIE T:kcp/inplace1600ARMv7M
gcc -march=native -mtune=native -O3 -fomit-frame-pointer -fwrapv -fPIC -fPIE T:kcp/inplace1600ARMv7M
gcc -march=native -mtune=native -O -fomit-frame-pointer -fwrapv -fPIC -fPIE T:kcp/inplace1600ARMv7M
gcc -march=native -mtune=native -Os -fomit-frame-pointer -fwrapv -fPIC -fPIE T:kcp/inplace1600ARMv7M

Compiler output

Implementation: T:kcp/optimized1600ARMv6Mu1
Security model: timingleaks
Compiler: gcc -march=native -mtune=native -O2 -fomit-frame-pointer -fwrapv -fPIC -fPIE
keccak.s: keccak.s: Assembler messages:
keccak.s: keccak.s:1: Error: junk at end of line, first unrecognized character is `@'
keccak.s: keccak.s:2: Error: junk at end of line, first unrecognized character is `@'
keccak.s: keccak.s:3: Error: junk at end of line, first unrecognized character is `@'
keccak.s: keccak.s:4: Error: junk at end of line, first unrecognized character is `@'
keccak.s: keccak.s:5: Error: junk at end of line, first unrecognized character is `@'
keccak.s: keccak.s:6: Error: junk at end of line, first unrecognized character is `@'
keccak.s: keccak.s:7: Error: junk at end of line, first unrecognized character is `@'
keccak.s: keccak.s:8: Error: junk at end of line, first unrecognized character is `@'
keccak.s: keccak.s:9: Error: junk at end of line, first unrecognized character is `@'
keccak.s: keccak.s:10: Error: junk at end of line, first unrecognized character is `@'
keccak.s: keccak.s:11: Error: junk at end of line, first unrecognized character is `@'
keccak.s: keccak.s:12: Error: junk at end of line, first unrecognized character is `@'
keccak.s: keccak.s:13: Error: junk at end of line, first unrecognized character is `@'
keccak.s: keccak.s:14: Error: junk at end of line, first unrecognized character is `@'
keccak.s: keccak.s:16: Error: junk at end of line, first unrecognized character is `@'
keccak.s: keccak.s:19: Error: unknown pseudo-op: `.thumb'
keccak.s: keccak.s:20: Error: unknown pseudo-op: `.syntax'
keccak.s: keccak.s:23: Error: junk at end of line, first unrecognized character is `@'
keccak.s: keccak.s:109: Error: junk at end of line, first unrecognized character is `@'
keccak.s: keccak.s:142: Error: junk at end of line, first unrecognized character is `@'
keccak.s: keccak.s:194: Error: junk at end of line, first unrecognized character is `@'
keccak.s: keccak.s:195: Error: junk at end of line, first unrecognized character is `@'
keccak.s: keccak.s:205: Error: junk at end of line, first unrecognized character is `@'
keccak.s: keccak.s:300: Error: junk at end of line, first unrecognized character is `@'
keccak.s: ...

Number of similar (compiler,implementation) pairs: 4, namely:
CompilerImplementations
gcc -march=native -mtune=native -O2 -fomit-frame-pointer -fwrapv -fPIC -fPIE T:kcp/optimized1600ARMv6Mu1
gcc -march=native -mtune=native -O3 -fomit-frame-pointer -fwrapv -fPIC -fPIE T:kcp/optimized1600ARMv6Mu1
gcc -march=native -mtune=native -O -fomit-frame-pointer -fwrapv -fPIC -fPIE T:kcp/optimized1600ARMv6Mu1
gcc -march=native -mtune=native -Os -fomit-frame-pointer -fwrapv -fPIC -fPIE T:kcp/optimized1600ARMv6Mu1

Compiler output

Implementation: T:kcp/optimized1600ARMv6Mu2
Security model: timingleaks
Compiler: gcc -march=native -mtune=native -O2 -fomit-frame-pointer -fwrapv -fPIC -fPIE
keccak.s: keccak.s: Assembler messages:
keccak.s: keccak.s:1: Error: junk at end of line, first unrecognized character is `@'
keccak.s: keccak.s:2: Error: junk at end of line, first unrecognized character is `@'
keccak.s: keccak.s:3: Error: junk at end of line, first unrecognized character is `@'
keccak.s: keccak.s:4: Error: junk at end of line, first unrecognized character is `@'
keccak.s: keccak.s:5: Error: junk at end of line, first unrecognized character is `@'
keccak.s: keccak.s:6: Error: junk at end of line, first unrecognized character is `@'
keccak.s: keccak.s:7: Error: junk at end of line, first unrecognized character is `@'
keccak.s: keccak.s:8: Error: junk at end of line, first unrecognized character is `@'
keccak.s: keccak.s:9: Error: junk at end of line, first unrecognized character is `@'
keccak.s: keccak.s:10: Error: junk at end of line, first unrecognized character is `@'
keccak.s: keccak.s:11: Error: junk at end of line, first unrecognized character is `@'
keccak.s: keccak.s:12: Error: junk at end of line, first unrecognized character is `@'
keccak.s: keccak.s:13: Error: junk at end of line, first unrecognized character is `@'
keccak.s: keccak.s:14: Error: junk at end of line, first unrecognized character is `@'
keccak.s: keccak.s:16: Error: junk at end of line, first unrecognized character is `@'
keccak.s: keccak.s:19: Error: unknown pseudo-op: `.thumb'
keccak.s: keccak.s:20: Error: unknown pseudo-op: `.syntax'
keccak.s: keccak.s:23: Error: junk at end of line, first unrecognized character is `@'
keccak.s: keccak.s:109: Error: junk at end of line, first unrecognized character is `@'
keccak.s: keccak.s:142: Error: junk at end of line, first unrecognized character is `@'
keccak.s: keccak.s:194: Error: junk at end of line, first unrecognized character is `@'
keccak.s: keccak.s:195: Error: junk at end of line, first unrecognized character is `@'
keccak.s: keccak.s:205: Error: junk at end of line, first unrecognized character is `@'
keccak.s: keccak.s:374: Error: junk at end of line, first unrecognized character is `@'
keccak.s: ...

Number of similar (compiler,implementation) pairs: 4, namely:
CompilerImplementations
gcc -march=native -mtune=native -O2 -fomit-frame-pointer -fwrapv -fPIC -fPIE T:kcp/optimized1600ARMv6Mu2
gcc -march=native -mtune=native -O3 -fomit-frame-pointer -fwrapv -fPIC -fPIE T:kcp/optimized1600ARMv6Mu2
gcc -march=native -mtune=native -O -fomit-frame-pointer -fwrapv -fPIC -fPIE T:kcp/optimized1600ARMv6Mu2
gcc -march=native -mtune=native -Os -fomit-frame-pointer -fwrapv -fPIC -fPIE T:kcp/optimized1600ARMv6Mu2

Compiler output

Implementation: T:kcp/optimized1600ARMv7A
Security model: timingleaks
Compiler: gcc -march=native -mtune=native -O2 -fomit-frame-pointer -fwrapv -fPIC -fPIE
keccak.s: keccak.s: Assembler messages:
keccak.s: keccak.s:1: Error: junk at end of line, first unrecognized character is `@'
keccak.s: keccak.s:2: Error: junk at end of line, first unrecognized character is `@'
keccak.s: keccak.s:3: Error: junk at end of line, first unrecognized character is `@'
keccak.s: keccak.s:4: Error: junk at end of line, first unrecognized character is `@'
keccak.s: keccak.s:5: Error: junk at end of line, first unrecognized character is `@'
keccak.s: keccak.s:6: Error: junk at end of line, first unrecognized character is `@'
keccak.s: keccak.s:7: Error: junk at end of line, first unrecognized character is `@'
keccak.s: keccak.s:8: Error: junk at end of line, first unrecognized character is `@'
keccak.s: keccak.s:9: Error: junk at end of line, first unrecognized character is `@'
keccak.s: keccak.s:10: Error: junk at end of line, first unrecognized character is `@'
keccak.s: keccak.s:11: Error: junk at end of line, first unrecognized character is `@'
keccak.s: keccak.s:12: Error: junk at end of line, first unrecognized character is `@'
keccak.s: keccak.s:13: Error: junk at end of line, first unrecognized character is `@'
keccak.s: keccak.s:14: Error: junk at end of line, first unrecognized character is `@'
keccak.s: keccak.s:16: Error: junk at end of line, first unrecognized character is `@'
keccak.s: keccak.s:17: Error: junk at end of line, first unrecognized character is `@'
keccak.s: keccak.s:18: Error: junk at end of line, first unrecognized character is `@'
keccak.s: keccak.s:21: Error: unknown pseudo-op: `.syntax'
keccak.s: keccak.s:22: Error: unknown pseudo-op: `.fpu'
keccak.s: keccak.s:23: Error: unknown pseudo-op: `.arm'
keccak.s: keccak.s:26: Error: junk at end of line, first unrecognized character is `@'
keccak.s: keccak.s:27: Error: junk at end of line, first unrecognized character is `@'
keccak.s: keccak.s:29: Error: junk at end of line, first unrecognized character is `@'
keccak.s: keccak.s:56: Error: junk at end of line, first unrecognized character is `@'
keccak.s: ...

Number of similar (compiler,implementation) pairs: 4, namely:
CompilerImplementations
gcc -march=native -mtune=native -O2 -fomit-frame-pointer -fwrapv -fPIC -fPIE T:kcp/optimized1600ARMv7A
gcc -march=native -mtune=native -O3 -fomit-frame-pointer -fwrapv -fPIC -fPIE T:kcp/optimized1600ARMv7A
gcc -march=native -mtune=native -O -fomit-frame-pointer -fwrapv -fPIC -fPIE T:kcp/optimized1600ARMv7A
gcc -march=native -mtune=native -Os -fomit-frame-pointer -fwrapv -fPIC -fPIE T:kcp/optimized1600ARMv7A

Compiler output

Implementation: T:kcp/optimized1600ARMv8A
Security model: timingleaks
Compiler: clang -march=native -O2 -fomit-frame-pointer -fwrapv -Qunused-arguments -fPIC -fPIE
keccak.s: keccak.s:258:20: error: unknown token in expression
keccak.s: movi v0.2d, #0
keccak.s: ^
keccak.s: keccak.s:259:20: error: unknown token in expression
keccak.s: movi v1.2d, #0
keccak.s: ^
keccak.s: keccak.s:260:20: error: unknown token in expression
keccak.s: movi v2.2d, #0
keccak.s: ^
keccak.s: keccak.s:261:20: error: unknown token in expression
keccak.s: movi v3.2d, #0
keccak.s: ^
keccak.s: keccak.s:262:15: error: unknown token in expression
keccak.s: st4 { v0.2d, v1.2d, v2.2d, v3.2d }, [x0], #64 // Clear 8lanes=64 bytes at a time
keccak.s: ^
keccak.s: keccak.s:263:15: error: unknown token in expression
keccak.s: st4 { v0.2d, v1.2d, v2.2d, v3.2d }, [x0], #64
keccak.s: ^
keccak.s: keccak.s:264:15: error: unknown token in expression
keccak.s: st4 { v0.2d, v1.2d, v2.2d, v3.2d }, [x0], #64
keccak.s: ^
keccak.s: keccak.s:265:15: error: unknown token in expression
keccak.s: st1 { v0.d }[0], [x0], #8
keccak.s: ^
keccak.s: keccak.s:276:20: error: expected ']' in brackets expression
keccak.s: ...

Number of similar (compiler,implementation) pairs: 5, namely:
CompilerImplementations
clang -march=native -O2 -fomit-frame-pointer -fwrapv -Qunused-arguments -fPIC -fPIE T:kcp/optimized1600ARMv8A
clang -march=native -O3 -fomit-frame-pointer -fwrapv -Qunused-arguments -fPIC -fPIE T:kcp/optimized1600ARMv8A
clang -march=native -O -fomit-frame-pointer -fwrapv -Qunused-arguments -fPIC -fPIE T:kcp/optimized1600ARMv8A
clang -march=native -Os -fomit-frame-pointer -fwrapv -Qunused-arguments -fPIC -fPIE T:kcp/optimized1600ARMv8A
clang -mcpu=native -O3 -fomit-frame-pointer -fwrapv -Qunused-arguments -fPIC -fPIE T:kcp/optimized1600ARMv8A

Compiler output

Implementation: T:kcp/optimized1600ARMv8A
Security model: timingleaks
Compiler: gcc -march=native -mtune=native -O2 -fomit-frame-pointer -fwrapv -fPIC -fPIE
keccak.s: keccak.s: Assembler messages:
keccak.s: keccak.s:258: Error: no such instruction: `movi v0.2d,'
keccak.s: keccak.s:259: Error: no such instruction: `movi v1.2d,'
keccak.s: keccak.s:260: Error: no such instruction: `movi v2.2d,'
keccak.s: keccak.s:261: Error: no such instruction: `movi v3.2d,'
keccak.s: keccak.s:262: Error: no such instruction: `st4 { v0.2d,v1.2d,v2.2d,v3.2d },[x0],'
keccak.s: keccak.s:263: Error: no such instruction: `st4 { v0.2d,v1.2d,v2.2d,v3.2d },[x0],'
keccak.s: keccak.s:264: Error: no such instruction: `st4 { v0.2d,v1.2d,v2.2d,v3.2d },[x0],'
keccak.s: keccak.s:265: Error: no such instruction: `st1 { v0.d }[0],[x0],'
keccak.s: keccak.s:276: Error: no such instruction: `ldrb w3,[x0,x2]'
keccak.s: keccak.s:277: Error: no such instruction: `eor w3,w3,w1'
keccak.s: keccak.s:278: Error: invalid char '[' beginning operand 2 `[x0'
keccak.s: keccak.s:289: Error: too many memory references for `add'
keccak.s: keccak.s:290: Error: too many memory references for `sub'
keccak.s: keccak.s:291: Error: no such instruction: `b.cc KeccakP1600_AddBytes_Exit//length 0,move along'
keccak.s: keccak.s:293: Error: too many memory references for `sub'
keccak.s: keccak.s:294: Error: no such instruction: `b.cc KeccakP1600_AddBytes_Lanes//Jump if length is negative'
keccak.s: keccak.s:295: Error: no such instruction: `ld4 { v0.2d,v1.2d,v2.2d,v3.2d },[x0]'
keccak.s: keccak.s:296: Error: no such instruction: `ld4 { v4.2d,v5.2d,v6.2d,v7.2d },[x1],'
keccak.s: keccak.s:297: Error: no such instruction: `eor v0.16b,v0.16b,v4.16b'
keccak.s: keccak.s:298: Error: no such instruction: `eor v1.16b,v1.16b,v5.16b'
keccak.s: keccak.s:299: Error: no such instruction: `eor v2.16b,v2.16b,v6.16b'
keccak.s: keccak.s:300: Error: no such instruction: `eor v3.16b,v3.16b,v7.16b'
keccak.s: keccak.s:301: Error: no such instruction: `st4 { v0.2d,v1.2d,v2.2d,v3.2d },[x0],'
keccak.s: keccak.s:302: Error: no such instruction: `b KeccakP1600_AddBytes_8LanesLoop'
keccak.s: ...

Number of similar (compiler,implementation) pairs: 4, namely:
CompilerImplementations
gcc -march=native -mtune=native -O2 -fomit-frame-pointer -fwrapv -fPIC -fPIE T:kcp/optimized1600ARMv8A
gcc -march=native -mtune=native -O3 -fomit-frame-pointer -fwrapv -fPIC -fPIE T:kcp/optimized1600ARMv8A
gcc -march=native -mtune=native -O -fomit-frame-pointer -fwrapv -fPIC -fPIE T:kcp/optimized1600ARMv8A
gcc -march=native -mtune=native -Os -fomit-frame-pointer -fwrapv -fPIC -fPIE T:kcp/optimized1600ARMv8A

Compiler output

Implementation: T:kcp/optimized1600AVX2
Security model: timingleaks
Compiler: clang++ -march=native -O2 -fomit-frame-pointer -fwrapv -Qunused-arguments -fPIC -fPIE
K12.c: clang: warning: treating 'c' input as 'c++' when in C++ mode, this behavior is deprecated [-Wdeprecated]
KangarooTwelve.c: clang: warning: treating 'c' input as 'c++' when in C++ mode, this behavior is deprecated [-Wdeprecated]
KeccakSpongeWidth1600.c: clang: warning: treating 'c' input as 'c++' when in C++ mode, this behavior is deprecated [-Wdeprecated]
KeccakP-1600-AVX2.cpp: KeccakP-1600-AVX2.cpp:87:1: error: AVX vector return of type '__m256i' (vector of 4 'long long' values) without 'avx' enabled changes the ABI
KeccakP-1600-AVX2.cpp: ROLV_CONST(A0, 0, 1, 62, 28)
KeccakP-1600-AVX2.cpp: ^
KeccakP-1600-AVX2.cpp: KeccakP-1600-AVX2.cpp:79:30: note: expanded from macro 'ROLV_CONST'
KeccakP-1600-AVX2.cpp: ROLV_TYPE SLLV##name = SET(i0, i1, i2, i3); \
KeccakP-1600-AVX2.cpp: ^
KeccakP-1600-AVX2.cpp: KeccakP-1600-AVX2.cpp:51:41: note: expanded from macro 'SET'
KeccakP-1600-AVX2.cpp: #define SET(i0, i1, i2, i3) _mm256_setr_epi64x(i0, i1, i2, i3)
KeccakP-1600-AVX2.cpp: ^
KeccakP-1600-AVX2.cpp: 1 error generated.

Number of similar (compiler,implementation) pairs: 4, namely:
CompilerImplementations
clang++ -march=native -O2 -fomit-frame-pointer -fwrapv -Qunused-arguments -fPIC -fPIE T:kcp/optimized1600AVX2
clang++ -march=native -O3 -fomit-frame-pointer -fwrapv -Qunused-arguments -fPIC -fPIE T:kcp/optimized1600AVX2
clang++ -march=native -O -fomit-frame-pointer -fwrapv -Qunused-arguments -fPIC -fPIE T:kcp/optimized1600AVX2
clang++ -march=native -Os -fomit-frame-pointer -fwrapv -Qunused-arguments -fPIC -fPIE T:kcp/optimized1600AVX2

Compiler output

Implementation: T:kcp/optimized1600AVX2
Security model: timingleaks
Compiler: g++ -march=native -mtune=native -O2 -fomit-frame-pointer -fwrapv -fPIC -fPIE
KeccakP-1600-AVX2.cpp: KeccakP-1600-AVX2.cpp: In function 'void KeccakP1600_AddBytes(void*, const UINT8*, size_t, size_t)':
KeccakP-1600-AVX2.cpp: KeccakP-1600-AVX2.cpp:506:10: warning: AVX vector return without AVX enabled changes the ABI [-Wpsabi]
KeccakP-1600-AVX2.cpp: 506 | s.a0 = LOAD(t + 0*5);
KeccakP-1600-AVX2.cpp: | ^
KeccakP-1600-AVX2.cpp: In file included from /usr/lib/gcc/x86_64-linux-gnu/10/include/immintrin.h:51,
KeccakP-1600-AVX2.cpp: from /usr/lib/gcc/x86_64-linux-gnu/10/include/x86intrin.h:32,
KeccakP-1600-AVX2.cpp: from KeccakP-1600-AVX2.cpp:18:
KeccakP-1600-AVX2.cpp: /usr/lib/gcc/x86_64-linux-gnu/10/include/avxintrin.h: In function 'void __static_initialization_and_destruction_0(int, int)':
KeccakP-1600-AVX2.cpp: /usr/lib/gcc/x86_64-linux-gnu/10/include/avxintrin.h:1403:1: error: inlining failed in call to 'always_inline' '__m256i _mm256_setr_epi64x(long long int, long long int, long long int, long long int)': target specific option mismatch
KeccakP-1600-AVX2.cpp: 1403 | _mm256_setr_epi64x (long long __A, long long __B, long long __C,
KeccakP-1600-AVX2.cpp: | ^~~~~~~~~~~~~~~~~~
KeccakP-1600-AVX2.cpp: KeccakP-1600-AVX2.cpp:51:59: note: called from here
KeccakP-1600-AVX2.cpp: 51 | #define SET(i0, i1, i2, i3) _mm256_setr_epi64x(i0, i1, i2, i3)
KeccakP-1600-AVX2.cpp: | ~~~~~~~~~~~~~~~~~~^~~~~~~~~~~~~~~~
KeccakP-1600-AVX2.cpp: KeccakP-1600-AVX2.cpp:84:30: note: in expansion of macro 'SET'
KeccakP-1600-AVX2.cpp: 84 | _ROLV_TYPE SRLV##name = SET(64 - i0, 64 - i1, 64 - i2, 64 - i3);
KeccakP-1600-AVX2.cpp: | ^~~
KeccakP-1600-AVX2.cpp: KeccakP-1600-AVX2.cpp:100:1: note: in expansion of macro '_ROLV_CONST'
KeccakP-1600-AVX2.cpp: 100 | _ROLV_CONST(_C4, 27, 20, 39, 8)
KeccakP-1600-AVX2.cpp: | ^~~~~~~~~~~
KeccakP-1600-AVX2.cpp: In file included from /usr/lib/gcc/x86_64-linux-gnu/10/include/immintrin.h:51,
KeccakP-1600-AVX2.cpp: from /usr/lib/gcc/x86_64-linux-gnu/10/include/x86intrin.h:32,
KeccakP-1600-AVX2.cpp: from KeccakP-1600-AVX2.cpp:18:
KeccakP-1600-AVX2.cpp: /usr/lib/gcc/x86_64-linux-gnu/10/include/avxintrin.h:1403:1: error: inlining failed in call to 'always_inline' '__m256i _mm256_setr_epi64x(long long int, long long int, long long int, long long int)': target specific option mismatch
KeccakP-1600-AVX2.cpp: 1403 | _mm256_setr_epi64x (long long __A, long long __B, long long __C,
KeccakP-1600-AVX2.cpp: ...

Number of similar (compiler,implementation) pairs: 4, namely:
CompilerImplementations
g++ -march=native -mtune=native -O2 -fomit-frame-pointer -fwrapv -fPIC -fPIE T:kcp/optimized1600AVX2
g++ -march=native -mtune=native -O3 -fomit-frame-pointer -fwrapv -fPIC -fPIE T:kcp/optimized1600AVX2
g++ -march=native -mtune=native -O -fomit-frame-pointer -fwrapv -fPIC -fPIE T:kcp/optimized1600AVX2
g++ -march=native -mtune=native -Os -fomit-frame-pointer -fwrapv -fPIC -fPIE T:kcp/optimized1600AVX2

Compiler output

Implementation: T:kcp/optimized1600AVX512
Security model: timingleaks
Compiler: clang -march=native -O2 -fomit-frame-pointer -fwrapv -Qunused-arguments -fPIC -fPIE
KeccakP-1600-AVX512.c: KeccakP-1600-AVX512.c:238:41: error: always_inline function '_mm512_maskz_loadu_epi64' requires target feature 'avx512f', but would be inlined into function 'KeccakP1600_AddBytes' that is compiled without support for 'avx512f'
KeccakP-1600-AVX512.c: STORE_8Lanes( stateAsLanes, XOR(LOAD_8Lanes(stateAsLanes), LOAD_8Lanes((const UINT64*)data)));
KeccakP-1600-AVX512.c: ^
KeccakP-1600-AVX512.c: KeccakP-1600-AVX512.c:215:37: note: expanded from macro 'LOAD_8Lanes'
KeccakP-1600-AVX512.c: #define LOAD_8Lanes(a) LOAD_Lanes(0xFF,a)
KeccakP-1600-AVX512.c: ^
KeccakP-1600-AVX512.c: KeccakP-1600-AVX512.c:212:37: note: expanded from macro 'LOAD_Lanes'
KeccakP-1600-AVX512.c: #define LOAD_Lanes(m,a) _mm512_maskz_loadu_epi64(m,a)
KeccakP-1600-AVX512.c: ^
KeccakP-1600-AVX512.c: KeccakP-1600-AVX512.c:238:41: error: AVX vector return of type '__m512i' (vector of 8 'long long' values) without 'avx512f' enabled changes the ABI
KeccakP-1600-AVX512.c: KeccakP-1600-AVX512.c:215:37: note: expanded from macro 'LOAD_8Lanes'
KeccakP-1600-AVX512.c: #define LOAD_8Lanes(a) LOAD_Lanes(0xFF,a)
KeccakP-1600-AVX512.c: ^
KeccakP-1600-AVX512.c: KeccakP-1600-AVX512.c:212:37: note: expanded from macro 'LOAD_Lanes'
KeccakP-1600-AVX512.c: #define LOAD_Lanes(m,a) _mm512_maskz_loadu_epi64(m,a)
KeccakP-1600-AVX512.c: ^
KeccakP-1600-AVX512.c: KeccakP-1600-AVX512.c:238:68: error: always_inline function '_mm512_maskz_loadu_epi64' requires target feature 'avx512f', but would be inlined into function 'KeccakP1600_AddBytes' that is compiled without support for 'avx512f'
KeccakP-1600-AVX512.c: STORE_8Lanes( stateAsLanes, XOR(LOAD_8Lanes(stateAsLanes), LOAD_8Lanes((const UINT64*)data)));
KeccakP-1600-AVX512.c: ^
KeccakP-1600-AVX512.c: KeccakP-1600-AVX512.c:215:37: note: expanded from macro 'LOAD_8Lanes'
KeccakP-1600-AVX512.c: #define LOAD_8Lanes(a) LOAD_Lanes(0xFF,a)
KeccakP-1600-AVX512.c: ^
KeccakP-1600-AVX512.c: KeccakP-1600-AVX512.c:212:37: note: expanded from macro 'LOAD_Lanes'
KeccakP-1600-AVX512.c: #define LOAD_Lanes(m,a) _mm512_maskz_loadu_epi64(m,a)
KeccakP-1600-AVX512.c: ^
KeccakP-1600-AVX512.c: ...

Number of similar (compiler,implementation) pairs: 5, namely:
CompilerImplementations
clang -march=native -O2 -fomit-frame-pointer -fwrapv -Qunused-arguments -fPIC -fPIE T:kcp/optimized1600AVX512
clang -march=native -O3 -fomit-frame-pointer -fwrapv -Qunused-arguments -fPIC -fPIE T:kcp/optimized1600AVX512
clang -march=native -O -fomit-frame-pointer -fwrapv -Qunused-arguments -fPIC -fPIE T:kcp/optimized1600AVX512
clang -march=native -Os -fomit-frame-pointer -fwrapv -Qunused-arguments -fPIC -fPIE T:kcp/optimized1600AVX512
clang -mcpu=native -O3 -fomit-frame-pointer -fwrapv -Qunused-arguments -fPIC -fPIE T:kcp/optimized1600AVX512

Compiler output

Implementation: T:kcp/optimized1600AVX512
Security model: timingleaks
Compiler: gcc -march=native -mtune=native -O2 -fomit-frame-pointer -fwrapv -fPIC -fPIE
KeccakP-1600-AVX512.c: KeccakP-1600-AVX512.c: In function 'KeccakP1600_AddBytes':
KeccakP-1600-AVX512.c: KeccakP-1600-AVX512.c:216:37: warning: AVX512F vector return without AVX512F enabled changes the ABI [-Wpsabi]
KeccakP-1600-AVX512.c: 216 | #define STORE_Lanes(a,m,v) _mm512_mask_storeu_epi64(a,m,v)
KeccakP-1600-AVX512.c: | ^~~~~~~~~~~~~~~~~~~~~~~~~~~~~~~
KeccakP-1600-AVX512.c: KeccakP-1600-AVX512.c:219:37: note: in expansion of macro 'STORE_Lanes'
KeccakP-1600-AVX512.c: 219 | #define STORE_8Lanes(a,v) STORE_Lanes(a,0xFF,v)
KeccakP-1600-AVX512.c: | ^~~~~~~~~~~
KeccakP-1600-AVX512.c: KeccakP-1600-AVX512.c:238:9: note: in expansion of macro 'STORE_8Lanes'
KeccakP-1600-AVX512.c: 238 | STORE_8Lanes( stateAsLanes, XOR(LOAD_8Lanes(stateAsLanes), LOAD_8Lanes((const UINT64*)data)));
KeccakP-1600-AVX512.c: | ^~~~~~~~~~~~
KeccakP-1600-AVX512.c: In file included from /usr/lib/gcc/x86_64-linux-gnu/10/include/immintrin.h:55,
KeccakP-1600-AVX512.c: from KeccakP-1600-AVX512.c:26:
KeccakP-1600-AVX512.c: /usr/lib/gcc/x86_64-linux-gnu/10/include/avx512fintrin.h:6388:1: error: inlining failed in call to 'always_inline' '_mm512_mask_storeu_epi64': target specific option mismatch
KeccakP-1600-AVX512.c: 6388 | _mm512_mask_storeu_epi64 (void *__P, __mmask8 __U, __m512i __A)
KeccakP-1600-AVX512.c: | ^~~~~~~~~~~~~~~~~~~~~~~~
KeccakP-1600-AVX512.c: KeccakP-1600-AVX512.c:216:37: note: called from here
KeccakP-1600-AVX512.c: 216 | #define STORE_Lanes(a,m,v) _mm512_mask_storeu_epi64(a,m,v)
KeccakP-1600-AVX512.c: | ^~~~~~~~~~~~~~~~~~~~~~~~~~~~~~~
KeccakP-1600-AVX512.c: KeccakP-1600-AVX512.c:219:37: note: in expansion of macro 'STORE_Lanes'
KeccakP-1600-AVX512.c: 219 | #define STORE_8Lanes(a,v) STORE_Lanes(a,0xFF,v)
KeccakP-1600-AVX512.c: | ^~~~~~~~~~~
KeccakP-1600-AVX512.c: KeccakP-1600-AVX512.c:238:9: note: in expansion of macro 'STORE_8Lanes'
KeccakP-1600-AVX512.c: 238 | STORE_8Lanes( stateAsLanes, XOR(LOAD_8Lanes(stateAsLanes), LOAD_8Lanes((const UINT64*)data)));
KeccakP-1600-AVX512.c: | ^~~~~~~~~~~~
KeccakP-1600-AVX512.c: In file included from /usr/lib/gcc/x86_64-linux-gnu/10/include/immintrin.h:55,
KeccakP-1600-AVX512.c: ...

Number of similar (compiler,implementation) pairs: 4, namely:
CompilerImplementations
gcc -march=native -mtune=native -O2 -fomit-frame-pointer -fwrapv -fPIC -fPIE T:kcp/optimized1600AVX512
gcc -march=native -mtune=native -O3 -fomit-frame-pointer -fwrapv -fPIC -fPIE T:kcp/optimized1600AVX512
gcc -march=native -mtune=native -O -fomit-frame-pointer -fwrapv -fPIC -fPIE T:kcp/optimized1600AVX512
gcc -march=native -mtune=native -Os -fomit-frame-pointer -fwrapv -fPIC -fPIE T:kcp/optimized1600AVX512

Compiler output

Implementation: T:kcp/optimized1600AsmX86-64
Security model: timingleaks
Compiler: gcc -march=native -mtune=native -O2 -fomit-frame-pointer -fwrapv -fPIC -fPIE
try.c: /usr/bin/ld: libcrypto_hash_k12.a(keccak.o): relocation R_X86_64_32S against `.text' can not be used when making a PIE object; recompile with -fPIE
try.c: collect2: error: ld returned 1 exit status

Number of similar (compiler,implementation) pairs: 8, namely:
CompilerImplementations
gcc -march=native -mtune=native -O2 -fomit-frame-pointer -fwrapv -fPIC -fPIE T:kcp/optimized1600AsmX86-64
gcc -march=native -mtune=native -O3 -fomit-frame-pointer -fwrapv -fPIC -fPIE T:kcp/optimized1600AsmX86-64
gcc -march=native -mtune=native -O -fomit-frame-pointer -fwrapv -fPIC -fPIE T:kcp/optimized1600AsmX86-64
gcc -march=native -mtune=native -Os -fomit-frame-pointer -fwrapv -fPIC -fPIE T:kcp/optimized1600AsmX86-64
gcc -march=native -mtune=native -O2 -fomit-frame-pointer -fwrapv -fPIC -fPIE T:kcp/optimized1600AsmX86-64shld
gcc -march=native -mtune=native -O3 -fomit-frame-pointer -fwrapv -fPIC -fPIE T:kcp/optimized1600AsmX86-64shld
gcc -march=native -mtune=native -O -fomit-frame-pointer -fwrapv -fPIC -fPIE T:kcp/optimized1600AsmX86-64shld
gcc -march=native -mtune=native -Os -fomit-frame-pointer -fwrapv -fPIC -fPIE T:kcp/optimized1600AsmX86-64shld

Compiler output

Implementation: T:kcp/optimized1600AsmX86-64Apple
Security model: timingleaks
Compiler: clang -march=native -O2 -fomit-frame-pointer -fwrapv -Qunused-arguments -fPIC -fPIE
keccak.s: keccak.s:555:24: error: expected register here
keccak.s: movq %rax, _ba(arg1)
keccak.s: ^
keccak.s: keccak.s:556:24: error: expected register here
keccak.s: movq %rcx, _be(arg1)
keccak.s: ^
keccak.s: keccak.s:557:24: error: expected register here
keccak.s: movq %rcx, _bi(arg1)
keccak.s: ^
keccak.s: keccak.s:558:24: error: expected register here
keccak.s: movq %rax, _bo(arg1)
keccak.s: ^
keccak.s: keccak.s:559:24: error: expected register here
keccak.s: movdqu %xmm0, _bu(arg1)
keccak.s: ^
keccak.s: keccak.s:560:24: error: expected register here
keccak.s: movdqu %xmm0, _ge(arg1)
keccak.s: ^
keccak.s: keccak.s:561:24: error: expected register here
keccak.s: movq %rcx, _go(arg1)
keccak.s: ^
keccak.s: keccak.s:562:24: error: expected register here
keccak.s: movq %rax, _gu(arg1)
keccak.s: ^
keccak.s: keccak.s:563:24: error: expected register here
keccak.s: ...

Number of similar (compiler,implementation) pairs: 5, namely:
CompilerImplementations
clang -march=native -O2 -fomit-frame-pointer -fwrapv -Qunused-arguments -fPIC -fPIE T:kcp/optimized1600AsmX86-64Apple
clang -march=native -O3 -fomit-frame-pointer -fwrapv -Qunused-arguments -fPIC -fPIE T:kcp/optimized1600AsmX86-64Apple
clang -march=native -O -fomit-frame-pointer -fwrapv -Qunused-arguments -fPIC -fPIE T:kcp/optimized1600AsmX86-64Apple
clang -march=native -Os -fomit-frame-pointer -fwrapv -Qunused-arguments -fPIC -fPIE T:kcp/optimized1600AsmX86-64Apple
clang -mcpu=native -O3 -fomit-frame-pointer -fwrapv -Qunused-arguments -fPIC -fPIE T:kcp/optimized1600AsmX86-64Apple

Compiler output

Implementation: T:kcp/optimized1600AsmX86-64Apple
Security model: timingleaks
Compiler: gcc -march=native -mtune=native -O2 -fomit-frame-pointer -fwrapv -fPIC -fPIE
keccak.s: keccak.s: Assembler messages:
keccak.s: keccak.s:555: Error: junk `(arg1)' after expression
keccak.s: keccak.s:556: Error: junk `(arg1)' after expression
keccak.s: keccak.s:557: Error: junk `(arg1)' after expression
keccak.s: keccak.s:558: Error: junk `(arg1)' after expression
keccak.s: keccak.s:559: Error: junk `(arg1)' after expression
keccak.s: keccak.s:560: Error: junk `(arg1)' after expression
keccak.s: keccak.s:561: Error: junk `(arg1)' after expression
keccak.s: keccak.s:562: Error: junk `(arg1)' after expression
keccak.s: keccak.s:563: Error: junk `(arg1)' after expression
keccak.s: keccak.s:564: Error: junk `(arg1)' after expression
keccak.s: keccak.s:565: Error: junk `(arg1)' after expression
keccak.s: keccak.s:566: Error: junk `(arg1)' after expression
keccak.s: keccak.s:567: Error: junk `(arg1)' after expression
keccak.s: keccak.s:568: Error: junk `(arg1)' after expression
keccak.s: keccak.s:569: Error: junk `(arg1)' after expression
keccak.s: keccak.s:570: Error: junk `(arg1)' after expression
keccak.s: keccak.s:571: Error: junk `(arg1)' after expression
keccak.s: keccak.s:572: Error: junk `(arg1)' after expression
keccak.s: keccak.s:573: Error: junk `(arg1)' after expression
keccak.s: keccak.s:583: Error: too many memory references for `add'
keccak.s: keccak.s:598: Error: too many memory references for `add'
keccak.s: keccak.s:601: Error: too many memory references for `movq'
keccak.s: keccak.s:605: Error: junk `(arg2)' after expression
keccak.s: keccak.s:605: Error: junk `(arg1)' after expression
keccak.s: ...

Number of similar (compiler,implementation) pairs: 4, namely:
CompilerImplementations
gcc -march=native -mtune=native -O2 -fomit-frame-pointer -fwrapv -fPIC -fPIE T:kcp/optimized1600AsmX86-64Apple
gcc -march=native -mtune=native -O3 -fomit-frame-pointer -fwrapv -fPIC -fPIE T:kcp/optimized1600AsmX86-64Apple
gcc -march=native -mtune=native -O -fomit-frame-pointer -fwrapv -fPIC -fPIE T:kcp/optimized1600AsmX86-64Apple
gcc -march=native -mtune=native -Os -fomit-frame-pointer -fwrapv -fPIC -fPIE T:kcp/optimized1600AsmX86-64Apple

Compiler output

Implementation: T:kcp/optimized1600XOPu6
Security model: timingleaks
Compiler: clang -march=native -O2 -fomit-frame-pointer -fwrapv -Qunused-arguments -fPIC -fPIE
KeccakP-1600-XOP.c: KeccakP-1600-XOP.c:400:5: error: '__builtin_ia32_vprotqi' needs target feature xop
KeccakP-1600-XOP.c: roundsN(nr)
KeccakP-1600-XOP.c: ^
KeccakP-1600-XOP.c: ./KeccakP-1600-unrolling.macros:297:9: note: expanded from macro 'roundsN'
KeccakP-1600-XOP.c: thetaRhoPiChiIotaPrepareTheta(i, A, E) \
KeccakP-1600-XOP.c: ^
KeccakP-1600-XOP.c: KeccakP-1600-XOP.c:200:5: note: expanded from macro 'thetaRhoPiChiIotaPrepareTheta'
KeccakP-1600-XOP.c: computeD \
KeccakP-1600-XOP.c: ^
KeccakP-1600-XOP.c: KeccakP-1600-XOP.c:187:23: note: expanded from macro 'computeD'
KeccakP-1600-XOP.c: Dei = XOR128(Cae, ROL6464same(Cio, 1)); \
KeccakP-1600-XOP.c: ^
KeccakP-1600-XOP.c: KeccakP-1600-XOP.c:60:29: note: expanded from macro 'ROL6464same'
KeccakP-1600-XOP.c: #define ROL6464same(a, o) _mm_roti_epi64(a, o)
KeccakP-1600-XOP.c: ^
KeccakP-1600-XOP.c: /usr/lib/llvm-11/lib/clang/11.0.1/include/xopintrin.h:237:12: note: expanded from macro '_mm_roti_epi64'
KeccakP-1600-XOP.c: (__m128i)__builtin_ia32_vprotqi((__v2di)(__m128i)(A), (N))
KeccakP-1600-XOP.c: ^
KeccakP-1600-XOP.c: KeccakP-1600-XOP.c:400:5: error: '__builtin_ia32_vprotqi' needs target feature xop
KeccakP-1600-XOP.c: ./KeccakP-1600-unrolling.macros:297:9: note: expanded from macro 'roundsN'
KeccakP-1600-XOP.c: thetaRhoPiChiIotaPrepareTheta(i, A, E) \
KeccakP-1600-XOP.c: ^
KeccakP-1600-XOP.c: KeccakP-1600-XOP.c:200:5: note: expanded from macro 'thetaRhoPiChiIotaPrepareTheta'
KeccakP-1600-XOP.c: computeD \
KeccakP-1600-XOP.c: ^
KeccakP-1600-XOP.c: ...

Number of similar (compiler,implementation) pairs: 10, namely:
CompilerImplementations
clang -march=native -O2 -fomit-frame-pointer -fwrapv -Qunused-arguments -fPIC -fPIE T:kcp/optimized1600XOPu6
clang -march=native -O3 -fomit-frame-pointer -fwrapv -Qunused-arguments -fPIC -fPIE T:kcp/optimized1600XOPu6
clang -march=native -O -fomit-frame-pointer -fwrapv -Qunused-arguments -fPIC -fPIE T:kcp/optimized1600XOPu6
clang -march=native -Os -fomit-frame-pointer -fwrapv -Qunused-arguments -fPIC -fPIE T:kcp/optimized1600XOPu6
clang -mcpu=native -O3 -fomit-frame-pointer -fwrapv -Qunused-arguments -fPIC -fPIE T:kcp/optimized1600XOPu6
clang -march=native -O2 -fomit-frame-pointer -fwrapv -Qunused-arguments -fPIC -fPIE T:kcp/optimized1600XOPufull
clang -march=native -O3 -fomit-frame-pointer -fwrapv -Qunused-arguments -fPIC -fPIE T:kcp/optimized1600XOPufull
clang -march=native -O -fomit-frame-pointer -fwrapv -Qunused-arguments -fPIC -fPIE T:kcp/optimized1600XOPufull
clang -march=native -Os -fomit-frame-pointer -fwrapv -Qunused-arguments -fPIC -fPIE T:kcp/optimized1600XOPufull
clang -mcpu=native -O3 -fomit-frame-pointer -fwrapv -Qunused-arguments -fPIC -fPIE T:kcp/optimized1600XOPufull

Compiler output

Implementation: T:kcp/optimized1600XOPu6
Security model: timingleaks
Compiler: gcc -march=native -mtune=native -O2 -fomit-frame-pointer -fwrapv -fPIC -fPIE
KeccakP-1600-XOP.c: In file included from /usr/lib/gcc/x86_64-linux-gnu/10/include/x86intrin.h:38,
KeccakP-1600-XOP.c: from KeccakP-1600-XOP.c:32:
KeccakP-1600-XOP.c: KeccakP-1600-XOP.c: In function 'KeccakP1600_Permute_Nrounds':
KeccakP-1600-XOP.c: /usr/lib/gcc/x86_64-linux-gnu/10/include/xopintrin.h:272:1: error: inlining failed in call to 'always_inline' '_mm_roti_epi64': target specific option mismatch
KeccakP-1600-XOP.c: 272 | _mm_roti_epi64(__m128i __A, const int __B)
KeccakP-1600-XOP.c: | ^~~~~~~~~~~~~~
KeccakP-1600-XOP.c: KeccakP-1600-XOP.c:60:29: note: called from here
KeccakP-1600-XOP.c: 60 | #define ROL6464same(a, o) _mm_roti_epi64(a, o)
KeccakP-1600-XOP.c: | ^~~~~~~~~~~~~~~~~~~~
KeccakP-1600-XOP.c: KeccakP-1600-XOP.c:250:13: note: in expansion of macro 'ROL6464same'
KeccakP-1600-XOP.c: 250 | Bsusa = ROL6464same(Bsusa, 2); \
KeccakP-1600-XOP.c: | ^~~~~~~~~~~
KeccakP-1600-XOP.c: KeccakP-1600-unrolling.macros:297:9: note: in expansion of macro 'thetaRhoPiChiIotaPrepareTheta'
KeccakP-1600-XOP.c: 297 | thetaRhoPiChiIotaPrepareTheta(i, A, E) \
KeccakP-1600-XOP.c: | ^~~~~~~~~~~~~~~~~~~~~~~~~~~~~
KeccakP-1600-XOP.c: KeccakP-1600-XOP.c:400:5: note: in expansion of macro 'roundsN'
KeccakP-1600-XOP.c: 400 | roundsN(nr)
KeccakP-1600-XOP.c: | ^~~~~~~
KeccakP-1600-XOP.c: In file included from /usr/lib/gcc/x86_64-linux-gnu/10/include/x86intrin.h:38,
KeccakP-1600-XOP.c: from KeccakP-1600-XOP.c:32:
KeccakP-1600-XOP.c: /usr/lib/gcc/x86_64-linux-gnu/10/include/xopintrin.h:245:1: error: inlining failed in call to 'always_inline' '_mm_rot_epi64': target specific option mismatch
KeccakP-1600-XOP.c: 245 | _mm_rot_epi64(__m128i __A, __m128i __B)
KeccakP-1600-XOP.c: | ^~~~~~~~~~~~~
KeccakP-1600-XOP.c: KeccakP-1600-XOP.c:61:29: note: called from here
KeccakP-1600-XOP.c: 61 | #define ROL6464(a, r1, r2) _mm_rot_epi64(a, CONST128( rot_##r1##_##r2 ))
KeccakP-1600-XOP.c: ...

Number of similar (compiler,implementation) pairs: 8, namely:
CompilerImplementations
gcc -march=native -mtune=native -O2 -fomit-frame-pointer -fwrapv -fPIC -fPIE T:kcp/optimized1600XOPu6
gcc -march=native -mtune=native -O3 -fomit-frame-pointer -fwrapv -fPIC -fPIE T:kcp/optimized1600XOPu6
gcc -march=native -mtune=native -O -fomit-frame-pointer -fwrapv -fPIC -fPIE T:kcp/optimized1600XOPu6
gcc -march=native -mtune=native -Os -fomit-frame-pointer -fwrapv -fPIC -fPIE T:kcp/optimized1600XOPu6
gcc -march=native -mtune=native -O2 -fomit-frame-pointer -fwrapv -fPIC -fPIE T:kcp/optimized1600XOPufull
gcc -march=native -mtune=native -O3 -fomit-frame-pointer -fwrapv -fPIC -fPIE T:kcp/optimized1600XOPufull
gcc -march=native -mtune=native -O -fomit-frame-pointer -fwrapv -fPIC -fPIE T:kcp/optimized1600XOPufull
gcc -march=native -mtune=native -Os -fomit-frame-pointer -fwrapv -fPIC -fPIE T:kcp/optimized1600XOPufull