Implementation notes: amd64, cherry, crypto_aead/aegis128l

Computer: cherry
Microarchitecture: amd64; Silvermont (406c4)
Architecture: amd64
CPU ID: GenuineIntel-000406c4-bfebfbff
SUPERCOP version: 20240425
Operation: crypto_aead
Primitive: aegis128l
TimeObject sizeTest sizeImplementationCompilerBenchmark dateSUPERCOP version
144315335 0 018750 804 1016T:aesnicclang_-march=native_-Os_-fomit-frame-pointer_-fwrapv_-Qunused-arguments_-fPIC_-fPIE2024042720240425
146204996 0 019014 804 1016T:aesnicclang_-march=native_-O_-fomit-frame-pointer_-fwrapv_-Qunused-arguments_-fPIC_-fPIE2024042720240425
1469212185 0 027320 812 1016T:aesnicclang_-march=native_-O2_-fomit-frame-pointer_-fwrapv_-Qunused-arguments_-fPIC_-fPIE2024042720240425
1469212329 0 029112 812 1016T:aesnicclang_-march=native_-O3_-fomit-frame-pointer_-fwrapv_-Qunused-arguments_-fPIC_-fPIE2024042720240425
170963216 0 017206 804 1016T:aesnibclang_-march=native_-O_-fomit-frame-pointer_-fwrapv_-Qunused-arguments_-fPIC_-fPIE2024042720240425
173697156 0 022264 812 1016T:aesnibclang_-march=native_-O2_-fomit-frame-pointer_-fwrapv_-Qunused-arguments_-fPIC_-fPIE2024042720240425
173697156 0 023912 812 1016T:aesnibclang_-march=native_-O3_-fomit-frame-pointer_-fwrapv_-Qunused-arguments_-fPIC_-fPIE2024042720240425
175605028 0 018414 804 1016T:aesnibclang_-march=native_-Os_-fomit-frame-pointer_-fwrapv_-Qunused-arguments_-fPIC_-fPIE2024042720240425
179716903 0 021984 812 1016T:aesniaclang_-march=native_-O2_-fomit-frame-pointer_-fwrapv_-Qunused-arguments_-fPIC_-fPIE2024042720240425
179716951 0 023680 812 1016T:aesniaclang_-march=native_-O3_-fomit-frame-pointer_-fwrapv_-Qunused-arguments_-fPIC_-fPIE2024042720240425
181114817 0 018182 804 1016T:aesniaclang_-march=native_-Os_-fomit-frame-pointer_-fwrapv_-Qunused-arguments_-fPIC_-fPIE2024042720240425
1821010422 0 026120 780 1080T:aesnicgcc_-march=native_-mtune=native_-O3_-fomit-frame-pointer_-fwrapv_-fPIC_-fPIE2024042720240425
184617051 0 021600 780 1080T:aesnicgcc_-march=native_-mtune=native_-O2_-fomit-frame-pointer_-fwrapv_-fPIC_-fPIE2024042720240425
187066118 0 020223 772 1080T:aesnicgcc_-march=native_-mtune=native_-O_-fomit-frame-pointer_-fwrapv_-fPIC_-fPIE2024042720240425
187434427 0 018519 772 1080T:aesnibgcc_-march=native_-mtune=native_-O_-fomit-frame-pointer_-fwrapv_-fPIC_-fPIE2024042720240425
188014344 0 017275 756 1048T:aesnicgcc_-march=native_-mtune=native_-Os_-fomit-frame-pointer_-fwrapv_-fPIC_-fPIE2024042720240425
190628267 0 023944 780 1080T:aesnibgcc_-march=native_-mtune=native_-O3_-fomit-frame-pointer_-fwrapv_-fPIC_-fPIE2024042720240425
199225102 0 019167 772 1080T:aesniagcc_-march=native_-mtune=native_-O_-fomit-frame-pointer_-fwrapv_-fPIC_-fPIE2024042720240425
204894520 0 019032 780 1080T:aesnibgcc_-march=native_-mtune=native_-O2_-fomit-frame-pointer_-fwrapv_-fPIC_-fPIE2024042720240425
204958037 0 023696 780 1080T:aesniagcc_-march=native_-mtune=native_-O3_-fomit-frame-pointer_-fwrapv_-fPIC_-fPIE2024042720240425
209025270 0 019776 780 1080T:aesniagcc_-march=native_-mtune=native_-O2_-fomit-frame-pointer_-fwrapv_-fPIC_-fPIE2024042720240425
209102814 0 015715 756 1048T:aesnibgcc_-march=native_-mtune=native_-Os_-fomit-frame-pointer_-fwrapv_-fPIC_-fPIE2024042720240425
1157787319 4096 023016 4884 1080T:refgcc_-march=native_-mtune=native_-O3_-fomit-frame-pointer_-fwrapv_-fPIC_-fPIE2024042720240425
19929178259 0 030664 812 1016T:sodium-softaesclang_-mcpu=native_-O3_-fomit-frame-pointer_-fwrapv_-Qunused-arguments_-fPIC_-fPIE2024042720240425
20542948387 0 031344 812 1016T:sodium-softaesclang_-march=native_-O3_-fomit-frame-pointer_-fwrapv_-Qunused-arguments_-fPIC_-fPIE2024042720240425
20589988387 0 029696 812 1016T:sodium-softaesclang_-march=native_-O2_-fomit-frame-pointer_-fwrapv_-Qunused-arguments_-fPIC_-fPIE2024042720240425
211976311054 1024 033112 1812 1080T:sodium-softaesgcc_-march=native_-mtune=native_-O3_-fomit-frame-pointer_-fwrapv_-fPIC_-fPIE2024042720240425
31378386247 0 025878 804 1016T:sodium-softaesclang_-march=native_-Os_-fomit-frame-pointer_-fwrapv_-Qunused-arguments_-fPIC_-fPIE2024042720240425
31804684199 1024 023147 1788 1048T:sodium-softaesgcc_-march=native_-mtune=native_-Os_-fomit-frame-pointer_-fwrapv_-fPIC_-fPIE2024042720240425
31970658494 1024 029400 1812 1080T:sodium-softaesgcc_-march=native_-mtune=native_-O2_-fomit-frame-pointer_-fwrapv_-fPIC_-fPIE2024042720240425
31978379333 1024 029760 1812 1080T:sodium-softaesgcc_-march=native_-mtune=native_-O_-fomit-frame-pointer_-fwrapv_-fPIC_-fPIE2024042720240425
32671786597 0 026758 804 1016T:sodium-softaesclang_-march=native_-O_-fomit-frame-pointer_-fwrapv_-Qunused-arguments_-fPIC_-fPIE2024042720240425

Test failure

Implementation: jasmin-aesni
Security model: constbranchindex
Compiler: clang -march=native -O2 -fomit-frame-pointer -fwrapv -Qunused-arguments -fPIC -fPIE
error 111

Number of similar (compiler,implementation) pairs: 18, namely:
CompilerImplementations
clang -march=native -O2 -fomit-frame-pointer -fwrapv -Qunused-arguments -fPIC -fPIE jasmin-aesni
clang -march=native -O3 -fomit-frame-pointer -fwrapv -Qunused-arguments -fPIC -fPIE jasmin-aesni
clang -march=native -O -fomit-frame-pointer -fwrapv -Qunused-arguments -fPIC -fPIE jasmin-aesni
clang -march=native -Os -fomit-frame-pointer -fwrapv -Qunused-arguments -fPIC -fPIE jasmin-aesni
clang -mcpu=native -O3 -fomit-frame-pointer -fwrapv -Qunused-arguments -fPIC -fPIE jasmin-aesni
gcc -march=native -mtune=native -O2 -fomit-frame-pointer -fwrapv -fPIC -fPIE jasmin-aesni
gcc -march=native -mtune=native -O3 -fomit-frame-pointer -fwrapv -fPIC -fPIE jasmin-aesni
gcc -march=native -mtune=native -O -fomit-frame-pointer -fwrapv -fPIC -fPIE jasmin-aesni
gcc -march=native -mtune=native -Os -fomit-frame-pointer -fwrapv -fPIC -fPIE jasmin-aesni
clang -march=native -O2 -fomit-frame-pointer -fwrapv -Qunused-arguments -fPIC -fPIE sodium-aesni
clang -march=native -O3 -fomit-frame-pointer -fwrapv -Qunused-arguments -fPIC -fPIE sodium-aesni
clang -march=native -O -fomit-frame-pointer -fwrapv -Qunused-arguments -fPIC -fPIE sodium-aesni
clang -march=native -Os -fomit-frame-pointer -fwrapv -Qunused-arguments -fPIC -fPIE sodium-aesni
clang -mcpu=native -O3 -fomit-frame-pointer -fwrapv -Qunused-arguments -fPIC -fPIE sodium-aesni
gcc -march=native -mtune=native -O2 -fomit-frame-pointer -fwrapv -fPIC -fPIE sodium-aesni
gcc -march=native -mtune=native -O3 -fomit-frame-pointer -fwrapv -fPIC -fPIE sodium-aesni
gcc -march=native -mtune=native -O -fomit-frame-pointer -fwrapv -fPIC -fPIE sodium-aesni
gcc -march=native -mtune=native -Os -fomit-frame-pointer -fwrapv -fPIC -fPIE sodium-aesni

Compiler output

Implementation: T:aesnia
Security model: timingleaks
Compiler: clang -march=native -O -fomit-frame-pointer -fwrapv -Qunused-arguments -fPIC -fPIE
try.c: /usr/bin/ld: libcrypto_aead_aegis128l.a(encrypt.o): in function `crypto_aead_aegis128l_aesnia_timingleaks_encrypt':
try.c: encrypt.c:(.text+0x...): undefined reference to `aegis128L_enc_aut_step'
try.c: /usr/bin/ld: encrypt.c:(.text+0x...): undefined reference to `aegis128L_enc_aut_step'
try.c: /usr/bin/ld: encrypt.c:(.text+0x...): undefined reference to `aegis128L_enc_aut_step'
try.c: /usr/bin/ld: encrypt.c:(.text+0x...): undefined reference to `aegis128L_enc_aut_step'
try.c: /usr/bin/ld: libcrypto_aead_aegis128l.a(encrypt.o): in function `crypto_aead_aegis128l_aesnia_timingleaks_decrypt':
try.c: encrypt.c:(.text+0x...): undefined reference to `aegis128L_enc_aut_step'
try.c: /usr/bin/ld: libcrypto_aead_aegis128l.a(encrypt.o):encrypt.c:(.text+0x...): more undefined references to `aegis128L_enc_aut_step' follow
try.c: /usr/bin/ld: libcrypto_aead_aegis128l.a(encrypt.o): in function `crypto_aead_aegis128l_aesnia_timingleaks_decrypt':
try.c: encrypt.c:(.text+0x...): undefined reference to `aegis128L_dec_aut_step'
try.c: /usr/bin/ld: encrypt.c:(.text+0x...): undefined reference to `aegis128L_dec_aut_step'
try.c: clang: error: linker command failed with exit code 1 (use -v to see invocation)

Number of similar (compiler,implementation) pairs: 1, namely:
CompilerImplementations
clang -march=native -O -fomit-frame-pointer -fwrapv -Qunused-arguments -fPIC -fPIE T:aesnia

Compiler output

Implementation: T:aesnia
Security model: timingleaks
Compiler: clang -mcpu=native -O3 -fomit-frame-pointer -fwrapv -Qunused-arguments -fPIC -fPIE
encrypt.c: encrypt.c:34:25: error: always_inline function '_mm_aesenc_si128' requires target feature 'aes', but would be inlined into function 'aegis128L_initialization' that is compiled without support for 'aes'
encrypt.c: state[7] = _mm_aesenc_si128(state[6],state[7]);
encrypt.c: ^
encrypt.c: encrypt.c:35:25: error: always_inline function '_mm_aesenc_si128' requires target feature 'aes', but would be inlined into function 'aegis128L_initialization' that is compiled without support for 'aes'
encrypt.c: state[6] = _mm_aesenc_si128(state[5],state[6]);
encrypt.c: ^
encrypt.c: encrypt.c:36:25: error: always_inline function '_mm_aesenc_si128' requires target feature 'aes', but would be inlined into function 'aegis128L_initialization' that is compiled without support for 'aes'
encrypt.c: state[5] = _mm_aesenc_si128(state[4],state[5]);
encrypt.c: ^
encrypt.c: encrypt.c:37:25: error: always_inline function '_mm_aesenc_si128' requires target feature 'aes', but would be inlined into function 'aegis128L_initialization' that is compiled without support for 'aes'
encrypt.c: state[4] = _mm_aesenc_si128(state[3],state[4]);
encrypt.c: ^
encrypt.c: encrypt.c:38:25: error: always_inline function '_mm_aesenc_si128' requires target feature 'aes', but would be inlined into function 'aegis128L_initialization' that is compiled without support for 'aes'
encrypt.c: state[3] = _mm_aesenc_si128(state[2],state[3]);
encrypt.c: ^
encrypt.c: encrypt.c:39:25: error: always_inline function '_mm_aesenc_si128' requires target feature 'aes', but would be inlined into function 'aegis128L_initialization' that is compiled without support for 'aes'
encrypt.c: state[2] = _mm_aesenc_si128(state[1],state[2]);
encrypt.c: ^
encrypt.c: encrypt.c:40:25: error: always_inline function '_mm_aesenc_si128' requires target feature 'aes', but would be inlined into function 'aegis128L_initialization' that is compiled without support for 'aes'
encrypt.c: state[1] = _mm_aesenc_si128(state[0],state[1]);
encrypt.c: ^
encrypt.c: encrypt.c:41:25: error: always_inline function '_mm_aesenc_si128' requires target feature 'aes', but would be inlined into function 'aegis128L_initialization' that is compiled without support for 'aes'
encrypt.c: state[0] = _mm_aesenc_si128(tmp,state[0]);
encrypt.c: ^
encrypt.c: 8 errors generated.

Number of similar (compiler,implementation) pairs: 3, namely:
CompilerImplementations
clang -mcpu=native -O3 -fomit-frame-pointer -fwrapv -Qunused-arguments -fPIC -fPIE T:aesnia T:aesnib T:aesnic

Compiler output

Implementation: T:aesnia
Security model: timingleaks
Compiler: gcc -march=native -mtune=native -Os -fomit-frame-pointer -fwrapv -fPIC -fPIE
try.c: /usr/bin/ld: libcrypto_aead_aegis128l.a(encrypt.o): in function `crypto_aead_aegis128l_aesnia_timingleaks_encrypt':
try.c: encrypt.c:(.text+0x...): undefined reference to `aegis128L_enc_aut_step'
try.c: /usr/bin/ld: encrypt.c:(.text+0x...): undefined reference to `aegis128L_enc_aut_step'
try.c: /usr/bin/ld: encrypt.c:(.text+0x...): undefined reference to `aegis128L_enc_aut_step'
try.c: /usr/bin/ld: encrypt.c:(.text+0x...): undefined reference to `aegis128L_enc_aut_step'
try.c: /usr/bin/ld: libcrypto_aead_aegis128l.a(encrypt.o): in function `crypto_aead_aegis128l_aesnia_timingleaks_decrypt':
try.c: encrypt.c:(.text+0x...): undefined reference to `aegis128L_enc_aut_step'
try.c: /usr/bin/ld: libcrypto_aead_aegis128l.a(encrypt.o):encrypt.c:(.text+0x...): more undefined references to `aegis128L_enc_aut_step' follow
try.c: /usr/bin/ld: libcrypto_aead_aegis128l.a(encrypt.o): in function `crypto_aead_aegis128l_aesnia_timingleaks_decrypt':
try.c: encrypt.c:(.text+0x...): undefined reference to `aegis128L_dec_aut_step'
try.c: /usr/bin/ld: encrypt.c:(.text+0x...): undefined reference to `aegis128L_dec_aut_step'
try.c: collect2: error: ld returned 1 exit status

Number of similar (compiler,implementation) pairs: 1, namely:
CompilerImplementations
gcc -march=native -mtune=native -Os -fomit-frame-pointer -fwrapv -fPIC -fPIE T:aesnia

Compiler output

Implementation: T:ref
Security model: timingleaks
Compiler: clang -march=native -O2 -fomit-frame-pointer -fwrapv -Qunused-arguments -fPIC -fPIE
try.c: /usr/bin/ld: libcrypto_aead_aegis128l.a(ecrypt.o): in function `crypto_aead_aegis128l_ref_timingleaks_encrypt':
try.c: ecrypt.c:(.text+0x...): undefined reference to `aegis128L_enc_aut_step'
try.c: /usr/bin/ld: ecrypt.c:(.text+0x...): undefined reference to `aegis128L_enc_aut_step'
try.c: /usr/bin/ld: ecrypt.c:(.text+0x...): undefined reference to `aegis128L_enc_aut_step'
try.c: /usr/bin/ld: ecrypt.c:(.text+0x...): undefined reference to `aegis128L_enc_aut_step'
try.c: /usr/bin/ld: libcrypto_aead_aegis128l.a(ecrypt.o): in function `crypto_aead_aegis128l_ref_timingleaks_decrypt':
try.c: ecrypt.c:(.text+0x...): undefined reference to `aegis128L_enc_aut_step'
try.c: /usr/bin/ld: libcrypto_aead_aegis128l.a(ecrypt.o):ecrypt.c:(.text+0x...): more undefined references to `aegis128L_enc_aut_step' follow
try.c: /usr/bin/ld: libcrypto_aead_aegis128l.a(ecrypt.o): in function `crypto_aead_aegis128l_ref_timingleaks_decrypt':
try.c: ecrypt.c:(.text+0x...): undefined reference to `aegis128L_dec_aut_step'
try.c: /usr/bin/ld: ecrypt.c:(.text+0x...): undefined reference to `aegis128L_dec_aut_step'
try.c: clang: error: linker command failed with exit code 1 (use -v to see invocation)

Number of similar (compiler,implementation) pairs: 5, namely:
CompilerImplementations
clang -march=native -O2 -fomit-frame-pointer -fwrapv -Qunused-arguments -fPIC -fPIE T:ref
clang -march=native -O3 -fomit-frame-pointer -fwrapv -Qunused-arguments -fPIC -fPIE T:ref
clang -march=native -O -fomit-frame-pointer -fwrapv -Qunused-arguments -fPIC -fPIE T:ref
clang -march=native -Os -fomit-frame-pointer -fwrapv -Qunused-arguments -fPIC -fPIE T:ref
clang -mcpu=native -O3 -fomit-frame-pointer -fwrapv -Qunused-arguments -fPIC -fPIE T:ref

Compiler output

Implementation: T:ref
Security model: timingleaks
Compiler: gcc -march=native -mtune=native -O2 -fomit-frame-pointer -fwrapv -fPIC -fPIE
try.c: /usr/bin/ld: libcrypto_aead_aegis128l.a(ecrypt.o): in function `crypto_aead_aegis128l_ref_timingleaks_encrypt':
try.c: ecrypt.c:(.text+0x...): undefined reference to `aegis128L_enc_aut_step'
try.c: /usr/bin/ld: ecrypt.c:(.text+0x...): undefined reference to `aegis128L_enc_aut_step'
try.c: /usr/bin/ld: ecrypt.c:(.text+0x...): undefined reference to `aegis128L_enc_aut_step'
try.c: /usr/bin/ld: ecrypt.c:(.text+0x...): undefined reference to `aegis128L_enc_aut_step'
try.c: /usr/bin/ld: ecrypt.c:(.text+0x...): undefined reference to `aegis128L_enc_aut_step'
try.c: /usr/bin/ld: libcrypto_aead_aegis128l.a(ecrypt.o):ecrypt.c:(.text+0x...): more undefined references to `aegis128L_enc_aut_step' follow
try.c: /usr/bin/ld: libcrypto_aead_aegis128l.a(ecrypt.o): in function `crypto_aead_aegis128l_ref_timingleaks_decrypt':
try.c: ecrypt.c:(.text+0x...): undefined reference to `aegis128L_dec_aut_step'
try.c: /usr/bin/ld: ecrypt.c:(.text+0x...): undefined reference to `aegis128L_enc_aut_step'
try.c: /usr/bin/ld: ecrypt.c:(.text+0x...): undefined reference to `aegis128L_dec_aut_step'
try.c: /usr/bin/ld: ecrypt.c:(.text+0x...): undefined reference to `aegis128L_enc_aut_step'
try.c: collect2: error: ld returned 1 exit status

Number of similar (compiler,implementation) pairs: 1, namely:
CompilerImplementations
gcc -march=native -mtune=native -O2 -fomit-frame-pointer -fwrapv -fPIC -fPIE T:ref

Compiler output

Implementation: T:ref
Security model: timingleaks
Compiler: gcc -march=native -mtune=native -O -fomit-frame-pointer -fwrapv -fPIC -fPIE
try.c: /usr/bin/ld: libcrypto_aead_aegis128l.a(ecrypt.o): in function `crypto_aead_aegis128l_ref_timingleaks_encrypt':
try.c: ecrypt.c:(.text+0x...): undefined reference to `aegis128L_enc_aut_step'
try.c: /usr/bin/ld: ecrypt.c:(.text+0x...): undefined reference to `aegis128L_enc_aut_step'
try.c: /usr/bin/ld: ecrypt.c:(.text+0x...): undefined reference to `aegis128L_enc_aut_step'
try.c: /usr/bin/ld: ecrypt.c:(.text+0x...): undefined reference to `aegis128L_enc_aut_step'
try.c: /usr/bin/ld: libcrypto_aead_aegis128l.a(ecrypt.o): in function `crypto_aead_aegis128l_ref_timingleaks_decrypt':
try.c: ecrypt.c:(.text+0x...): undefined reference to `aegis128L_enc_aut_step'
try.c: /usr/bin/ld: ecrypt.c:(.text+0x...): undefined reference to `aegis128L_dec_aut_step'
try.c: /usr/bin/ld: ecrypt.c:(.text+0x...): undefined reference to `aegis128L_enc_aut_step'
try.c: /usr/bin/ld: ecrypt.c:(.text+0x...): undefined reference to `aegis128L_dec_aut_step'
try.c: collect2: error: ld returned 1 exit status

Number of similar (compiler,implementation) pairs: 1, namely:
CompilerImplementations
gcc -march=native -mtune=native -O -fomit-frame-pointer -fwrapv -fPIC -fPIE T:ref

Compiler output

Implementation: T:ref
Security model: timingleaks
Compiler: gcc -march=native -mtune=native -Os -fomit-frame-pointer -fwrapv -fPIC -fPIE
try.c: /usr/bin/ld: libcrypto_aead_aegis128l.a(ecrypt.o): in function `crypto_aead_aegis128l_ref_timingleaks_encrypt':
try.c: ecrypt.c:(.text+0x...): undefined reference to `aegis128L_enc_aut_step'
try.c: /usr/bin/ld: ecrypt.c:(.text+0x...): undefined reference to `aegis128L_enc_aut_step'
try.c: /usr/bin/ld: ecrypt.c:(.text+0x...): undefined reference to `aegis128L_enc_aut_step'
try.c: /usr/bin/ld: ecrypt.c:(.text+0x...): undefined reference to `aegis128L_enc_aut_step'
try.c: /usr/bin/ld: libcrypto_aead_aegis128l.a(ecrypt.o): in function `crypto_aead_aegis128l_ref_timingleaks_decrypt':
try.c: ecrypt.c:(.text+0x...): undefined reference to `aegis128L_enc_aut_step'
try.c: /usr/bin/ld: libcrypto_aead_aegis128l.a(ecrypt.o):ecrypt.c:(.text+0x...): more undefined references to `aegis128L_enc_aut_step' follow
try.c: /usr/bin/ld: libcrypto_aead_aegis128l.a(ecrypt.o): in function `crypto_aead_aegis128l_ref_timingleaks_decrypt':
try.c: ecrypt.c:(.text+0x...): undefined reference to `aegis128L_dec_aut_step'
try.c: /usr/bin/ld: ecrypt.c:(.text+0x...): undefined reference to `aegis128L_dec_aut_step'
try.c: collect2: error: ld returned 1 exit status

Number of similar (compiler,implementation) pairs: 1, namely:
CompilerImplementations
gcc -march=native -mtune=native -Os -fomit-frame-pointer -fwrapv -fPIC -fPIE T:ref