Implementation notes: amd64, cezanne, crypto_verify/8

Computer: cezanne
Microarchitecture: amd64; Zen 3 (a50f00)
Architecture: amd64
CPU ID: AuthenticAMD-00a50f00-178bfbff
SUPERCOP version: 20240716
Operation: crypto_verify
Primitive: 8
TimeObject sizeTest sizeImplementationCompilerBenchmark dateSUPERCOP version
36105 0 012640 812 888refclang_-march=native_-O2_-fwrapv_-Qunused-arguments_-fPIC_-fPIE_-gdwarf-4_-Wall2024071620240716
36105 0 012768 812 888refclang_-march=native_-O3_-fwrapv_-Qunused-arguments_-fPIC_-fPIE_-gdwarf-4_-Wall2024071620240716
36103 0 09798 804 888refclang_-march=native_-Os_-fwrapv_-Qunused-arguments_-fPIC_-fPIE_-gdwarf-4_-Wall2024071620240716
36114 0 012400 812 888refclang_-mcpu=native_-O3_-fwrapv_-Qunused-arguments_-fPIC_-fPIE_-gdwarf-4_-Wall2024071620240716
41157 0 010544 780 920refgcc_-march=native_-mtune=native_-O2_-fwrapv_-fPIC_-fPIE_-gdwarf-4_-Wall2024071620240716
41157 0 012240 780 920refgcc_-march=native_-mtune=native_-O3_-fwrapv_-fPIC_-fPIE_-gdwarf-4_-Wall2024071620240716
43157 0 010183 772 920refgcc_-march=native_-mtune=native_-O_-fwrapv_-fPIC_-fPIE_-gdwarf-4_-Wall2024071620240716
44133 0 010094 804 888refclang_-march=native_-O_-fwrapv_-Qunused-arguments_-fPIC_-fPIE_-gdwarf-4_-Wall2024071620240716
49135 0 09267 756 888refgcc_-march=native_-mtune=native_-Os_-fwrapv_-fPIC_-fPIE_-gdwarf-4_-Wall2024071620240716

Compiler output


try.c: error: linking with `cc` failed: exit code: 1
try.c:   |
try.c:   = note: "cc" "-Wl,--as-needed" "-Wl,-z,noexecstack" "-m64" "-Wl,--eh-frame-hdr" "-L" "/usr/lib/rustlib/x86_64-unknown-linux-gnu/lib" ".../supercop-data/cezanne/amd64/try/c/clang_-march=native_-O2_-fwrapv_-Qunused-arguments_-fPIC_-fPIE_-gdwarf-4_-Wall/constbranchindex/crypto_verify/8/rust/work/target/release/deps/try_small-d4fe50a9c9f4e270.try_small.2o9qir8m-cgu.0.rcgu.o" ".../supercop-data/cezanne/amd64/try/c/clang_-march=native_-O2_-fwrapv_-Qunused-arguments_-fPIC_-fPIE_-gdwarf-4_-Wall/constbranchindex/crypto_verify/8/rust/work/target/release/deps/try_small-d4fe50a9c9f4e270.try_small.2o9qir8m-cgu.1.rcgu.o" ".../supercop-data/cezanne/amd64/try/c/clang_-march=native_-O2_-fwrapv_-Qunused-arguments_-fPIC_-fPIE_-gdwarf-4_-Wall/constbranchindex/crypto_verify/8/rust/work/target/release/deps/try_small-d4fe50a9c9f4e270.try_small.2o9qir8m-cgu.2.rcgu.o" ".../supercop-data/cezanne/amd64/try/c/clang_-march=native_-O2_-fwrapv_-Qunused-arguments_-fPIC_-fPIE_-gdwarf-4_-Wall/constbranchindex/crypto_verify/8/rust/work/target/release/deps/try_small-d4fe50a9c9f4e270.try_small.2o9qir8m-cgu.3.rcgu.o" ".../supercop-data/cezanne/amd64/try/c/clang_-march=native_-O2_-fwrapv_-Qunused-arguments_-fPIC_-fPIE_-gdwarf-4_-Wall/constbranchindex/crypto_verify/8/rust/work/target/release/deps/try_small-d4fe50a9c9f4e270.try_small.2o9qir8m-cgu.4.rcgu.o" "-o" ".../supercop-data/cezanne/amd64/try/c/clang_-march=native_-O2_-fwrapv_-Qunused-arguments_-fPIC_-fPIE_-gdwarf-4_-Wall/constbranchindex/crypto_verify/8/rust/work/target/release/deps/try_small-d4fe50a9c9f4e270" ".../supercop-data/cezanne/amd64/try/c/clang_-march=native_-O2_-fwrapv_-Qunused-arguments_-fPIC_-fPIE_-gdwarf-4_-Wall/constbranchindex/crypto_verify/8/rust/work/target/release/deps/try_small-d4fe50a9c9f4e270.3fmu5a3xa1q1pamg.rcgu.o" "-Wl,--gc-sections" "-pie" "-Wl,-zrelro" "-Wl,-znow" "-Wl,-O1" "-nodefaultlibs" "-L" ".../supercop-data/cezanne/amd64/try/c/clang_-march=native_-O2_-fwrapv_-Qunused-arguments_-fPIC_-fPIE_-gdwarf-4_-Wall/constbranchindex/crypto_verify/8/rust/work/target/release/deps" "-L" ".../supercop-data/cezanne/amd64/lib" "-L" ".../supercop-data/cezanne/amd64/try/c/clang_-march=native_-O2_-fwrapv_-Qunused-arguments_-fPIC_-fPIE_-gdwarf-4_-Wall/constbranchindex/crypto_verify/8/rust/work/target/release/build/crypto_verify_8-f51523d0b93c052b/out" "-L" "/usr/lib/rustlib/x86_64-unknown-linux-gnu/lib" "-ltry-anything" "-ltry-small" "-lsupercop" "-lkernelrandombytes" "-lcpucycles" "-lcrypto" "-lnsl" "-lm" "-Wl,-Bstatic" ".../supercop-data/cezanne/amd64/try/c/clang_-march=native_-O2_-fwrapv_-Qunused-arguments_-fPIC_-fPIE_-gdwarf-4_-Wall/constbranchindex/crypto_verify/8/rust/work/target/release/deps/libcrypto_verify_8-59884264061485e0.rlib" "-Wl,--start-group" "/usr/lib/rustlib/x86_64-unknown-linux-gnu/lib/libstd-6bf3f16f340782ca.rlib" "/usr/lib/rustlib/x86_64-unknown-linux-gnu/lib/libpanic_unwind-13f3099d50c21bc6.rlib" "/usr/lib/rustlib/x86_64-unknown-linux-gnu/lib/libminiz_oxide-a2ba33c985785afe.rlib" "/usr/lib/rustlib/x86_64-unknown-linux-gnu/lib/libadler-3f6e9f8f4afbea6d.rlib" "/usr/lib/rustlib/x86_64-unknown-linux-gnu/lib/libobject-af517d7f13e7c960.rlib" "/usr/lib/rustlib/x86_64-unknown-linux-gnu/lib/libaddr2line-12740563628e601f.rlib" "/usr/lib/rustlib/x86_64-unknown-linux-gnu/lib/libgimli-0ac82a1e1820dd21.rlib" "/usr/lib/rustlib/x86_64-unknown-linux-gnu/lib/librustc_demangle-3ac2d0878c297d42.rlib" "/usr/lib/rustlib/x86_64-unknown-linux-gnu/lib/libhashbrown-c6632ca171f954dd.rlib" "/usr/lib/rustlib/x86_64-unknown-linux-gnu/lib/librustc_std_workspace_alloc-b5bfd0198c7b740d.rlib" "/usr/lib/rustlib/x86_64-unknown-linux-gnu/lib/libunwind-bd645b20c6c7b56d.rlib" "/usr/lib/rustlib/x86_64-unknown-linux-gnu/lib/libcfg_if-b9e1e523c0c29a77.rlib" "/usr/lib/rustlib/x86_64-unknown-linux-gnu/lib/liblibc-dfbef8c525de0186.rlib" "/usr/lib/rustlib/x86_64-unknown-linux-gnu/lib/liballoc-1ebf406bd4ea5769.rlib" "/usr/lib/rustlib/x86_64-unknown-linux-gnu/lib/librustc_std_workspace_core-5e0675f526ef5c6b.rlib" "/usr/lib/rustlib/x86_64-unknown-linux-gnu/lib/libcore-3375e4f89d420e7a.rlib" "-Wl,--end-group" "/usr/lib/rustlib/x86_64-unknown-linux-gnu/lib/libcompiler_builtins-f74b197469e67088.rlib" "-Wl,-Bdynamic" "-lgcc_s" "-lc" "-lm" "-lrt" "-lpthread" "-lutil" "-ldl" "-lutil"
try.c:   = note: /usr/bin/ld: cannot find -lcpucycles
try.c:           collect2: error: ld returned 1 exit status
try.c:
try.c:
try.c: error: aborting due to previous error
try.c:
try.c: error: could not compile `crypto_verify_8`.
try.c:
try.c: To learn more, run the command again with --verbose.

Number of similar (implementation,compiler) pairs: 1, namely:
ImplementationCompiler
rustclang -march=native -O2 -fwrapv -Qunused-arguments -fPIC -fPIE -gdwarf-4 -Wall (Debian_Clang_11.0.1)

Compiler output


try.c: error: linking with `cc` failed: exit code: 1
try.c:   |
try.c:   = note: "cc" "-Wl,--as-needed" "-Wl,-z,noexecstack" "-m64" "-Wl,--eh-frame-hdr" "-L" "/usr/lib/rustlib/x86_64-unknown-linux-gnu/lib" ".../supercop-data/cezanne/amd64/try/c/clang_-march=native_-O3_-fwrapv_-Qunused-arguments_-fPIC_-fPIE_-gdwarf-4_-Wall/constbranchindex/crypto_verify/8/rust/work/target/release/deps/try_small-d4fe50a9c9f4e270.try_small.2o9qir8m-cgu.0.rcgu.o" ".../supercop-data/cezanne/amd64/try/c/clang_-march=native_-O3_-fwrapv_-Qunused-arguments_-fPIC_-fPIE_-gdwarf-4_-Wall/constbranchindex/crypto_verify/8/rust/work/target/release/deps/try_small-d4fe50a9c9f4e270.try_small.2o9qir8m-cgu.1.rcgu.o" ".../supercop-data/cezanne/amd64/try/c/clang_-march=native_-O3_-fwrapv_-Qunused-arguments_-fPIC_-fPIE_-gdwarf-4_-Wall/constbranchindex/crypto_verify/8/rust/work/target/release/deps/try_small-d4fe50a9c9f4e270.try_small.2o9qir8m-cgu.2.rcgu.o" ".../supercop-data/cezanne/amd64/try/c/clang_-march=native_-O3_-fwrapv_-Qunused-arguments_-fPIC_-fPIE_-gdwarf-4_-Wall/constbranchindex/crypto_verify/8/rust/work/target/release/deps/try_small-d4fe50a9c9f4e270.try_small.2o9qir8m-cgu.3.rcgu.o" ".../supercop-data/cezanne/amd64/try/c/clang_-march=native_-O3_-fwrapv_-Qunused-arguments_-fPIC_-fPIE_-gdwarf-4_-Wall/constbranchindex/crypto_verify/8/rust/work/target/release/deps/try_small-d4fe50a9c9f4e270.try_small.2o9qir8m-cgu.4.rcgu.o" "-o" ".../supercop-data/cezanne/amd64/try/c/clang_-march=native_-O3_-fwrapv_-Qunused-arguments_-fPIC_-fPIE_-gdwarf-4_-Wall/constbranchindex/crypto_verify/8/rust/work/target/release/deps/try_small-d4fe50a9c9f4e270" ".../supercop-data/cezanne/amd64/try/c/clang_-march=native_-O3_-fwrapv_-Qunused-arguments_-fPIC_-fPIE_-gdwarf-4_-Wall/constbranchindex/crypto_verify/8/rust/work/target/release/deps/try_small-d4fe50a9c9f4e270.3fmu5a3xa1q1pamg.rcgu.o" "-Wl,--gc-sections" "-pie" "-Wl,-zrelro" "-Wl,-znow" "-Wl,-O1" "-nodefaultlibs" "-L" ".../supercop-data/cezanne/amd64/try/c/clang_-march=native_-O3_-fwrapv_-Qunused-arguments_-fPIC_-fPIE_-gdwarf-4_-Wall/constbranchindex/crypto_verify/8/rust/work/target/release/deps" "-L" ".../supercop-data/cezanne/amd64/lib" "-L" ".../supercop-data/cezanne/amd64/try/c/clang_-march=native_-O3_-fwrapv_-Qunused-arguments_-fPIC_-fPIE_-gdwarf-4_-Wall/constbranchindex/crypto_verify/8/rust/work/target/release/build/crypto_verify_8-f51523d0b93c052b/out" "-L" "/usr/lib/rustlib/x86_64-unknown-linux-gnu/lib" "-ltry-anything" "-ltry-small" "-lsupercop" "-lkernelrandombytes" "-lcpucycles" "-lcrypto" "-lnsl" "-lm" "-Wl,-Bstatic" ".../supercop-data/cezanne/amd64/try/c/clang_-march=native_-O3_-fwrapv_-Qunused-arguments_-fPIC_-fPIE_-gdwarf-4_-Wall/constbranchindex/crypto_verify/8/rust/work/target/release/deps/libcrypto_verify_8-59884264061485e0.rlib" "-Wl,--start-group" "/usr/lib/rustlib/x86_64-unknown-linux-gnu/lib/libstd-6bf3f16f340782ca.rlib" "/usr/lib/rustlib/x86_64-unknown-linux-gnu/lib/libpanic_unwind-13f3099d50c21bc6.rlib" "/usr/lib/rustlib/x86_64-unknown-linux-gnu/lib/libminiz_oxide-a2ba33c985785afe.rlib" "/usr/lib/rustlib/x86_64-unknown-linux-gnu/lib/libadler-3f6e9f8f4afbea6d.rlib" "/usr/lib/rustlib/x86_64-unknown-linux-gnu/lib/libobject-af517d7f13e7c960.rlib" "/usr/lib/rustlib/x86_64-unknown-linux-gnu/lib/libaddr2line-12740563628e601f.rlib" "/usr/lib/rustlib/x86_64-unknown-linux-gnu/lib/libgimli-0ac82a1e1820dd21.rlib" "/usr/lib/rustlib/x86_64-unknown-linux-gnu/lib/librustc_demangle-3ac2d0878c297d42.rlib" "/usr/lib/rustlib/x86_64-unknown-linux-gnu/lib/libhashbrown-c6632ca171f954dd.rlib" "/usr/lib/rustlib/x86_64-unknown-linux-gnu/lib/librustc_std_workspace_alloc-b5bfd0198c7b740d.rlib" "/usr/lib/rustlib/x86_64-unknown-linux-gnu/lib/libunwind-bd645b20c6c7b56d.rlib" "/usr/lib/rustlib/x86_64-unknown-linux-gnu/lib/libcfg_if-b9e1e523c0c29a77.rlib" "/usr/lib/rustlib/x86_64-unknown-linux-gnu/lib/liblibc-dfbef8c525de0186.rlib" "/usr/lib/rustlib/x86_64-unknown-linux-gnu/lib/liballoc-1ebf406bd4ea5769.rlib" "/usr/lib/rustlib/x86_64-unknown-linux-gnu/lib/librustc_std_workspace_core-5e0675f526ef5c6b.rlib" "/usr/lib/rustlib/x86_64-unknown-linux-gnu/lib/libcore-3375e4f89d420e7a.rlib" "-Wl,--end-group" "/usr/lib/rustlib/x86_64-unknown-linux-gnu/lib/libcompiler_builtins-f74b197469e67088.rlib" "-Wl,-Bdynamic" "-lgcc_s" "-lc" "-lm" "-lrt" "-lpthread" "-lutil" "-ldl" "-lutil"
try.c:   = note: /usr/bin/ld: cannot find -lcpucycles
try.c:           collect2: error: ld returned 1 exit status
try.c:
try.c:
try.c: error: aborting due to previous error
try.c:
try.c: error: could not compile `crypto_verify_8`.
try.c:
try.c: To learn more, run the command again with --verbose.

Number of similar (implementation,compiler) pairs: 1, namely:
ImplementationCompiler
rustclang -march=native -O3 -fwrapv -Qunused-arguments -fPIC -fPIE -gdwarf-4 -Wall (Debian_Clang_11.0.1)

Compiler output


try.c: error: linking with `cc` failed: exit code: 1
try.c:   |
try.c:   = note: "cc" "-Wl,--as-needed" "-Wl,-z,noexecstack" "-m64" "-Wl,--eh-frame-hdr" "-L" "/usr/lib/rustlib/x86_64-unknown-linux-gnu/lib" ".../supercop-data/cezanne/amd64/try/c/clang_-march=native_-O_-fwrapv_-Qunused-arguments_-fPIC_-fPIE_-gdwarf-4_-Wall/constbranchindex/crypto_verify/8/rust/work/target/release/deps/try_small-d4fe50a9c9f4e270.try_small.2o9qir8m-cgu.0.rcgu.o" ".../supercop-data/cezanne/amd64/try/c/clang_-march=native_-O_-fwrapv_-Qunused-arguments_-fPIC_-fPIE_-gdwarf-4_-Wall/constbranchindex/crypto_verify/8/rust/work/target/release/deps/try_small-d4fe50a9c9f4e270.try_small.2o9qir8m-cgu.1.rcgu.o" ".../supercop-data/cezanne/amd64/try/c/clang_-march=native_-O_-fwrapv_-Qunused-arguments_-fPIC_-fPIE_-gdwarf-4_-Wall/constbranchindex/crypto_verify/8/rust/work/target/release/deps/try_small-d4fe50a9c9f4e270.try_small.2o9qir8m-cgu.2.rcgu.o" ".../supercop-data/cezanne/amd64/try/c/clang_-march=native_-O_-fwrapv_-Qunused-arguments_-fPIC_-fPIE_-gdwarf-4_-Wall/constbranchindex/crypto_verify/8/rust/work/target/release/deps/try_small-d4fe50a9c9f4e270.try_small.2o9qir8m-cgu.3.rcgu.o" ".../supercop-data/cezanne/amd64/try/c/clang_-march=native_-O_-fwrapv_-Qunused-arguments_-fPIC_-fPIE_-gdwarf-4_-Wall/constbranchindex/crypto_verify/8/rust/work/target/release/deps/try_small-d4fe50a9c9f4e270.try_small.2o9qir8m-cgu.4.rcgu.o" "-o" ".../supercop-data/cezanne/amd64/try/c/clang_-march=native_-O_-fwrapv_-Qunused-arguments_-fPIC_-fPIE_-gdwarf-4_-Wall/constbranchindex/crypto_verify/8/rust/work/target/release/deps/try_small-d4fe50a9c9f4e270" ".../supercop-data/cezanne/amd64/try/c/clang_-march=native_-O_-fwrapv_-Qunused-arguments_-fPIC_-fPIE_-gdwarf-4_-Wall/constbranchindex/crypto_verify/8/rust/work/target/release/deps/try_small-d4fe50a9c9f4e270.3fmu5a3xa1q1pamg.rcgu.o" "-Wl,--gc-sections" "-pie" "-Wl,-zrelro" "-Wl,-znow" "-Wl,-O1" "-nodefaultlibs" "-L" ".../supercop-data/cezanne/amd64/try/c/clang_-march=native_-O_-fwrapv_-Qunused-arguments_-fPIC_-fPIE_-gdwarf-4_-Wall/constbranchindex/crypto_verify/8/rust/work/target/release/deps" "-L" ".../supercop-data/cezanne/amd64/lib" "-L" ".../supercop-data/cezanne/amd64/try/c/clang_-march=native_-O_-fwrapv_-Qunused-arguments_-fPIC_-fPIE_-gdwarf-4_-Wall/constbranchindex/crypto_verify/8/rust/work/target/release/build/crypto_verify_8-f51523d0b93c052b/out" "-L" "/usr/lib/rustlib/x86_64-unknown-linux-gnu/lib" "-ltry-anything" "-ltry-small" "-lsupercop" "-lkernelrandombytes" "-lcpucycles" "-lcrypto" "-lnsl" "-lm" "-Wl,-Bstatic" ".../supercop-data/cezanne/amd64/try/c/clang_-march=native_-O_-fwrapv_-Qunused-arguments_-fPIC_-fPIE_-gdwarf-4_-Wall/constbranchindex/crypto_verify/8/rust/work/target/release/deps/libcrypto_verify_8-59884264061485e0.rlib" "-Wl,--start-group" "/usr/lib/rustlib/x86_64-unknown-linux-gnu/lib/libstd-6bf3f16f340782ca.rlib" "/usr/lib/rustlib/x86_64-unknown-linux-gnu/lib/libpanic_unwind-13f3099d50c21bc6.rlib" "/usr/lib/rustlib/x86_64-unknown-linux-gnu/lib/libminiz_oxide-a2ba33c985785afe.rlib" "/usr/lib/rustlib/x86_64-unknown-linux-gnu/lib/libadler-3f6e9f8f4afbea6d.rlib" "/usr/lib/rustlib/x86_64-unknown-linux-gnu/lib/libobject-af517d7f13e7c960.rlib" "/usr/lib/rustlib/x86_64-unknown-linux-gnu/lib/libaddr2line-12740563628e601f.rlib" "/usr/lib/rustlib/x86_64-unknown-linux-gnu/lib/libgimli-0ac82a1e1820dd21.rlib" "/usr/lib/rustlib/x86_64-unknown-linux-gnu/lib/librustc_demangle-3ac2d0878c297d42.rlib" "/usr/lib/rustlib/x86_64-unknown-linux-gnu/lib/libhashbrown-c6632ca171f954dd.rlib" "/usr/lib/rustlib/x86_64-unknown-linux-gnu/lib/librustc_std_workspace_alloc-b5bfd0198c7b740d.rlib" "/usr/lib/rustlib/x86_64-unknown-linux-gnu/lib/libunwind-bd645b20c6c7b56d.rlib" "/usr/lib/rustlib/x86_64-unknown-linux-gnu/lib/libcfg_if-b9e1e523c0c29a77.rlib" "/usr/lib/rustlib/x86_64-unknown-linux-gnu/lib/liblibc-dfbef8c525de0186.rlib" "/usr/lib/rustlib/x86_64-unknown-linux-gnu/lib/liballoc-1ebf406bd4ea5769.rlib" "/usr/lib/rustlib/x86_64-unknown-linux-gnu/lib/librustc_std_workspace_core-5e0675f526ef5c6b.rlib" "/usr/lib/rustlib/x86_64-unknown-linux-gnu/lib/libcore-3375e4f89d420e7a.rlib" "-Wl,--end-group" "/usr/lib/rustlib/x86_64-unknown-linux-gnu/lib/libcompiler_builtins-f74b197469e67088.rlib" "-Wl,-Bdynamic" "-lgcc_s" "-lc" "-lm" "-lrt" "-lpthread" "-lutil" "-ldl" "-lutil"
try.c:   = note: /usr/bin/ld: cannot find -lcpucycles
try.c:           collect2: error: ld returned 1 exit status
try.c:
try.c:
try.c: error: aborting due to previous error
try.c:
try.c: error: could not compile `crypto_verify_8`.
try.c:
try.c: To learn more, run the command again with --verbose.

Number of similar (implementation,compiler) pairs: 1, namely:
ImplementationCompiler
rustclang -march=native -O -fwrapv -Qunused-arguments -fPIC -fPIE -gdwarf-4 -Wall (Debian_Clang_11.0.1)

Compiler output


try.c: error: linking with `cc` failed: exit code: 1
try.c:   |
try.c:   = note: "cc" "-Wl,--as-needed" "-Wl,-z,noexecstack" "-m64" "-Wl,--eh-frame-hdr" "-L" "/usr/lib/rustlib/x86_64-unknown-linux-gnu/lib" ".../supercop-data/cezanne/amd64/try/c/clang_-march=native_-Os_-fwrapv_-Qunused-arguments_-fPIC_-fPIE_-gdwarf-4_-Wall/constbranchindex/crypto_verify/8/rust/work/target/release/deps/try_small-d4fe50a9c9f4e270.try_small.2o9qir8m-cgu.0.rcgu.o" ".../supercop-data/cezanne/amd64/try/c/clang_-march=native_-Os_-fwrapv_-Qunused-arguments_-fPIC_-fPIE_-gdwarf-4_-Wall/constbranchindex/crypto_verify/8/rust/work/target/release/deps/try_small-d4fe50a9c9f4e270.try_small.2o9qir8m-cgu.1.rcgu.o" ".../supercop-data/cezanne/amd64/try/c/clang_-march=native_-Os_-fwrapv_-Qunused-arguments_-fPIC_-fPIE_-gdwarf-4_-Wall/constbranchindex/crypto_verify/8/rust/work/target/release/deps/try_small-d4fe50a9c9f4e270.try_small.2o9qir8m-cgu.2.rcgu.o" ".../supercop-data/cezanne/amd64/try/c/clang_-march=native_-Os_-fwrapv_-Qunused-arguments_-fPIC_-fPIE_-gdwarf-4_-Wall/constbranchindex/crypto_verify/8/rust/work/target/release/deps/try_small-d4fe50a9c9f4e270.try_small.2o9qir8m-cgu.3.rcgu.o" ".../supercop-data/cezanne/amd64/try/c/clang_-march=native_-Os_-fwrapv_-Qunused-arguments_-fPIC_-fPIE_-gdwarf-4_-Wall/constbranchindex/crypto_verify/8/rust/work/target/release/deps/try_small-d4fe50a9c9f4e270.try_small.2o9qir8m-cgu.4.rcgu.o" "-o" ".../supercop-data/cezanne/amd64/try/c/clang_-march=native_-Os_-fwrapv_-Qunused-arguments_-fPIC_-fPIE_-gdwarf-4_-Wall/constbranchindex/crypto_verify/8/rust/work/target/release/deps/try_small-d4fe50a9c9f4e270" ".../supercop-data/cezanne/amd64/try/c/clang_-march=native_-Os_-fwrapv_-Qunused-arguments_-fPIC_-fPIE_-gdwarf-4_-Wall/constbranchindex/crypto_verify/8/rust/work/target/release/deps/try_small-d4fe50a9c9f4e270.3fmu5a3xa1q1pamg.rcgu.o" "-Wl,--gc-sections" "-pie" "-Wl,-zrelro" "-Wl,-znow" "-Wl,-O1" "-nodefaultlibs" "-L" ".../supercop-data/cezanne/amd64/try/c/clang_-march=native_-Os_-fwrapv_-Qunused-arguments_-fPIC_-fPIE_-gdwarf-4_-Wall/constbranchindex/crypto_verify/8/rust/work/target/release/deps" "-L" ".../supercop-data/cezanne/amd64/lib" "-L" ".../supercop-data/cezanne/amd64/try/c/clang_-march=native_-Os_-fwrapv_-Qunused-arguments_-fPIC_-fPIE_-gdwarf-4_-Wall/constbranchindex/crypto_verify/8/rust/work/target/release/build/crypto_verify_8-f51523d0b93c052b/out" "-L" "/usr/lib/rustlib/x86_64-unknown-linux-gnu/lib" "-ltry-anything" "-ltry-small" "-lsupercop" "-lkernelrandombytes" "-lcpucycles" "-lcrypto" "-lnsl" "-lm" "-Wl,-Bstatic" ".../supercop-data/cezanne/amd64/try/c/clang_-march=native_-Os_-fwrapv_-Qunused-arguments_-fPIC_-fPIE_-gdwarf-4_-Wall/constbranchindex/crypto_verify/8/rust/work/target/release/deps/libcrypto_verify_8-59884264061485e0.rlib" "-Wl,--start-group" "/usr/lib/rustlib/x86_64-unknown-linux-gnu/lib/libstd-6bf3f16f340782ca.rlib" "/usr/lib/rustlib/x86_64-unknown-linux-gnu/lib/libpanic_unwind-13f3099d50c21bc6.rlib" "/usr/lib/rustlib/x86_64-unknown-linux-gnu/lib/libminiz_oxide-a2ba33c985785afe.rlib" "/usr/lib/rustlib/x86_64-unknown-linux-gnu/lib/libadler-3f6e9f8f4afbea6d.rlib" "/usr/lib/rustlib/x86_64-unknown-linux-gnu/lib/libobject-af517d7f13e7c960.rlib" "/usr/lib/rustlib/x86_64-unknown-linux-gnu/lib/libaddr2line-12740563628e601f.rlib" "/usr/lib/rustlib/x86_64-unknown-linux-gnu/lib/libgimli-0ac82a1e1820dd21.rlib" "/usr/lib/rustlib/x86_64-unknown-linux-gnu/lib/librustc_demangle-3ac2d0878c297d42.rlib" "/usr/lib/rustlib/x86_64-unknown-linux-gnu/lib/libhashbrown-c6632ca171f954dd.rlib" "/usr/lib/rustlib/x86_64-unknown-linux-gnu/lib/librustc_std_workspace_alloc-b5bfd0198c7b740d.rlib" "/usr/lib/rustlib/x86_64-unknown-linux-gnu/lib/libunwind-bd645b20c6c7b56d.rlib" "/usr/lib/rustlib/x86_64-unknown-linux-gnu/lib/libcfg_if-b9e1e523c0c29a77.rlib" "/usr/lib/rustlib/x86_64-unknown-linux-gnu/lib/liblibc-dfbef8c525de0186.rlib" "/usr/lib/rustlib/x86_64-unknown-linux-gnu/lib/liballoc-1ebf406bd4ea5769.rlib" "/usr/lib/rustlib/x86_64-unknown-linux-gnu/lib/librustc_std_workspace_core-5e0675f526ef5c6b.rlib" "/usr/lib/rustlib/x86_64-unknown-linux-gnu/lib/libcore-3375e4f89d420e7a.rlib" "-Wl,--end-group" "/usr/lib/rustlib/x86_64-unknown-linux-gnu/lib/libcompiler_builtins-f74b197469e67088.rlib" "-Wl,-Bdynamic" "-lgcc_s" "-lc" "-lm" "-lrt" "-lpthread" "-lutil" "-ldl" "-lutil"
try.c:   = note: /usr/bin/ld: cannot find -lcpucycles
try.c:           collect2: error: ld returned 1 exit status
try.c:
try.c:
try.c: error: aborting due to previous error
try.c:
try.c: error: could not compile `crypto_verify_8`.
try.c:
try.c: To learn more, run the command again with --verbose.

Number of similar (implementation,compiler) pairs: 1, namely:
ImplementationCompiler
rustclang -march=native -Os -fwrapv -Qunused-arguments -fPIC -fPIE -gdwarf-4 -Wall (Debian_Clang_11.0.1)

Compiler output


try.c: error: linking with `cc` failed: exit code: 1
try.c:   |
try.c:   = note: "cc" "-Wl,--as-needed" "-Wl,-z,noexecstack" "-m64" "-Wl,--eh-frame-hdr" "-L" "/usr/lib/rustlib/x86_64-unknown-linux-gnu/lib" ".../supercop-data/cezanne/amd64/try/c/clang_-mcpu=native_-O3_-fwrapv_-Qunused-arguments_-fPIC_-fPIE_-gdwarf-4_-Wall/constbranchindex/crypto_verify/8/rust/work/target/release/deps/try-f60e84ae7c92bf52.try.18n9a3iw-cgu.0.rcgu.o" ".../supercop-data/cezanne/amd64/try/c/clang_-mcpu=native_-O3_-fwrapv_-Qunused-arguments_-fPIC_-fPIE_-gdwarf-4_-Wall/constbranchindex/crypto_verify/8/rust/work/target/release/deps/try-f60e84ae7c92bf52.try.18n9a3iw-cgu.1.rcgu.o" ".../supercop-data/cezanne/amd64/try/c/clang_-mcpu=native_-O3_-fwrapv_-Qunused-arguments_-fPIC_-fPIE_-gdwarf-4_-Wall/constbranchindex/crypto_verify/8/rust/work/target/release/deps/try-f60e84ae7c92bf52.try.18n9a3iw-cgu.2.rcgu.o" ".../supercop-data/cezanne/amd64/try/c/clang_-mcpu=native_-O3_-fwrapv_-Qunused-arguments_-fPIC_-fPIE_-gdwarf-4_-Wall/constbranchindex/crypto_verify/8/rust/work/target/release/deps/try-f60e84ae7c92bf52.try.18n9a3iw-cgu.3.rcgu.o" ".../supercop-data/cezanne/amd64/try/c/clang_-mcpu=native_-O3_-fwrapv_-Qunused-arguments_-fPIC_-fPIE_-gdwarf-4_-Wall/constbranchindex/crypto_verify/8/rust/work/target/release/deps/try-f60e84ae7c92bf52.try.18n9a3iw-cgu.4.rcgu.o" "-o" ".../supercop-data/cezanne/amd64/try/c/clang_-mcpu=native_-O3_-fwrapv_-Qunused-arguments_-fPIC_-fPIE_-gdwarf-4_-Wall/constbranchindex/crypto_verify/8/rust/work/target/release/deps/try-f60e84ae7c92bf52" ".../supercop-data/cezanne/amd64/try/c/clang_-mcpu=native_-O3_-fwrapv_-Qunused-arguments_-fPIC_-fPIE_-gdwarf-4_-Wall/constbranchindex/crypto_verify/8/rust/work/target/release/deps/try-f60e84ae7c92bf52.2f5z0v4198wj6ai9.rcgu.o" "-Wl,--gc-sections" "-pie" "-Wl,-zrelro" "-Wl,-znow" "-Wl,-O1" "-nodefaultlibs" "-L" ".../supercop-data/cezanne/amd64/try/c/clang_-mcpu=native_-O3_-fwrapv_-Qunused-arguments_-fPIC_-fPIE_-gdwarf-4_-Wall/constbranchindex/crypto_verify/8/rust/work/target/release/deps" "-L" ".../supercop-data/cezanne/amd64/lib" "-L" ".../supercop-data/cezanne/amd64/try/c/clang_-mcpu=native_-O3_-fwrapv_-Qunused-arguments_-fPIC_-fPIE_-gdwarf-4_-Wall/constbranchindex/crypto_verify/8/rust/work/target/release/build/crypto_verify_8-f51523d0b93c052b/out" "-L" "/usr/lib/rustlib/x86_64-unknown-linux-gnu/lib" "-ltry-anything" "-ltry" "-lsupercop" "-lkernelrandombytes" "-lcpucycles" "-lcrypto" "-lnsl" "-lm" "-Wl,-Bstatic" ".../supercop-data/cezanne/amd64/try/c/clang_-mcpu=native_-O3_-fwrapv_-Qunused-arguments_-fPIC_-fPIE_-gdwarf-4_-Wall/constbranchindex/crypto_verify/8/rust/work/target/release/deps/libcrypto_verify_8-59884264061485e0.rlib" "-Wl,--start-group" "/usr/lib/rustlib/x86_64-unknown-linux-gnu/lib/libstd-6bf3f16f340782ca.rlib" "/usr/lib/rustlib/x86_64-unknown-linux-gnu/lib/libpanic_unwind-13f3099d50c21bc6.rlib" "/usr/lib/rustlib/x86_64-unknown-linux-gnu/lib/libminiz_oxide-a2ba33c985785afe.rlib" "/usr/lib/rustlib/x86_64-unknown-linux-gnu/lib/libadler-3f6e9f8f4afbea6d.rlib" "/usr/lib/rustlib/x86_64-unknown-linux-gnu/lib/libobject-af517d7f13e7c960.rlib" "/usr/lib/rustlib/x86_64-unknown-linux-gnu/lib/libaddr2line-12740563628e601f.rlib" "/usr/lib/rustlib/x86_64-unknown-linux-gnu/lib/libgimli-0ac82a1e1820dd21.rlib" "/usr/lib/rustlib/x86_64-unknown-linux-gnu/lib/librustc_demangle-3ac2d0878c297d42.rlib" "/usr/lib/rustlib/x86_64-unknown-linux-gnu/lib/libhashbrown-c6632ca171f954dd.rlib" "/usr/lib/rustlib/x86_64-unknown-linux-gnu/lib/librustc_std_workspace_alloc-b5bfd0198c7b740d.rlib" "/usr/lib/rustlib/x86_64-unknown-linux-gnu/lib/libunwind-bd645b20c6c7b56d.rlib" "/usr/lib/rustlib/x86_64-unknown-linux-gnu/lib/libcfg_if-b9e1e523c0c29a77.rlib" "/usr/lib/rustlib/x86_64-unknown-linux-gnu/lib/liblibc-dfbef8c525de0186.rlib" "/usr/lib/rustlib/x86_64-unknown-linux-gnu/lib/liballoc-1ebf406bd4ea5769.rlib" "/usr/lib/rustlib/x86_64-unknown-linux-gnu/lib/librustc_std_workspace_core-5e0675f526ef5c6b.rlib" "/usr/lib/rustlib/x86_64-unknown-linux-gnu/lib/libcore-3375e4f89d420e7a.rlib" "-Wl,--end-group" "/usr/lib/rustlib/x86_64-unknown-linux-gnu/lib/libcompiler_builtins-f74b197469e67088.rlib" "-Wl,-Bdynamic" "-lgcc_s" "-lc" "-lm" "-lrt" "-lpthread" "-lutil" "-ldl" "-lutil"
try.c:   = note: /usr/bin/ld: cannot find -lcpucycles
try.c:           collect2: error: ld returned 1 exit status
try.c:
try.c:
try.c: error: aborting due to previous error
try.c:
try.c: error: could not compile `crypto_verify_8`.
try.c:
try.c: To learn more, run the command again with --verbose.

Number of similar (implementation,compiler) pairs: 1, namely:
ImplementationCompiler
rustclang -mcpu=native -O3 -fwrapv -Qunused-arguments -fPIC -fPIE -gdwarf-4 -Wall (Debian_Clang_11.0.1)

Compiler output


try.c: error: linking with `cc` failed: exit code: 1
try.c:   |
try.c:   = note: "cc" "-Wl,--as-needed" "-Wl,-z,noexecstack" "-m64" "-Wl,--eh-frame-hdr" "-L" "/usr/lib/rustlib/x86_64-unknown-linux-gnu/lib" ".../supercop-data/cezanne/amd64/try/c/gcc_-march=native_-mtune=native_-O2_-fwrapv_-fPIC_-fPIE_-gdwarf-4_-Wall/constbranchindex/crypto_verify/8/rust/work/target/release/deps/try-f60e84ae7c92bf52.try.18n9a3iw-cgu.0.rcgu.o" ".../supercop-data/cezanne/amd64/try/c/gcc_-march=native_-mtune=native_-O2_-fwrapv_-fPIC_-fPIE_-gdwarf-4_-Wall/constbranchindex/crypto_verify/8/rust/work/target/release/deps/try-f60e84ae7c92bf52.try.18n9a3iw-cgu.1.rcgu.o" ".../supercop-data/cezanne/amd64/try/c/gcc_-march=native_-mtune=native_-O2_-fwrapv_-fPIC_-fPIE_-gdwarf-4_-Wall/constbranchindex/crypto_verify/8/rust/work/target/release/deps/try-f60e84ae7c92bf52.try.18n9a3iw-cgu.2.rcgu.o" ".../supercop-data/cezanne/amd64/try/c/gcc_-march=native_-mtune=native_-O2_-fwrapv_-fPIC_-fPIE_-gdwarf-4_-Wall/constbranchindex/crypto_verify/8/rust/work/target/release/deps/try-f60e84ae7c92bf52.try.18n9a3iw-cgu.3.rcgu.o" ".../supercop-data/cezanne/amd64/try/c/gcc_-march=native_-mtune=native_-O2_-fwrapv_-fPIC_-fPIE_-gdwarf-4_-Wall/constbranchindex/crypto_verify/8/rust/work/target/release/deps/try-f60e84ae7c92bf52.try.18n9a3iw-cgu.4.rcgu.o" "-o" ".../supercop-data/cezanne/amd64/try/c/gcc_-march=native_-mtune=native_-O2_-fwrapv_-fPIC_-fPIE_-gdwarf-4_-Wall/constbranchindex/crypto_verify/8/rust/work/target/release/deps/try-f60e84ae7c92bf52" ".../supercop-data/cezanne/amd64/try/c/gcc_-march=native_-mtune=native_-O2_-fwrapv_-fPIC_-fPIE_-gdwarf-4_-Wall/constbranchindex/crypto_verify/8/rust/work/target/release/deps/try-f60e84ae7c92bf52.2f5z0v4198wj6ai9.rcgu.o" "-Wl,--gc-sections" "-pie" "-Wl,-zrelro" "-Wl,-znow" "-Wl,-O1" "-nodefaultlibs" "-L" ".../supercop-data/cezanne/amd64/try/c/gcc_-march=native_-mtune=native_-O2_-fwrapv_-fPIC_-fPIE_-gdwarf-4_-Wall/constbranchindex/crypto_verify/8/rust/work/target/release/deps" "-L" ".../supercop-data/cezanne/amd64/lib" "-L" ".../supercop-data/cezanne/amd64/try/c/gcc_-march=native_-mtune=native_-O2_-fwrapv_-fPIC_-fPIE_-gdwarf-4_-Wall/constbranchindex/crypto_verify/8/rust/work/target/release/build/crypto_verify_8-f51523d0b93c052b/out" "-L" "/usr/lib/rustlib/x86_64-unknown-linux-gnu/lib" "-ltry-anything" "-ltry" "-lsupercop" "-lkernelrandombytes" "-lcpucycles" "-lcrypto" "-lnsl" "-lm" "-Wl,-Bstatic" ".../supercop-data/cezanne/amd64/try/c/gcc_-march=native_-mtune=native_-O2_-fwrapv_-fPIC_-fPIE_-gdwarf-4_-Wall/constbranchindex/crypto_verify/8/rust/work/target/release/deps/libcrypto_verify_8-59884264061485e0.rlib" "-Wl,--start-group" "/usr/lib/rustlib/x86_64-unknown-linux-gnu/lib/libstd-6bf3f16f340782ca.rlib" "/usr/lib/rustlib/x86_64-unknown-linux-gnu/lib/libpanic_unwind-13f3099d50c21bc6.rlib" "/usr/lib/rustlib/x86_64-unknown-linux-gnu/lib/libminiz_oxide-a2ba33c985785afe.rlib" "/usr/lib/rustlib/x86_64-unknown-linux-gnu/lib/libadler-3f6e9f8f4afbea6d.rlib" "/usr/lib/rustlib/x86_64-unknown-linux-gnu/lib/libobject-af517d7f13e7c960.rlib" "/usr/lib/rustlib/x86_64-unknown-linux-gnu/lib/libaddr2line-12740563628e601f.rlib" "/usr/lib/rustlib/x86_64-unknown-linux-gnu/lib/libgimli-0ac82a1e1820dd21.rlib" "/usr/lib/rustlib/x86_64-unknown-linux-gnu/lib/librustc_demangle-3ac2d0878c297d42.rlib" "/usr/lib/rustlib/x86_64-unknown-linux-gnu/lib/libhashbrown-c6632ca171f954dd.rlib" "/usr/lib/rustlib/x86_64-unknown-linux-gnu/lib/librustc_std_workspace_alloc-b5bfd0198c7b740d.rlib" "/usr/lib/rustlib/x86_64-unknown-linux-gnu/lib/libunwind-bd645b20c6c7b56d.rlib" "/usr/lib/rustlib/x86_64-unknown-linux-gnu/lib/libcfg_if-b9e1e523c0c29a77.rlib" "/usr/lib/rustlib/x86_64-unknown-linux-gnu/lib/liblibc-dfbef8c525de0186.rlib" "/usr/lib/rustlib/x86_64-unknown-linux-gnu/lib/liballoc-1ebf406bd4ea5769.rlib" "/usr/lib/rustlib/x86_64-unknown-linux-gnu/lib/librustc_std_workspace_core-5e0675f526ef5c6b.rlib" "/usr/lib/rustlib/x86_64-unknown-linux-gnu/lib/libcore-3375e4f89d420e7a.rlib" "-Wl,--end-group" "/usr/lib/rustlib/x86_64-unknown-linux-gnu/lib/libcompiler_builtins-f74b197469e67088.rlib" "-Wl,-Bdynamic" "-lgcc_s" "-lc" "-lm" "-lrt" "-lpthread" "-lutil" "-ldl" "-lutil"
try.c:   = note: /usr/bin/ld: cannot find -lcpucycles
try.c:           collect2: error: ld returned 1 exit status
try.c:
try.c:
try.c: error: aborting due to previous error
try.c:
try.c: error: could not compile `crypto_verify_8`.
try.c:
try.c: To learn more, run the command again with --verbose.

Number of similar (implementation,compiler) pairs: 1, namely:
ImplementationCompiler
rustgcc -march=native -mtune=native -O2 -fwrapv -fPIC -fPIE -gdwarf-4 -Wall (10.2.1_20210110)

Compiler output


try.c: error: linking with `cc` failed: exit code: 1
try.c:   |
try.c:   = note: "cc" "-Wl,--as-needed" "-Wl,-z,noexecstack" "-m64" "-Wl,--eh-frame-hdr" "-L" "/usr/lib/rustlib/x86_64-unknown-linux-gnu/lib" ".../supercop-data/cezanne/amd64/try/c/gcc_-march=native_-mtune=native_-O3_-fwrapv_-fPIC_-fPIE_-gdwarf-4_-Wall/constbranchindex/crypto_verify/8/rust/work/target/release/deps/try_small-d4fe50a9c9f4e270.try_small.2o9qir8m-cgu.0.rcgu.o" ".../supercop-data/cezanne/amd64/try/c/gcc_-march=native_-mtune=native_-O3_-fwrapv_-fPIC_-fPIE_-gdwarf-4_-Wall/constbranchindex/crypto_verify/8/rust/work/target/release/deps/try_small-d4fe50a9c9f4e270.try_small.2o9qir8m-cgu.1.rcgu.o" ".../supercop-data/cezanne/amd64/try/c/gcc_-march=native_-mtune=native_-O3_-fwrapv_-fPIC_-fPIE_-gdwarf-4_-Wall/constbranchindex/crypto_verify/8/rust/work/target/release/deps/try_small-d4fe50a9c9f4e270.try_small.2o9qir8m-cgu.2.rcgu.o" ".../supercop-data/cezanne/amd64/try/c/gcc_-march=native_-mtune=native_-O3_-fwrapv_-fPIC_-fPIE_-gdwarf-4_-Wall/constbranchindex/crypto_verify/8/rust/work/target/release/deps/try_small-d4fe50a9c9f4e270.try_small.2o9qir8m-cgu.3.rcgu.o" ".../supercop-data/cezanne/amd64/try/c/gcc_-march=native_-mtune=native_-O3_-fwrapv_-fPIC_-fPIE_-gdwarf-4_-Wall/constbranchindex/crypto_verify/8/rust/work/target/release/deps/try_small-d4fe50a9c9f4e270.try_small.2o9qir8m-cgu.4.rcgu.o" "-o" ".../supercop-data/cezanne/amd64/try/c/gcc_-march=native_-mtune=native_-O3_-fwrapv_-fPIC_-fPIE_-gdwarf-4_-Wall/constbranchindex/crypto_verify/8/rust/work/target/release/deps/try_small-d4fe50a9c9f4e270" ".../supercop-data/cezanne/amd64/try/c/gcc_-march=native_-mtune=native_-O3_-fwrapv_-fPIC_-fPIE_-gdwarf-4_-Wall/constbranchindex/crypto_verify/8/rust/work/target/release/deps/try_small-d4fe50a9c9f4e270.3fmu5a3xa1q1pamg.rcgu.o" "-Wl,--gc-sections" "-pie" "-Wl,-zrelro" "-Wl,-znow" "-Wl,-O1" "-nodefaultlibs" "-L" ".../supercop-data/cezanne/amd64/try/c/gcc_-march=native_-mtune=native_-O3_-fwrapv_-fPIC_-fPIE_-gdwarf-4_-Wall/constbranchindex/crypto_verify/8/rust/work/target/release/deps" "-L" ".../supercop-data/cezanne/amd64/lib" "-L" ".../supercop-data/cezanne/amd64/try/c/gcc_-march=native_-mtune=native_-O3_-fwrapv_-fPIC_-fPIE_-gdwarf-4_-Wall/constbranchindex/crypto_verify/8/rust/work/target/release/build/crypto_verify_8-f51523d0b93c052b/out" "-L" "/usr/lib/rustlib/x86_64-unknown-linux-gnu/lib" "-ltry-anything" "-ltry-small" "-lsupercop" "-lkernelrandombytes" "-lcpucycles" "-lcrypto" "-lnsl" "-lm" "-Wl,-Bstatic" ".../supercop-data/cezanne/amd64/try/c/gcc_-march=native_-mtune=native_-O3_-fwrapv_-fPIC_-fPIE_-gdwarf-4_-Wall/constbranchindex/crypto_verify/8/rust/work/target/release/deps/libcrypto_verify_8-59884264061485e0.rlib" "-Wl,--start-group" "/usr/lib/rustlib/x86_64-unknown-linux-gnu/lib/libstd-6bf3f16f340782ca.rlib" "/usr/lib/rustlib/x86_64-unknown-linux-gnu/lib/libpanic_unwind-13f3099d50c21bc6.rlib" "/usr/lib/rustlib/x86_64-unknown-linux-gnu/lib/libminiz_oxide-a2ba33c985785afe.rlib" "/usr/lib/rustlib/x86_64-unknown-linux-gnu/lib/libadler-3f6e9f8f4afbea6d.rlib" "/usr/lib/rustlib/x86_64-unknown-linux-gnu/lib/libobject-af517d7f13e7c960.rlib" "/usr/lib/rustlib/x86_64-unknown-linux-gnu/lib/libaddr2line-12740563628e601f.rlib" "/usr/lib/rustlib/x86_64-unknown-linux-gnu/lib/libgimli-0ac82a1e1820dd21.rlib" "/usr/lib/rustlib/x86_64-unknown-linux-gnu/lib/librustc_demangle-3ac2d0878c297d42.rlib" "/usr/lib/rustlib/x86_64-unknown-linux-gnu/lib/libhashbrown-c6632ca171f954dd.rlib" "/usr/lib/rustlib/x86_64-unknown-linux-gnu/lib/librustc_std_workspace_alloc-b5bfd0198c7b740d.rlib" "/usr/lib/rustlib/x86_64-unknown-linux-gnu/lib/libunwind-bd645b20c6c7b56d.rlib" "/usr/lib/rustlib/x86_64-unknown-linux-gnu/lib/libcfg_if-b9e1e523c0c29a77.rlib" "/usr/lib/rustlib/x86_64-unknown-linux-gnu/lib/liblibc-dfbef8c525de0186.rlib" "/usr/lib/rustlib/x86_64-unknown-linux-gnu/lib/liballoc-1ebf406bd4ea5769.rlib" "/usr/lib/rustlib/x86_64-unknown-linux-gnu/lib/librustc_std_workspace_core-5e0675f526ef5c6b.rlib" "/usr/lib/rustlib/x86_64-unknown-linux-gnu/lib/libcore-3375e4f89d420e7a.rlib" "-Wl,--end-group" "/usr/lib/rustlib/x86_64-unknown-linux-gnu/lib/libcompiler_builtins-f74b197469e67088.rlib" "-Wl,-Bdynamic" "-lgcc_s" "-lc" "-lm" "-lrt" "-lpthread" "-lutil" "-ldl" "-lutil"
try.c:   = note: /usr/bin/ld: cannot find -lcpucycles
try.c:           collect2: error: ld returned 1 exit status
try.c:
try.c:
try.c: error: aborting due to previous error
try.c:
try.c: error: could not compile `crypto_verify_8`.
try.c:
try.c: To learn more, run the command again with --verbose.

Number of similar (implementation,compiler) pairs: 1, namely:
ImplementationCompiler
rustgcc -march=native -mtune=native -O3 -fwrapv -fPIC -fPIE -gdwarf-4 -Wall (10.2.1_20210110)

Compiler output


try.c: error: linking with `cc` failed: exit code: 1
try.c:   |
try.c:   = note: "cc" "-Wl,--as-needed" "-Wl,-z,noexecstack" "-m64" "-Wl,--eh-frame-hdr" "-L" "/usr/lib/rustlib/x86_64-unknown-linux-gnu/lib" ".../supercop-data/cezanne/amd64/try/c/gcc_-march=native_-mtune=native_-O_-fwrapv_-fPIC_-fPIE_-gdwarf-4_-Wall/constbranchindex/crypto_verify/8/rust/work/target/release/deps/try-f60e84ae7c92bf52.try.18n9a3iw-cgu.0.rcgu.o" ".../supercop-data/cezanne/amd64/try/c/gcc_-march=native_-mtune=native_-O_-fwrapv_-fPIC_-fPIE_-gdwarf-4_-Wall/constbranchindex/crypto_verify/8/rust/work/target/release/deps/try-f60e84ae7c92bf52.try.18n9a3iw-cgu.1.rcgu.o" ".../supercop-data/cezanne/amd64/try/c/gcc_-march=native_-mtune=native_-O_-fwrapv_-fPIC_-fPIE_-gdwarf-4_-Wall/constbranchindex/crypto_verify/8/rust/work/target/release/deps/try-f60e84ae7c92bf52.try.18n9a3iw-cgu.2.rcgu.o" ".../supercop-data/cezanne/amd64/try/c/gcc_-march=native_-mtune=native_-O_-fwrapv_-fPIC_-fPIE_-gdwarf-4_-Wall/constbranchindex/crypto_verify/8/rust/work/target/release/deps/try-f60e84ae7c92bf52.try.18n9a3iw-cgu.3.rcgu.o" ".../supercop-data/cezanne/amd64/try/c/gcc_-march=native_-mtune=native_-O_-fwrapv_-fPIC_-fPIE_-gdwarf-4_-Wall/constbranchindex/crypto_verify/8/rust/work/target/release/deps/try-f60e84ae7c92bf52.try.18n9a3iw-cgu.4.rcgu.o" "-o" ".../supercop-data/cezanne/amd64/try/c/gcc_-march=native_-mtune=native_-O_-fwrapv_-fPIC_-fPIE_-gdwarf-4_-Wall/constbranchindex/crypto_verify/8/rust/work/target/release/deps/try-f60e84ae7c92bf52" ".../supercop-data/cezanne/amd64/try/c/gcc_-march=native_-mtune=native_-O_-fwrapv_-fPIC_-fPIE_-gdwarf-4_-Wall/constbranchindex/crypto_verify/8/rust/work/target/release/deps/try-f60e84ae7c92bf52.2f5z0v4198wj6ai9.rcgu.o" "-Wl,--gc-sections" "-pie" "-Wl,-zrelro" "-Wl,-znow" "-Wl,-O1" "-nodefaultlibs" "-L" ".../supercop-data/cezanne/amd64/try/c/gcc_-march=native_-mtune=native_-O_-fwrapv_-fPIC_-fPIE_-gdwarf-4_-Wall/constbranchindex/crypto_verify/8/rust/work/target/release/deps" "-L" ".../supercop-data/cezanne/amd64/lib" "-L" ".../supercop-data/cezanne/amd64/try/c/gcc_-march=native_-mtune=native_-O_-fwrapv_-fPIC_-fPIE_-gdwarf-4_-Wall/constbranchindex/crypto_verify/8/rust/work/target/release/build/crypto_verify_8-f51523d0b93c052b/out" "-L" "/usr/lib/rustlib/x86_64-unknown-linux-gnu/lib" "-ltry-anything" "-ltry" "-lsupercop" "-lkernelrandombytes" "-lcpucycles" "-lcrypto" "-lnsl" "-lm" "-Wl,-Bstatic" ".../supercop-data/cezanne/amd64/try/c/gcc_-march=native_-mtune=native_-O_-fwrapv_-fPIC_-fPIE_-gdwarf-4_-Wall/constbranchindex/crypto_verify/8/rust/work/target/release/deps/libcrypto_verify_8-59884264061485e0.rlib" "-Wl,--start-group" "/usr/lib/rustlib/x86_64-unknown-linux-gnu/lib/libstd-6bf3f16f340782ca.rlib" "/usr/lib/rustlib/x86_64-unknown-linux-gnu/lib/libpanic_unwind-13f3099d50c21bc6.rlib" "/usr/lib/rustlib/x86_64-unknown-linux-gnu/lib/libminiz_oxide-a2ba33c985785afe.rlib" "/usr/lib/rustlib/x86_64-unknown-linux-gnu/lib/libadler-3f6e9f8f4afbea6d.rlib" "/usr/lib/rustlib/x86_64-unknown-linux-gnu/lib/libobject-af517d7f13e7c960.rlib" "/usr/lib/rustlib/x86_64-unknown-linux-gnu/lib/libaddr2line-12740563628e601f.rlib" "/usr/lib/rustlib/x86_64-unknown-linux-gnu/lib/libgimli-0ac82a1e1820dd21.rlib" "/usr/lib/rustlib/x86_64-unknown-linux-gnu/lib/librustc_demangle-3ac2d0878c297d42.rlib" "/usr/lib/rustlib/x86_64-unknown-linux-gnu/lib/libhashbrown-c6632ca171f954dd.rlib" "/usr/lib/rustlib/x86_64-unknown-linux-gnu/lib/librustc_std_workspace_alloc-b5bfd0198c7b740d.rlib" "/usr/lib/rustlib/x86_64-unknown-linux-gnu/lib/libunwind-bd645b20c6c7b56d.rlib" "/usr/lib/rustlib/x86_64-unknown-linux-gnu/lib/libcfg_if-b9e1e523c0c29a77.rlib" "/usr/lib/rustlib/x86_64-unknown-linux-gnu/lib/liblibc-dfbef8c525de0186.rlib" "/usr/lib/rustlib/x86_64-unknown-linux-gnu/lib/liballoc-1ebf406bd4ea5769.rlib" "/usr/lib/rustlib/x86_64-unknown-linux-gnu/lib/librustc_std_workspace_core-5e0675f526ef5c6b.rlib" "/usr/lib/rustlib/x86_64-unknown-linux-gnu/lib/libcore-3375e4f89d420e7a.rlib" "-Wl,--end-group" "/usr/lib/rustlib/x86_64-unknown-linux-gnu/lib/libcompiler_builtins-f74b197469e67088.rlib" "-Wl,-Bdynamic" "-lgcc_s" "-lc" "-lm" "-lrt" "-lpthread" "-lutil" "-ldl" "-lutil"
try.c:   = note: /usr/bin/ld: cannot find -lcpucycles
try.c:           collect2: error: ld returned 1 exit status
try.c:
try.c:
try.c: error: aborting due to previous error
try.c:
try.c: error: could not compile `crypto_verify_8`.
try.c:
try.c: To learn more, run the command again with --verbose.

Number of similar (implementation,compiler) pairs: 1, namely:
ImplementationCompiler
rustgcc -march=native -mtune=native -O -fwrapv -fPIC -fPIE -gdwarf-4 -Wall (10.2.1_20210110)

Compiler output


try.c: error: linking with `cc` failed: exit code: 1
try.c:   |
try.c:   = note: "cc" "-Wl,--as-needed" "-Wl,-z,noexecstack" "-m64" "-Wl,--eh-frame-hdr" "-L" "/usr/lib/rustlib/x86_64-unknown-linux-gnu/lib" ".../supercop-data/cezanne/amd64/try/c/gcc_-march=native_-mtune=native_-Os_-fwrapv_-fPIC_-fPIE_-gdwarf-4_-Wall/constbranchindex/crypto_verify/8/rust/work/target/release/deps/try-f60e84ae7c92bf52.try.18n9a3iw-cgu.0.rcgu.o" ".../supercop-data/cezanne/amd64/try/c/gcc_-march=native_-mtune=native_-Os_-fwrapv_-fPIC_-fPIE_-gdwarf-4_-Wall/constbranchindex/crypto_verify/8/rust/work/target/release/deps/try-f60e84ae7c92bf52.try.18n9a3iw-cgu.1.rcgu.o" ".../supercop-data/cezanne/amd64/try/c/gcc_-march=native_-mtune=native_-Os_-fwrapv_-fPIC_-fPIE_-gdwarf-4_-Wall/constbranchindex/crypto_verify/8/rust/work/target/release/deps/try-f60e84ae7c92bf52.try.18n9a3iw-cgu.2.rcgu.o" ".../supercop-data/cezanne/amd64/try/c/gcc_-march=native_-mtune=native_-Os_-fwrapv_-fPIC_-fPIE_-gdwarf-4_-Wall/constbranchindex/crypto_verify/8/rust/work/target/release/deps/try-f60e84ae7c92bf52.try.18n9a3iw-cgu.3.rcgu.o" ".../supercop-data/cezanne/amd64/try/c/gcc_-march=native_-mtune=native_-Os_-fwrapv_-fPIC_-fPIE_-gdwarf-4_-Wall/constbranchindex/crypto_verify/8/rust/work/target/release/deps/try-f60e84ae7c92bf52.try.18n9a3iw-cgu.4.rcgu.o" "-o" ".../supercop-data/cezanne/amd64/try/c/gcc_-march=native_-mtune=native_-Os_-fwrapv_-fPIC_-fPIE_-gdwarf-4_-Wall/constbranchindex/crypto_verify/8/rust/work/target/release/deps/try-f60e84ae7c92bf52" ".../supercop-data/cezanne/amd64/try/c/gcc_-march=native_-mtune=native_-Os_-fwrapv_-fPIC_-fPIE_-gdwarf-4_-Wall/constbranchindex/crypto_verify/8/rust/work/target/release/deps/try-f60e84ae7c92bf52.2f5z0v4198wj6ai9.rcgu.o" "-Wl,--gc-sections" "-pie" "-Wl,-zrelro" "-Wl,-znow" "-Wl,-O1" "-nodefaultlibs" "-L" ".../supercop-data/cezanne/amd64/try/c/gcc_-march=native_-mtune=native_-Os_-fwrapv_-fPIC_-fPIE_-gdwarf-4_-Wall/constbranchindex/crypto_verify/8/rust/work/target/release/deps" "-L" ".../supercop-data/cezanne/amd64/lib" "-L" ".../supercop-data/cezanne/amd64/try/c/gcc_-march=native_-mtune=native_-Os_-fwrapv_-fPIC_-fPIE_-gdwarf-4_-Wall/constbranchindex/crypto_verify/8/rust/work/target/release/build/crypto_verify_8-f51523d0b93c052b/out" "-L" "/usr/lib/rustlib/x86_64-unknown-linux-gnu/lib" "-ltry-anything" "-ltry" "-lsupercop" "-lkernelrandombytes" "-lcpucycles" "-lcrypto" "-lnsl" "-lm" "-Wl,-Bstatic" ".../supercop-data/cezanne/amd64/try/c/gcc_-march=native_-mtune=native_-Os_-fwrapv_-fPIC_-fPIE_-gdwarf-4_-Wall/constbranchindex/crypto_verify/8/rust/work/target/release/deps/libcrypto_verify_8-59884264061485e0.rlib" "-Wl,--start-group" "/usr/lib/rustlib/x86_64-unknown-linux-gnu/lib/libstd-6bf3f16f340782ca.rlib" "/usr/lib/rustlib/x86_64-unknown-linux-gnu/lib/libpanic_unwind-13f3099d50c21bc6.rlib" "/usr/lib/rustlib/x86_64-unknown-linux-gnu/lib/libminiz_oxide-a2ba33c985785afe.rlib" "/usr/lib/rustlib/x86_64-unknown-linux-gnu/lib/libadler-3f6e9f8f4afbea6d.rlib" "/usr/lib/rustlib/x86_64-unknown-linux-gnu/lib/libobject-af517d7f13e7c960.rlib" "/usr/lib/rustlib/x86_64-unknown-linux-gnu/lib/libaddr2line-12740563628e601f.rlib" "/usr/lib/rustlib/x86_64-unknown-linux-gnu/lib/libgimli-0ac82a1e1820dd21.rlib" "/usr/lib/rustlib/x86_64-unknown-linux-gnu/lib/librustc_demangle-3ac2d0878c297d42.rlib" "/usr/lib/rustlib/x86_64-unknown-linux-gnu/lib/libhashbrown-c6632ca171f954dd.rlib" "/usr/lib/rustlib/x86_64-unknown-linux-gnu/lib/librustc_std_workspace_alloc-b5bfd0198c7b740d.rlib" "/usr/lib/rustlib/x86_64-unknown-linux-gnu/lib/libunwind-bd645b20c6c7b56d.rlib" "/usr/lib/rustlib/x86_64-unknown-linux-gnu/lib/libcfg_if-b9e1e523c0c29a77.rlib" "/usr/lib/rustlib/x86_64-unknown-linux-gnu/lib/liblibc-dfbef8c525de0186.rlib" "/usr/lib/rustlib/x86_64-unknown-linux-gnu/lib/liballoc-1ebf406bd4ea5769.rlib" "/usr/lib/rustlib/x86_64-unknown-linux-gnu/lib/librustc_std_workspace_core-5e0675f526ef5c6b.rlib" "/usr/lib/rustlib/x86_64-unknown-linux-gnu/lib/libcore-3375e4f89d420e7a.rlib" "-Wl,--end-group" "/usr/lib/rustlib/x86_64-unknown-linux-gnu/lib/libcompiler_builtins-f74b197469e67088.rlib" "-Wl,-Bdynamic" "-lgcc_s" "-lc" "-lm" "-lrt" "-lpthread" "-lutil" "-ldl" "-lutil"
try.c:   = note: /usr/bin/ld: cannot find -lcpucycles
try.c:           collect2: error: ld returned 1 exit status
try.c:
try.c:
try.c: error: aborting due to previous error
try.c:
try.c: error: could not compile `crypto_verify_8`.
try.c:
try.c: To learn more, run the command again with --verbose.

Number of similar (implementation,compiler) pairs: 1, namely:
ImplementationCompiler
rustgcc -march=native -mtune=native -Os -fwrapv -fPIC -fPIE -gdwarf-4 -Wall (10.2.1_20210110)

Passed TIMECOP


TIMECOP iterations: 10

Number of similar (implementation,compiler) pairs: 9, namely:
ImplementationCompiler
refclang -march=native -O2 -fwrapv -Qunused-arguments -fPIC -fPIE -gdwarf-4 -Wall (Debian_Clang_11.0.1)
refclang -march=native -O3 -fwrapv -Qunused-arguments -fPIC -fPIE -gdwarf-4 -Wall (Debian_Clang_11.0.1)
refclang -march=native -O -fwrapv -Qunused-arguments -fPIC -fPIE -gdwarf-4 -Wall (Debian_Clang_11.0.1)
refclang -march=native -Os -fwrapv -Qunused-arguments -fPIC -fPIE -gdwarf-4 -Wall (Debian_Clang_11.0.1)
refclang -mcpu=native -O3 -fwrapv -Qunused-arguments -fPIC -fPIE -gdwarf-4 -Wall (Debian_Clang_11.0.1)
refgcc -march=native -mtune=native -O2 -fwrapv -fPIC -fPIE -gdwarf-4 -Wall (10.2.1_20210110)
refgcc -march=native -mtune=native -O3 -fwrapv -fPIC -fPIE -gdwarf-4 -Wall (10.2.1_20210110)
refgcc -march=native -mtune=native -O -fwrapv -fPIC -fPIE -gdwarf-4 -Wall (10.2.1_20210110)
refgcc -march=native -mtune=native -Os -fwrapv -fPIC -fPIE -gdwarf-4 -Wall (10.2.1_20210110)