Implementation notes: amd64, bolero, crypto_kem/titaniumccasuper

Computer: bolero
Microarchitecture: amd64; Broadwell+AES (406f1)
Architecture: amd64
CPU ID: GenuineIntel-000406f1-1fc9cbf5
SUPERCOP version: 20240425
Operation: crypto_kem
Primitive: titaniumccasuper
TimeObject sizeTest sizeImplementationCompilerBenchmark dateSUPERCOP version
4734476149326 0 36310318 840 1608T:avx2clang_-march=native_-O_-fomit-frame-pointer_-fwrapv_-Qunused-arguments_-fPIC_-fPIE2024042820240425
4787820156545 0 36321214 840 1608T:avx2clang_-march=native_-O2_-fomit-frame-pointer_-fwrapv_-Qunused-arguments_-fPIC_-fPIE2024042820240425
4797656157220 0 36322174 840 1608T:avx2clang_-march=native_-O3_-fomit-frame-pointer_-fwrapv_-Qunused-arguments_-fPIC_-fPIE2024042820240425
4848356145406 0 36307352 832 1704T:avx2clang_-march=native_-Os_-fomit-frame-pointer_-fwrapv_-Qunused-arguments_-fPIC_-fPIE2024042820240425
4947632155733 0 64320004 800 1672T:avx2gcc_-march=native_-mtune=native_-O3_-fomit-frame-pointer_-fwrapv_-fPIC_-fPIE2024042820240425
5192812147561 0 64309908 800 1672T:avx2gcc_-march=native_-mtune=native_-O2_-fomit-frame-pointer_-fwrapv_-fPIC_-fPIE2024042820240425
5422168147218 0 64309132 800 1672T:avx2gcc_-march=native_-mtune=native_-O_-fomit-frame-pointer_-fwrapv_-fPIC_-fPIE2024042820240425
6582068146407 0 36311046 840 1608T:optclang_-march=native_-O3_-fomit-frame-pointer_-fwrapv_-Qunused-arguments_-fPIC_-fPIE2024042820240425
6807244118611 0 36283182 840 1608T:optclang_-march=native_-O2_-fomit-frame-pointer_-fwrapv_-Qunused-arguments_-fPIC_-fPIE2024042820240425
7103196111777 0 64275924 800 1672T:optgcc_-march=native_-mtune=native_-O3_-fomit-frame-pointer_-fwrapv_-fPIC_-fPIE2024042820240425
7167928104557 0 36268070 840 1608T:optclang_-mcpu=native_-O3_-fomit-frame-pointer_-fwrapv_-Qunused-arguments_-fPIC_-fPIE2024042820240425
737856482746 0 36244422 840 1608T:optclang_-march=native_-O_-fomit-frame-pointer_-fwrapv_-Qunused-arguments_-fPIC_-fPIE2024042820240425
741562883669 0 36246008 832 1704T:optclang_-march=native_-Os_-fomit-frame-pointer_-fwrapv_-Qunused-arguments_-fPIC_-fPIE2024042820240425
775632882634 0 64245164 800 1672T:optgcc_-march=native_-mtune=native_-O2_-fomit-frame-pointer_-fwrapv_-fPIC_-fPIE2024042820240425
809577682629 0 64244732 800 1672T:optgcc_-march=native_-mtune=native_-O_-fomit-frame-pointer_-fwrapv_-fPIC_-fPIE2024042820240425
109177706071665 0 36236838 840 1608T:refclang_-march=native_-O2_-fomit-frame-pointer_-fwrapv_-Qunused-arguments_-fPIC_-fPIE2024042820240425
112133438599917 0 36265374 840 1608T:refclang_-march=native_-O3_-fomit-frame-pointer_-fwrapv_-Qunused-arguments_-fPIC_-fPIE2024042820240425
112360888056630 0 36218752 832 1704T:refclang_-march=native_-Os_-fomit-frame-pointer_-fwrapv_-Qunused-arguments_-fPIC_-fPIE2024042820240425
114880177656275 0 64218628 800 1672T:refgcc_-march=native_-mtune=native_-O2_-fomit-frame-pointer_-fwrapv_-fPIC_-fPIE2024042820240425
118078626072873 0 64236980 800 1672T:refgcc_-march=native_-mtune=native_-O3_-fomit-frame-pointer_-fwrapv_-fPIC_-fPIE2024042820240425
119048793675089 0 36239022 840 1608T:refclang_-mcpu=native_-O3_-fomit-frame-pointer_-fwrapv_-Qunused-arguments_-fPIC_-fPIE2024042820240425
123064349655755 0 36217326 840 1608T:refclang_-march=native_-O_-fomit-frame-pointer_-fwrapv_-Qunused-arguments_-fPIC_-fPIE2024042820240425
140242948856346 0 64218292 800 1672T:refgcc_-march=native_-mtune=native_-O_-fomit-frame-pointer_-fwrapv_-fPIC_-fPIE2024042820240425

Compiler output

Implementation: T:avx2
Security model: timingleaks
Compiler: clang -mcpu=native -O3 -fomit-frame-pointer -fwrapv -Qunused-arguments -fPIC -fPIE
encrypt.c: encrypt.c:63:8: error: always_inline function '_mm256_loadu_si256' requires target feature 'avx', but would be inlined into function 'crypto_encrypt_keypair' that is compiled without support for 'avx'
encrypt.c: u = _mm256_loadu_si256((__m256i *)(a[i] + j));
encrypt.c: ^
encrypt.c: encrypt.c:63:8: error: AVX vector return of type '__m256i' (vector of 4 'long long' values) without 'avx' enabled changes the ABI
encrypt.c: encrypt.c:64:8: error: always_inline function '_mm256_loadu_si256' requires target feature 'avx', but would be inlined into function 'crypto_encrypt_keypair' that is compiled without support for 'avx'
encrypt.c: v = _mm256_loadu_si256((__m256i *)(s + j));
encrypt.c: ^
encrypt.c: encrypt.c:64:8: error: AVX vector return of type '__m256i' (vector of 4 'long long' values) without 'avx' enabled changes the ABI
encrypt.c: encrypt.c:65:8: error: always_inline function '_mm256_mul_epu32' requires target feature 'avx2', but would be inlined into function 'crypto_encrypt_keypair' that is compiled without support for 'avx2'
encrypt.c: t = _mm256_mul_epu32(u, v);
encrypt.c: ^
encrypt.c: encrypt.c:65:8: error: AVX vector argument of type '__m256i' (vector of 4 'long long' values) without 'avx' enabled changes the ABI
encrypt.c: encrypt.c:66:4: error: always_inline function '_mm256_storeu_si256' requires target feature 'avx', but would be inlined into function 'crypto_encrypt_keypair' that is compiled without support for 'avx'
encrypt.c: _mm256_storeu_si256((__m256i *)(a[i] + j), t);
encrypt.c: ^
encrypt.c: encrypt.c:66:4: error: AVX vector argument of type '__m256i' (vector of 4 'long long' values) without 'avx' enabled changes the ABI
encrypt.c: encrypt.c:78:8: error: always_inline function '_mm256_loadu_si256' requires target feature 'avx', but would be inlined into function 'crypto_encrypt_keypair' that is compiled without support for 'avx'
encrypt.c: u = _mm256_loadu_si256((__m256i *)(a[i] + j));
encrypt.c: ^
encrypt.c: encrypt.c:78:8: error: AVX vector return of type '__m256i' (vector of 4 'long long' values) without 'avx' enabled changes the ABI
encrypt.c: encrypt.c:79:8: error: always_inline function '_mm256_loadu_si256' requires target feature 'avx', but would be inlined into function 'crypto_encrypt_keypair' that is compiled without support for 'avx'
encrypt.c: v = _mm256_loadu_si256((__m256i *)(e[i] + j));
encrypt.c: ^
encrypt.c: encrypt.c:79:8: error: AVX vector return of type '__m256i' (vector of 4 'long long' values) without 'avx' enabled changes the ABI
encrypt.c: encrypt.c:80:8: error: always_inline function '_mm256_add_epi64' requires target feature 'avx2', but would be inlined into function 'crypto_encrypt_keypair' that is compiled without support for 'avx2'
encrypt.c: ...

Number of similar (compiler,implementation) pairs: 1, namely:
CompilerImplementations
clang -mcpu=native -O3 -fomit-frame-pointer -fwrapv -Qunused-arguments -fPIC -fPIE T:avx2

Compiler output

Implementation: T:avx2
Security model: timingleaks
Compiler: gcc -march=native -mtune=native -Os -fomit-frame-pointer -fwrapv -fPIC -fPIE
try.c: /usr/bin/ld: libcrypto_kem_titaniumccasuper.a(sampler.o): in function `sampler_zq':
try.c: sampler.c:(.text+0x...): undefined reference to `load_24'
try.c: /usr/bin/ld: sampler.c:(.text+0x...): undefined reference to `barrett_zq'
try.c: collect2: error: ld returned 1 exit status

Number of similar (compiler,implementation) pairs: 1, namely:
CompilerImplementations
gcc -march=native -mtune=native -Os -fomit-frame-pointer -fwrapv -fPIC -fPIE T:avx2

Compiler output

Implementation: T:opt
Security model: timingleaks
Compiler: gcc -march=native -mtune=native -Os -fomit-frame-pointer -fwrapv -fPIC -fPIE
try.c: /usr/bin/ld: libcrypto_kem_titaniumccasuper.a(encrypt.o): in function `crypto_encrypt_keypair':
try.c: encrypt.c:(.text+0x...): undefined reference to `barrett_4q'
try.c: /usr/bin/ld: libcrypto_kem_titaniumccasuper.a(fastrandombytes.o): in function `fastrandombytes':
try.c: fastrandombytes.c:(.text+0x...): undefined reference to `load_32'
try.c: /usr/bin/ld: fastrandombytes.c:(.text+0x...): undefined reference to `store_32'
try.c: /usr/bin/ld: libcrypto_kem_titaniumccasuper.a(ntt.o): in function `ntt_2':
try.c: ntt.c:(.text+0x...): undefined reference to `barrett_4q'
try.c: /usr/bin/ld: ntt.c:(.text+0x...): undefined reference to `barrett_4q'
try.c: /usr/bin/ld: ntt.c:(.text+0x...): undefined reference to `barrett_4q'
try.c: /usr/bin/ld: ntt.c:(.text+0x...): undefined reference to `montgomery'
try.c: /usr/bin/ld: ntt.c:(.text+0x...): undefined reference to `barrett_4q'
try.c: /usr/bin/ld: ntt.c:(.text+0x...): undefined reference to `barrett_4q'
try.c: /usr/bin/ld: ntt.c:(.text+0x...): undefined reference to `barrett_4q'
try.c: /usr/bin/ld: ntt.c:(.text+0x...): undefined reference to `montgomery'
try.c: /usr/bin/ld: ntt.c:(.text+0x...): undefined reference to `barrett_4q'
try.c: /usr/bin/ld: ntt.c:(.text+0x...): undefined reference to `barrett_4q'
try.c: /usr/bin/ld: libcrypto_kem_titaniumccasuper.a(ntt.o): in function `ntt_core':
try.c: ntt.c:(.text+0x...): undefined reference to `montgomery'
try.c: /usr/bin/ld: libcrypto_kem_titaniumccasuper.a(ntt.o): in function `intt_core':
try.c: ntt.c:(.text+0x...): undefined reference to `montgomery'
try.c: /usr/bin/ld: ntt.c:(.text+0x...): undefined reference to `montgomery'
try.c: /usr/bin/ld: libcrypto_kem_titaniumccasuper.a(ntt.o): in function `ntt_butterfly_2048_3328':
try.c: ntt.c:(.text+0x...): undefined reference to `barrett_16q'
try.c: /usr/bin/ld: libcrypto_kem_titaniumccasuper.a(ntt.o): in function `ntt_butterfly_3328_1280':
try.c: ntt.c:(.text+0x...): undefined reference to `barrett_32q'
try.c: ...

Number of similar (compiler,implementation) pairs: 1, namely:
CompilerImplementations
gcc -march=native -mtune=native -Os -fomit-frame-pointer -fwrapv -fPIC -fPIE T:opt

Compiler output

Implementation: T:ref
Security model: timingleaks
Compiler: gcc -march=native -mtune=native -Os -fomit-frame-pointer -fwrapv -fPIC -fPIE
try.c: /usr/bin/ld: libcrypto_kem_titaniumccasuper.a(fastrandombytes.o): in function `fastrandombytes':
try.c: fastrandombytes.c:(.text+0x...): undefined reference to `load_32'
try.c: /usr/bin/ld: fastrandombytes.c:(.text+0x...): undefined reference to `store_32'
try.c: /usr/bin/ld: libcrypto_kem_titaniumccasuper.a(sampler.o): in function `sampler_zq':
try.c: sampler.c:(.text+0x...): undefined reference to `load_24'
try.c: collect2: error: ld returned 1 exit status

Number of similar (compiler,implementation) pairs: 1, namely:
CompilerImplementations
gcc -march=native -mtune=native -Os -fomit-frame-pointer -fwrapv -fPIC -fPIE T:ref