Implementation notes: amd64, bolero, crypto_core/scale3sntrup761

Computer: bolero
Microarchitecture: amd64; Broadwell+AES (406f1)
Architecture: amd64
CPU ID: GenuineIntel-000406f1-1fc9cbf5
SUPERCOP version: 20240425
Operation: crypto_core
Primitive: scale3sntrup761
TimeObject sizeTest sizeImplementationCompilerBenchmark dateSUPERCOP version
252318 0 012582 776 832avxgcc_-march=native_-mtune=native_-O2_-fomit-frame-pointer_-fwrapv_-fPIC_-fPIE2024042620240425
252318 0 014598 776 832avxgcc_-march=native_-mtune=native_-O3_-fomit-frame-pointer_-fwrapv_-fPIC_-fPIE2024042620240425
268310 0 012285 768 832avxgcc_-march=native_-mtune=native_-O_-fomit-frame-pointer_-fwrapv_-fPIC_-fPIE2024042620240425
272333 0 015132 816 776avxclang_-march=native_-O2_-fomit-frame-pointer_-fwrapv_-Qunused-arguments_-fPIC_-fPIE2024042620240425
272333 0 015444 816 776avxclang_-march=native_-O3_-fomit-frame-pointer_-fwrapv_-Qunused-arguments_-fPIC_-fPIE2024042620240425
276308 0 011113 752 800avxgcc_-march=native_-mtune=native_-Os_-fomit-frame-pointer_-fwrapv_-fPIC_-fPIE2024042620240425
288200 0 012006 808 856avxclang_-march=native_-Os_-fomit-frame-pointer_-fwrapv_-Qunused-arguments_-fPIC_-fPIE2024042620240425
292327 0 011380 816 760avxclang_-march=native_-O_-fomit-frame-pointer_-fwrapv_-Qunused-arguments_-fPIC_-fPIE2024042620240425
3481000 0 015900 816 776refclang_-march=native_-O2_-fomit-frame-pointer_-fwrapv_-Qunused-arguments_-fPIC_-fPIE2024042620240425
352530 0 014510 776 832refgcc_-march=native_-mtune=native_-O3_-fomit-frame-pointer_-fwrapv_-fPIC_-fPIE2024042620240425
4561000 0 016212 816 776refclang_-march=native_-O3_-fomit-frame-pointer_-fwrapv_-Qunused-arguments_-fPIC_-fPIE2024042620240425
2840269 0 012198 776 832refgcc_-march=native_-mtune=native_-O2_-fomit-frame-pointer_-fwrapv_-fPIC_-fPIE2024042620240425
2924263 0 011901 768 832refgcc_-march=native_-mtune=native_-O_-fomit-frame-pointer_-fwrapv_-fPIC_-fPIE2024042620240425
4192175 0 012078 808 856refclang_-march=native_-Os_-fomit-frame-pointer_-fwrapv_-Qunused-arguments_-fPIC_-fPIE2024042620240425
4196189 0 011316 816 760refclang_-march=native_-O_-fomit-frame-pointer_-fwrapv_-Qunused-arguments_-fPIC_-fPIE2024042620240425
5888264 0 010877 760 800refgcc_-march=native_-mtune=native_-Os_-fomit-frame-pointer_-fwrapv_-fPIC_-fPIE2024042620240425

Compiler output

Implementation: avx
Security model: constbranchindex
Compiler: clang -mcpu=native -O3 -fomit-frame-pointer -fwrapv -Qunused-arguments -fPIC -fPIE
core.c: core.c:20:18: error: always_inline function '_mm256_loadu_si256' requires target feature 'avx', but would be inlined into function 'crypto_core_scale3sntrup761_avx_constbranchindex' that is compiled without support for 'avx'
core.c: __m256i save = _mm256_loadu_si256((__m256i *) (inbytes+2*i));
core.c: ^
core.c: core.c:20:18: error: AVX vector return of type '__m256i' (vector of 4 'long long' values) without 'avx' enabled changes the ABI
core.c: core.c:25:19: error: always_inline function '_mm256_loadu_si256' requires target feature 'avx', but would be inlined into function 'crypto_core_scale3sntrup761_avx_constbranchindex' that is compiled without support for 'avx'
core.c: __m256i x = _mm256_loadu_si256((__m256i *) inbytes);
core.c: ^
core.c: core.c:25:19: error: AVX vector return of type '__m256i' (vector of 4 'long long' values) without 'avx' enabled changes the ABI
core.c: core.c:27:32: error: always_inline function '_mm256_set1_epi16' requires target feature 'avx', but would be inlined into function 'crypto_core_scale3sntrup761_avx_constbranchindex' that is compiled without support for 'avx'
core.c: x = _mm256_mullo_epi16(x,_mm256_set1_epi16(3));
core.c: ^
core.c: core.c:27:32: error: AVX vector return of type '__m256i' (vector of 4 'long long' values) without 'avx' enabled changes the ABI
core.c: core.c:27:11: error: always_inline function '_mm256_mullo_epi16' requires target feature 'avx2', but would be inlined into function 'crypto_core_scale3sntrup761_avx_constbranchindex' that is compiled without support for 'avx2'
core.c: x = _mm256_mullo_epi16(x,_mm256_set1_epi16(3));
core.c: ^
core.c: core.c:27:11: error: AVX vector argument of type '__m256i' (vector of 4 'long long' values) without 'avx' enabled changes the ABI
core.c: core.c:28:30: error: always_inline function '_mm256_set1_epi16' requires target feature 'avx', but would be inlined into function 'crypto_core_scale3sntrup761_avx_constbranchindex' that is compiled without support for 'avx'
core.c: x = _mm256_sub_epi16(x,_mm256_set1_epi16((q+1)/2));
core.c: ^
core.c: core.c:28:30: error: AVX vector return of type '__m256i' (vector of 4 'long long' values) without 'avx' enabled changes the ABI
core.c: core.c:28:11: error: always_inline function '_mm256_sub_epi16' requires target feature 'avx2', but would be inlined into function 'crypto_core_scale3sntrup761_avx_constbranchindex' that is compiled without support for 'avx2'
core.c: x = _mm256_sub_epi16(x,_mm256_set1_epi16((q+1)/2));
core.c: ^
core.c: core.c:28:11: error: AVX vector argument of type '__m256i' (vector of 4 'long long' values) without 'avx' enabled changes the ABI
core.c: core.c:29:14: error: always_inline function '_mm256_srai_epi16' requires target feature 'avx2', but would be inlined into function 'crypto_core_scale3sntrup761_avx_constbranchindex' that is compiled without support for 'avx2'
core.c: ...

Number of similar (compiler,implementation) pairs: 1, namely:
CompilerImplementations
clang -mcpu=native -O3 -fomit-frame-pointer -fwrapv -Qunused-arguments -fPIC -fPIE avx

Compiler output

Implementation: ref
Security model: constbranchindex
Compiler: clang -mcpu=native -O3 -fomit-frame-pointer -fwrapv -Qunused-arguments -fPIC -fPIE
try.c: /usr/bin/ld: error in /home/supercop/benchmarking/supercop-20240425/supercop-data/bolero/amd64/lib/libsupercop.a(crypto_decode_761xint16_little_constbranchindex-decode.o)(.eh_frame); no .eh_frame_hdr table will be created
try.c: /usr/bin/ld: error in /home/supercop/benchmarking/supercop-20240425/supercop-data/bolero/amd64/lib/libsupercop.a(crypto_encode_761xint16_little_constbranchindex-encode.o)(.eh_frame); no .eh_frame_hdr table will be created
try.c: /usr/bin/ld: /home/supercop/benchmarking/supercop-20240425/supercop-data/bolero/amd64/lib/libsupercop.a(crypto_decode_761xint16_little_constbranchindex-decode.o): invalid string offset 3586507005 >= 146 for section `.strtab'
try.c: /usr/bin/ld: /home/supercop/benchmarking/supercop-20240425/supercop-data/bolero/amd64/lib/libsupercop.a(crypto_decode_761xint16_little_constbranchindex-decode.o): invalid string offset 3586507005 >= 146 for section `.strtab'
try.c: clang: error: linker command failed with exit code 1 (use -v to see invocation)

Number of similar (compiler,implementation) pairs: 1, namely:
CompilerImplementations
clang -mcpu=native -O3 -fomit-frame-pointer -fwrapv -Qunused-arguments -fPIC -fPIE ref