Implementation notes: amd64, bolero, crypto_aead/omdsha256k256n248tau256v1

Computer: bolero
Microarchitecture: amd64; Broadwell+AES (406f1)
Architecture: amd64
CPU ID: GenuineIntel-000406f1-1fc9cbf5
SUPERCOP version: 20240625
Operation: crypto_aead
Primitive: omdsha256k256n248tau256v1
TimeObject sizeTest sizeImplementationCompilerBenchmark dateSUPERCOP version
17734411559 0 034772 816 872T:refclang_-march=native_-O2_-fwrapv_-Qunused-arguments_-fPIC_-fPIE_-gdwarf-4_-Wall2024062620240625
2029724545 0 024814 808 920T:refclang_-march=native_-Os_-fwrapv_-Qunused-arguments_-fPIC_-fPIE_-gdwarf-4_-Wall2024062620240625
2069286070 0 026868 776 928T:refgcc_-march=native_-mtune=native_-O_-fwrapv_-fPIC_-fPIE_-gdwarf-4_-Wall2024062620240625
2070645649 0 025116 816 856T:refclang_-march=native_-O_-fwrapv_-Qunused-arguments_-fPIC_-fPIE_-gdwarf-4_-Wall2024062620240625
2079206541 0 027925 784 928T:refgcc_-march=native_-mtune=native_-O2_-fwrapv_-fPIC_-fPIE_-gdwarf-4_-Wall2024062620240625
21401211906 0 033772 816 856T:refclang_-mcpu=native_-O3_-fwrapv_-Qunused-arguments_-fPIC_-fPIE_-gdwarf-4_-Wall2024062620240625
2172964607 0 023672 760 896T:refgcc_-march=native_-mtune=native_-Os_-fwrapv_-fPIC_-fPIE_-gdwarf-4_-Wall2024062620240625
24265814914 0 038333 784 928T:refgcc_-march=native_-mtune=native_-O3_-fwrapv_-fPIC_-fPIE_-gdwarf-4_-Wall2024062620240625
26381610545 0 034004 816 872T:refclang_-march=native_-O3_-fwrapv_-Qunused-arguments_-fPIC_-fPIE_-gdwarf-4_-Wall2024062620240625

Compiler output


try.c: /usr/bin/ld: libcrypto_aead_omdsha256k256n248tau256v1.a(omdsha256.o):.../supercop-data/bolero/amd64/try/c/clang_-march=native_-O2_-fwrapv_-Qunused-arguments_-fPIC_-fPIE_-gdwarf-4_-Wall/timingleaks/crypto_aead/omdsha256k256n248tau256v1/avx1/work/./omdsha256.h:137: multiple definition of `Hash'; libcrypto_aead_omdsha256k256n248tau256v1.a(encrypt.o):.../supercop-data/bolero/amd64/try/c/clang_-march=native_-O2_-fwrapv_-Qunused-arguments_-fPIC_-fPIE_-gdwarf-4_-Wall/timingleaks/crypto_aead/omdsha256k256n248tau256v1/avx1/work/./omdsha256.h:137: first defined here
try.c: clang: error: linker command failed with exit code 1 (use -v to see invocation)

Number of similar (implementation,compiler) pairs: 1, namely:
ImplementationCompiler
T:avx1clang -march=native -O2 -fwrapv -Qunused-arguments -fPIC -fPIE -gdwarf-4 -Wall (Ubuntu_Clang_14.0.0)

Compiler output


try.c: /usr/bin/ld: libcrypto_aead_omdsha256k256n248tau256v1.a(omdsha256.o):.../supercop-data/bolero/amd64/try/c/clang_-march=native_-O3_-fwrapv_-Qunused-arguments_-fPIC_-fPIE_-gdwarf-4_-Wall/timingleaks/crypto_aead/omdsha256k256n248tau256v1/avx1/work/./omdsha256.h:137: multiple definition of `Hash'; libcrypto_aead_omdsha256k256n248tau256v1.a(encrypt.o):.../supercop-data/bolero/amd64/try/c/clang_-march=native_-O3_-fwrapv_-Qunused-arguments_-fPIC_-fPIE_-gdwarf-4_-Wall/timingleaks/crypto_aead/omdsha256k256n248tau256v1/avx1/work/./omdsha256.h:137: first defined here
try.c: clang: error: linker command failed with exit code 1 (use -v to see invocation)

Number of similar (implementation,compiler) pairs: 1, namely:
ImplementationCompiler
T:avx1clang -march=native -O3 -fwrapv -Qunused-arguments -fPIC -fPIE -gdwarf-4 -Wall (Ubuntu_Clang_14.0.0)

Compiler output


try.c: /usr/bin/ld: libcrypto_aead_omdsha256k256n248tau256v1.a(omdsha256.o):.../supercop-data/bolero/amd64/try/c/clang_-march=native_-O_-fwrapv_-Qunused-arguments_-fPIC_-fPIE_-gdwarf-4_-Wall/timingleaks/crypto_aead/omdsha256k256n248tau256v1/avx1/work/./omdsha256.h:137: multiple definition of `Hash'; libcrypto_aead_omdsha256k256n248tau256v1.a(encrypt.o):.../supercop-data/bolero/amd64/try/c/clang_-march=native_-O_-fwrapv_-Qunused-arguments_-fPIC_-fPIE_-gdwarf-4_-Wall/timingleaks/crypto_aead/omdsha256k256n248tau256v1/avx1/work/./omdsha256.h:137: first defined here
try.c: clang: error: linker command failed with exit code 1 (use -v to see invocation)

Number of similar (implementation,compiler) pairs: 1, namely:
ImplementationCompiler
T:avx1clang -march=native -O -fwrapv -Qunused-arguments -fPIC -fPIE -gdwarf-4 -Wall (Ubuntu_Clang_14.0.0)

Compiler output


try.c: /usr/bin/ld: libcrypto_aead_omdsha256k256n248tau256v1.a(omdsha256.o):.../supercop-data/bolero/amd64/try/c/clang_-march=native_-Os_-fwrapv_-Qunused-arguments_-fPIC_-fPIE_-gdwarf-4_-Wall/timingleaks/crypto_aead/omdsha256k256n248tau256v1/avx1/work/./omdsha256.h:137: multiple definition of `Hash'; libcrypto_aead_omdsha256k256n248tau256v1.a(encrypt.o):.../supercop-data/bolero/amd64/try/c/clang_-march=native_-Os_-fwrapv_-Qunused-arguments_-fPIC_-fPIE_-gdwarf-4_-Wall/timingleaks/crypto_aead/omdsha256k256n248tau256v1/avx1/work/./omdsha256.h:137: first defined here
try.c: clang: error: linker command failed with exit code 1 (use -v to see invocation)

Number of similar (implementation,compiler) pairs: 1, namely:
ImplementationCompiler
T:avx1clang -march=native -Os -fwrapv -Qunused-arguments -fPIC -fPIE -gdwarf-4 -Wall (Ubuntu_Clang_14.0.0)

Compiler output


try.c: /usr/bin/ld: libcrypto_aead_omdsha256k256n248tau256v1.a(omdsha256.o):.../supercop-data/bolero/amd64/try/c/clang_-mcpu=native_-O3_-fwrapv_-Qunused-arguments_-fPIC_-fPIE_-gdwarf-4_-Wall/timingleaks/crypto_aead/omdsha256k256n248tau256v1/avx1/work/./omdsha256.h:137: multiple definition of `Hash'; libcrypto_aead_omdsha256k256n248tau256v1.a(encrypt.o):.../supercop-data/bolero/amd64/try/c/clang_-mcpu=native_-O3_-fwrapv_-Qunused-arguments_-fPIC_-fPIE_-gdwarf-4_-Wall/timingleaks/crypto_aead/omdsha256k256n248tau256v1/avx1/work/./omdsha256.h:137: first defined here
try.c: clang: error: linker command failed with exit code 1 (use -v to see invocation)

Number of similar (implementation,compiler) pairs: 1, namely:
ImplementationCompiler
T:avx1clang -mcpu=native -O3 -fwrapv -Qunused-arguments -fPIC -fPIE -gdwarf-4 -Wall (Ubuntu_Clang_14.0.0)

Compiler output


encrypt.c: /tmp/ccIeeF31.s: Assembler messages:
encrypt.c: /tmp/ccIeeF31.s:922: Warning: dwarf line number information for .data ignored
encrypt.c: /tmp/ccIeeF31.s:924: Warning: dwarf line number information for .data ignored
encrypt.c: /tmp/ccIeeF31.s:926: Warning: dwarf line number information for .data ignored
encrypt.c: /tmp/ccIeeF31.s:927: Warning: dwarf line number information for .data ignored
encrypt.c: /tmp/ccIeeF31.s:928: Warning: dwarf line number information for .data ignored
encrypt.c: /tmp/ccIeeF31.s:939: Warning: dwarf line number information for .data ignored
encrypt.c: /tmp/ccIeeF31.s:946: Warning: dwarf line number information for .data ignored
encrypt.c: /tmp/ccIeeF31.s:949: Warning: dwarf line number information for .data ignored
encrypt.c: /tmp/ccIeeF31.s:950: Warning: dwarf line number information for .data ignored
encrypt.c: /tmp/ccIeeF31.s:957: Warning: dwarf line number information for .data ignored
encrypt.c: /tmp/ccIeeF31.s:958: Warning: dwarf line number information for .data ignored
encrypt.c: /tmp/ccIeeF31.s:961: Warning: dwarf line number information for .data ignored
encrypt.c: /tmp/ccIeeF31.s:963: Warning: dwarf line number information for .data ignored
encrypt.c: /tmp/ccIeeF31.s:966: Warning: dwarf line number information for .data ignored
encrypt.c: /tmp/ccIeeF31.s:974: Warning: dwarf line number information for .data ignored
encrypt.c: /tmp/ccIeeF31.s:985: Warning: dwarf line number information for .data ignored
encrypt.c: /tmp/ccIeeF31.s:987: Warning: dwarf line number information for .data ignored
encrypt.c: /tmp/ccIeeF31.s:989: Warning: dwarf line number information for .data ignored
encrypt.c: /tmp/ccIeeF31.s:990: Warning: dwarf line number information for .data ignored
encrypt.c: /tmp/ccIeeF31.s:991: Warning: dwarf line number information for .data ignored
encrypt.c: /tmp/ccIeeF31.s:998: Warning: dwarf line number information for .data ignored
encrypt.c: /tmp/ccIeeF31.s:1005: Warning: dwarf line number information for .data ignored
encrypt.c: /tmp/ccIeeF31.s:1008: Warning: dwarf line number information for .data ignored
encrypt.c: /tmp/ccIeeF31.s:1011: Warning: dwarf line number information for .data ignored
encrypt.c: ...

Number of similar (implementation,compiler) pairs: 1, namely:
ImplementationCompiler
T:avx1gcc -march=native -mtune=native -O2 -fwrapv -fPIC -fPIE -gdwarf-4 -Wall (11.4.0)

Compiler output


encrypt.c: /tmp/ccnamUIQ.s: Assembler messages:
encrypt.c: /tmp/ccnamUIQ.s:922: Warning: dwarf line number information for .data ignored
encrypt.c: /tmp/ccnamUIQ.s:924: Warning: dwarf line number information for .data ignored
encrypt.c: /tmp/ccnamUIQ.s:926: Warning: dwarf line number information for .data ignored
encrypt.c: /tmp/ccnamUIQ.s:927: Warning: dwarf line number information for .data ignored
encrypt.c: /tmp/ccnamUIQ.s:928: Warning: dwarf line number information for .data ignored
encrypt.c: /tmp/ccnamUIQ.s:939: Warning: dwarf line number information for .data ignored
encrypt.c: /tmp/ccnamUIQ.s:946: Warning: dwarf line number information for .data ignored
encrypt.c: /tmp/ccnamUIQ.s:949: Warning: dwarf line number information for .data ignored
encrypt.c: /tmp/ccnamUIQ.s:950: Warning: dwarf line number information for .data ignored
encrypt.c: /tmp/ccnamUIQ.s:957: Warning: dwarf line number information for .data ignored
encrypt.c: /tmp/ccnamUIQ.s:958: Warning: dwarf line number information for .data ignored
encrypt.c: /tmp/ccnamUIQ.s:961: Warning: dwarf line number information for .data ignored
encrypt.c: /tmp/ccnamUIQ.s:963: Warning: dwarf line number information for .data ignored
encrypt.c: /tmp/ccnamUIQ.s:966: Warning: dwarf line number information for .data ignored
encrypt.c: /tmp/ccnamUIQ.s:974: Warning: dwarf line number information for .data ignored
encrypt.c: /tmp/ccnamUIQ.s:985: Warning: dwarf line number information for .data ignored
encrypt.c: /tmp/ccnamUIQ.s:987: Warning: dwarf line number information for .data ignored
encrypt.c: /tmp/ccnamUIQ.s:989: Warning: dwarf line number information for .data ignored
encrypt.c: /tmp/ccnamUIQ.s:990: Warning: dwarf line number information for .data ignored
encrypt.c: /tmp/ccnamUIQ.s:991: Warning: dwarf line number information for .data ignored
encrypt.c: /tmp/ccnamUIQ.s:998: Warning: dwarf line number information for .data ignored
encrypt.c: /tmp/ccnamUIQ.s:1005: Warning: dwarf line number information for .data ignored
encrypt.c: /tmp/ccnamUIQ.s:1008: Warning: dwarf line number information for .data ignored
encrypt.c: /tmp/ccnamUIQ.s:1011: Warning: dwarf line number information for .data ignored
encrypt.c: ...

Number of similar (implementation,compiler) pairs: 1, namely:
ImplementationCompiler
T:avx1gcc -march=native -mtune=native -O3 -fwrapv -fPIC -fPIE -gdwarf-4 -Wall (11.4.0)

Compiler output


encrypt.c: /tmp/ccY5RZWG.s: Assembler messages:
encrypt.c: /tmp/ccY5RZWG.s:921: Warning: dwarf line number information for .data ignored
encrypt.c: /tmp/ccY5RZWG.s:923: Warning: dwarf line number information for .data ignored
encrypt.c: /tmp/ccY5RZWG.s:935: Warning: dwarf line number information for .data ignored
encrypt.c: /tmp/ccY5RZWG.s:936: Warning: dwarf line number information for .data ignored
encrypt.c: /tmp/ccY5RZWG.s:937: Warning: dwarf line number information for .data ignored
encrypt.c: /tmp/ccY5RZWG.s:944: Warning: dwarf line number information for .data ignored
encrypt.c: /tmp/ccY5RZWG.s:947: Warning: dwarf line number information for .data ignored
encrypt.c: /tmp/ccY5RZWG.s:948: Warning: dwarf line number information for .data ignored
encrypt.c: /tmp/ccY5RZWG.s:953: Warning: dwarf line number information for .data ignored
encrypt.c: /tmp/ccY5RZWG.s:954: Warning: dwarf line number information for .data ignored
encrypt.c: /tmp/ccY5RZWG.s:957: Warning: dwarf line number information for .data ignored
encrypt.c: /tmp/ccY5RZWG.s:959: Warning: dwarf line number information for .data ignored
encrypt.c: /tmp/ccY5RZWG.s:962: Warning: dwarf line number information for .data ignored
encrypt.c: /tmp/ccY5RZWG.s:970: Warning: dwarf line number information for .data ignored
encrypt.c: /tmp/ccY5RZWG.s:980: Warning: dwarf line number information for .data ignored
encrypt.c: /tmp/ccY5RZWG.s:982: Warning: dwarf line number information for .data ignored
encrypt.c: /tmp/ccY5RZWG.s:995: Warning: dwarf line number information for .data ignored
encrypt.c: /tmp/ccY5RZWG.s:999: Warning: dwarf line number information for .data ignored
encrypt.c: /tmp/ccY5RZWG.s:1000: Warning: dwarf line number information for .data ignored
encrypt.c: /tmp/ccY5RZWG.s:1001: Warning: dwarf line number information for .data ignored
encrypt.c: /tmp/ccY5RZWG.s:1008: Warning: dwarf line number information for .data ignored
encrypt.c: /tmp/ccY5RZWG.s:1011: Warning: dwarf line number information for .data ignored
encrypt.c: /tmp/ccY5RZWG.s:1014: Warning: dwarf line number information for .data ignored
encrypt.c: /tmp/ccY5RZWG.s:1017: Warning: dwarf line number information for .data ignored
encrypt.c: ...

Number of similar (implementation,compiler) pairs: 1, namely:
ImplementationCompiler
T:avx1gcc -march=native -mtune=native -O -fwrapv -fPIC -fPIE -gdwarf-4 -Wall (11.4.0)

Compiler output


encrypt.c: /tmp/ccA2nrhG.s: Assembler messages:
encrypt.c: /tmp/ccA2nrhG.s:921: Warning: dwarf line number information for .data ignored
encrypt.c: /tmp/ccA2nrhG.s:923: Warning: dwarf line number information for .data ignored
encrypt.c: /tmp/ccA2nrhG.s:925: Warning: dwarf line number information for .data ignored
encrypt.c: /tmp/ccA2nrhG.s:926: Warning: dwarf line number information for .data ignored
encrypt.c: /tmp/ccA2nrhG.s:927: Warning: dwarf line number information for .data ignored
encrypt.c: /tmp/ccA2nrhG.s:938: Warning: dwarf line number information for .data ignored
encrypt.c: /tmp/ccA2nrhG.s:945: Warning: dwarf line number information for .data ignored
encrypt.c: /tmp/ccA2nrhG.s:948: Warning: dwarf line number information for .data ignored
encrypt.c: /tmp/ccA2nrhG.s:949: Warning: dwarf line number information for .data ignored
encrypt.c: /tmp/ccA2nrhG.s:956: Warning: dwarf line number information for .data ignored
encrypt.c: /tmp/ccA2nrhG.s:957: Warning: dwarf line number information for .data ignored
encrypt.c: /tmp/ccA2nrhG.s:960: Warning: dwarf line number information for .data ignored
encrypt.c: /tmp/ccA2nrhG.s:962: Warning: dwarf line number information for .data ignored
encrypt.c: /tmp/ccA2nrhG.s:965: Warning: dwarf line number information for .data ignored
encrypt.c: /tmp/ccA2nrhG.s:973: Warning: dwarf line number information for .data ignored
encrypt.c: /tmp/ccA2nrhG.s:983: Warning: dwarf line number information for .data ignored
encrypt.c: /tmp/ccA2nrhG.s:985: Warning: dwarf line number information for .data ignored
encrypt.c: /tmp/ccA2nrhG.s:987: Warning: dwarf line number information for .data ignored
encrypt.c: /tmp/ccA2nrhG.s:988: Warning: dwarf line number information for .data ignored
encrypt.c: /tmp/ccA2nrhG.s:989: Warning: dwarf line number information for .data ignored
encrypt.c: /tmp/ccA2nrhG.s:996: Warning: dwarf line number information for .data ignored
encrypt.c: /tmp/ccA2nrhG.s:1003: Warning: dwarf line number information for .data ignored
encrypt.c: /tmp/ccA2nrhG.s:1006: Warning: dwarf line number information for .data ignored
encrypt.c: /tmp/ccA2nrhG.s:1009: Warning: dwarf line number information for .data ignored
encrypt.c: ...

Number of similar (implementation,compiler) pairs: 1, namely:
ImplementationCompiler
T:avx1gcc -march=native -mtune=native -Os -fwrapv -fPIC -fPIE -gdwarf-4 -Wall (11.4.0)

Compiler output


try.c: /usr/bin/ld: libcrypto_aead_omdsha256k256n248tau256v1.a(omdsha256.o):.../supercop-data/bolero/amd64/try/c/clang_-march=native_-O2_-fwrapv_-Qunused-arguments_-fPIC_-fPIE_-gdwarf-4_-Wall/timingleaks/crypto_aead/omdsha256k256n248tau256v1/sse4/work/./omdsha256.h:137: multiple definition of `Hash'; libcrypto_aead_omdsha256k256n248tau256v1.a(encrypt.o):.../supercop-data/bolero/amd64/try/c/clang_-march=native_-O2_-fwrapv_-Qunused-arguments_-fPIC_-fPIE_-gdwarf-4_-Wall/timingleaks/crypto_aead/omdsha256k256n248tau256v1/sse4/work/./omdsha256.h:137: first defined here
try.c: clang: error: linker command failed with exit code 1 (use -v to see invocation)

Number of similar (implementation,compiler) pairs: 1, namely:
ImplementationCompiler
T:sse4clang -march=native -O2 -fwrapv -Qunused-arguments -fPIC -fPIE -gdwarf-4 -Wall (Ubuntu_Clang_14.0.0)

Compiler output


try.c: /usr/bin/ld: libcrypto_aead_omdsha256k256n248tau256v1.a(omdsha256.o):.../supercop-data/bolero/amd64/try/c/clang_-march=native_-O3_-fwrapv_-Qunused-arguments_-fPIC_-fPIE_-gdwarf-4_-Wall/timingleaks/crypto_aead/omdsha256k256n248tau256v1/sse4/work/./omdsha256.h:137: multiple definition of `Hash'; libcrypto_aead_omdsha256k256n248tau256v1.a(encrypt.o):.../supercop-data/bolero/amd64/try/c/clang_-march=native_-O3_-fwrapv_-Qunused-arguments_-fPIC_-fPIE_-gdwarf-4_-Wall/timingleaks/crypto_aead/omdsha256k256n248tau256v1/sse4/work/./omdsha256.h:137: first defined here
try.c: clang: error: linker command failed with exit code 1 (use -v to see invocation)

Number of similar (implementation,compiler) pairs: 1, namely:
ImplementationCompiler
T:sse4clang -march=native -O3 -fwrapv -Qunused-arguments -fPIC -fPIE -gdwarf-4 -Wall (Ubuntu_Clang_14.0.0)

Compiler output


try.c: /usr/bin/ld: libcrypto_aead_omdsha256k256n248tau256v1.a(omdsha256.o):.../supercop-data/bolero/amd64/try/c/clang_-march=native_-O_-fwrapv_-Qunused-arguments_-fPIC_-fPIE_-gdwarf-4_-Wall/timingleaks/crypto_aead/omdsha256k256n248tau256v1/sse4/work/./omdsha256.h:137: multiple definition of `Hash'; libcrypto_aead_omdsha256k256n248tau256v1.a(encrypt.o):.../supercop-data/bolero/amd64/try/c/clang_-march=native_-O_-fwrapv_-Qunused-arguments_-fPIC_-fPIE_-gdwarf-4_-Wall/timingleaks/crypto_aead/omdsha256k256n248tau256v1/sse4/work/./omdsha256.h:137: first defined here
try.c: clang: error: linker command failed with exit code 1 (use -v to see invocation)

Number of similar (implementation,compiler) pairs: 1, namely:
ImplementationCompiler
T:sse4clang -march=native -O -fwrapv -Qunused-arguments -fPIC -fPIE -gdwarf-4 -Wall (Ubuntu_Clang_14.0.0)

Compiler output


try.c: /usr/bin/ld: libcrypto_aead_omdsha256k256n248tau256v1.a(omdsha256.o):.../supercop-data/bolero/amd64/try/c/clang_-march=native_-Os_-fwrapv_-Qunused-arguments_-fPIC_-fPIE_-gdwarf-4_-Wall/timingleaks/crypto_aead/omdsha256k256n248tau256v1/sse4/work/./omdsha256.h:137: multiple definition of `Hash'; libcrypto_aead_omdsha256k256n248tau256v1.a(encrypt.o):.../supercop-data/bolero/amd64/try/c/clang_-march=native_-Os_-fwrapv_-Qunused-arguments_-fPIC_-fPIE_-gdwarf-4_-Wall/timingleaks/crypto_aead/omdsha256k256n248tau256v1/sse4/work/./omdsha256.h:137: first defined here
try.c: clang: error: linker command failed with exit code 1 (use -v to see invocation)

Number of similar (implementation,compiler) pairs: 1, namely:
ImplementationCompiler
T:sse4clang -march=native -Os -fwrapv -Qunused-arguments -fPIC -fPIE -gdwarf-4 -Wall (Ubuntu_Clang_14.0.0)

Compiler output


try.c: /usr/bin/ld: libcrypto_aead_omdsha256k256n248tau256v1.a(omdsha256.o):.../supercop-data/bolero/amd64/try/c/clang_-mcpu=native_-O3_-fwrapv_-Qunused-arguments_-fPIC_-fPIE_-gdwarf-4_-Wall/timingleaks/crypto_aead/omdsha256k256n248tau256v1/sse4/work/./omdsha256.h:137: multiple definition of `Hash'; libcrypto_aead_omdsha256k256n248tau256v1.a(encrypt.o):.../supercop-data/bolero/amd64/try/c/clang_-mcpu=native_-O3_-fwrapv_-Qunused-arguments_-fPIC_-fPIE_-gdwarf-4_-Wall/timingleaks/crypto_aead/omdsha256k256n248tau256v1/sse4/work/./omdsha256.h:137: first defined here
try.c: clang: error: linker command failed with exit code 1 (use -v to see invocation)

Number of similar (implementation,compiler) pairs: 1, namely:
ImplementationCompiler
T:sse4clang -mcpu=native -O3 -fwrapv -Qunused-arguments -fPIC -fPIE -gdwarf-4 -Wall (Ubuntu_Clang_14.0.0)

Compiler output


encrypt.c: /tmp/ccJN5u7w.s: Assembler messages:
encrypt.c: /tmp/ccJN5u7w.s:961: Warning: dwarf line number information for .data ignored
encrypt.c: /tmp/ccJN5u7w.s:963: Warning: dwarf line number information for .data ignored
encrypt.c: /tmp/ccJN5u7w.s:965: Warning: dwarf line number information for .data ignored
encrypt.c: /tmp/ccJN5u7w.s:966: Warning: dwarf line number information for .data ignored
encrypt.c: /tmp/ccJN5u7w.s:967: Warning: dwarf line number information for .data ignored
encrypt.c: /tmp/ccJN5u7w.s:978: Warning: dwarf line number information for .data ignored
encrypt.c: /tmp/ccJN5u7w.s:985: Warning: dwarf line number information for .data ignored
encrypt.c: /tmp/ccJN5u7w.s:988: Warning: dwarf line number information for .data ignored
encrypt.c: /tmp/ccJN5u7w.s:989: Warning: dwarf line number information for .data ignored
encrypt.c: /tmp/ccJN5u7w.s:996: Warning: dwarf line number information for .data ignored
encrypt.c: /tmp/ccJN5u7w.s:997: Warning: dwarf line number information for .data ignored
encrypt.c: /tmp/ccJN5u7w.s:1000: Warning: dwarf line number information for .data ignored
encrypt.c: /tmp/ccJN5u7w.s:1002: Warning: dwarf line number information for .data ignored
encrypt.c: /tmp/ccJN5u7w.s:1005: Warning: dwarf line number information for .data ignored
encrypt.c: /tmp/ccJN5u7w.s:1013: Warning: dwarf line number information for .data ignored
encrypt.c: /tmp/ccJN5u7w.s:1024: Warning: dwarf line number information for .data ignored
encrypt.c: /tmp/ccJN5u7w.s:1026: Warning: dwarf line number information for .data ignored
encrypt.c: /tmp/ccJN5u7w.s:1028: Warning: dwarf line number information for .data ignored
encrypt.c: /tmp/ccJN5u7w.s:1029: Warning: dwarf line number information for .data ignored
encrypt.c: /tmp/ccJN5u7w.s:1030: Warning: dwarf line number information for .data ignored
encrypt.c: /tmp/ccJN5u7w.s:1037: Warning: dwarf line number information for .data ignored
encrypt.c: /tmp/ccJN5u7w.s:1044: Warning: dwarf line number information for .data ignored
encrypt.c: /tmp/ccJN5u7w.s:1047: Warning: dwarf line number information for .data ignored
encrypt.c: /tmp/ccJN5u7w.s:1050: Warning: dwarf line number information for .data ignored
encrypt.c: ...

Number of similar (implementation,compiler) pairs: 1, namely:
ImplementationCompiler
T:sse4gcc -march=native -mtune=native -O2 -fwrapv -fPIC -fPIE -gdwarf-4 -Wall (11.4.0)

Compiler output


encrypt.c: /tmp/ccvRwMh5.s: Assembler messages:
encrypt.c: /tmp/ccvRwMh5.s:961: Warning: dwarf line number information for .data ignored
encrypt.c: /tmp/ccvRwMh5.s:963: Warning: dwarf line number information for .data ignored
encrypt.c: /tmp/ccvRwMh5.s:965: Warning: dwarf line number information for .data ignored
encrypt.c: /tmp/ccvRwMh5.s:966: Warning: dwarf line number information for .data ignored
encrypt.c: /tmp/ccvRwMh5.s:967: Warning: dwarf line number information for .data ignored
encrypt.c: /tmp/ccvRwMh5.s:978: Warning: dwarf line number information for .data ignored
encrypt.c: /tmp/ccvRwMh5.s:985: Warning: dwarf line number information for .data ignored
encrypt.c: /tmp/ccvRwMh5.s:988: Warning: dwarf line number information for .data ignored
encrypt.c: /tmp/ccvRwMh5.s:989: Warning: dwarf line number information for .data ignored
encrypt.c: /tmp/ccvRwMh5.s:996: Warning: dwarf line number information for .data ignored
encrypt.c: /tmp/ccvRwMh5.s:997: Warning: dwarf line number information for .data ignored
encrypt.c: /tmp/ccvRwMh5.s:1000: Warning: dwarf line number information for .data ignored
encrypt.c: /tmp/ccvRwMh5.s:1002: Warning: dwarf line number information for .data ignored
encrypt.c: /tmp/ccvRwMh5.s:1005: Warning: dwarf line number information for .data ignored
encrypt.c: /tmp/ccvRwMh5.s:1013: Warning: dwarf line number information for .data ignored
encrypt.c: /tmp/ccvRwMh5.s:1024: Warning: dwarf line number information for .data ignored
encrypt.c: /tmp/ccvRwMh5.s:1026: Warning: dwarf line number information for .data ignored
encrypt.c: /tmp/ccvRwMh5.s:1028: Warning: dwarf line number information for .data ignored
encrypt.c: /tmp/ccvRwMh5.s:1029: Warning: dwarf line number information for .data ignored
encrypt.c: /tmp/ccvRwMh5.s:1030: Warning: dwarf line number information for .data ignored
encrypt.c: /tmp/ccvRwMh5.s:1037: Warning: dwarf line number information for .data ignored
encrypt.c: /tmp/ccvRwMh5.s:1044: Warning: dwarf line number information for .data ignored
encrypt.c: /tmp/ccvRwMh5.s:1047: Warning: dwarf line number information for .data ignored
encrypt.c: /tmp/ccvRwMh5.s:1050: Warning: dwarf line number information for .data ignored
encrypt.c: ...

Number of similar (implementation,compiler) pairs: 1, namely:
ImplementationCompiler
T:sse4gcc -march=native -mtune=native -O3 -fwrapv -fPIC -fPIE -gdwarf-4 -Wall (11.4.0)

Compiler output


encrypt.c: /tmp/ccV3tjpF.s: Assembler messages:
encrypt.c: /tmp/ccV3tjpF.s:960: Warning: dwarf line number information for .data ignored
encrypt.c: /tmp/ccV3tjpF.s:962: Warning: dwarf line number information for .data ignored
encrypt.c: /tmp/ccV3tjpF.s:974: Warning: dwarf line number information for .data ignored
encrypt.c: /tmp/ccV3tjpF.s:975: Warning: dwarf line number information for .data ignored
encrypt.c: /tmp/ccV3tjpF.s:976: Warning: dwarf line number information for .data ignored
encrypt.c: /tmp/ccV3tjpF.s:983: Warning: dwarf line number information for .data ignored
encrypt.c: /tmp/ccV3tjpF.s:986: Warning: dwarf line number information for .data ignored
encrypt.c: /tmp/ccV3tjpF.s:987: Warning: dwarf line number information for .data ignored
encrypt.c: /tmp/ccV3tjpF.s:992: Warning: dwarf line number information for .data ignored
encrypt.c: /tmp/ccV3tjpF.s:993: Warning: dwarf line number information for .data ignored
encrypt.c: /tmp/ccV3tjpF.s:996: Warning: dwarf line number information for .data ignored
encrypt.c: /tmp/ccV3tjpF.s:998: Warning: dwarf line number information for .data ignored
encrypt.c: /tmp/ccV3tjpF.s:1001: Warning: dwarf line number information for .data ignored
encrypt.c: /tmp/ccV3tjpF.s:1009: Warning: dwarf line number information for .data ignored
encrypt.c: /tmp/ccV3tjpF.s:1019: Warning: dwarf line number information for .data ignored
encrypt.c: /tmp/ccV3tjpF.s:1021: Warning: dwarf line number information for .data ignored
encrypt.c: /tmp/ccV3tjpF.s:1034: Warning: dwarf line number information for .data ignored
encrypt.c: /tmp/ccV3tjpF.s:1038: Warning: dwarf line number information for .data ignored
encrypt.c: /tmp/ccV3tjpF.s:1039: Warning: dwarf line number information for .data ignored
encrypt.c: /tmp/ccV3tjpF.s:1040: Warning: dwarf line number information for .data ignored
encrypt.c: /tmp/ccV3tjpF.s:1047: Warning: dwarf line number information for .data ignored
encrypt.c: /tmp/ccV3tjpF.s:1050: Warning: dwarf line number information for .data ignored
encrypt.c: /tmp/ccV3tjpF.s:1053: Warning: dwarf line number information for .data ignored
encrypt.c: /tmp/ccV3tjpF.s:1056: Warning: dwarf line number information for .data ignored
encrypt.c: ...

Number of similar (implementation,compiler) pairs: 1, namely:
ImplementationCompiler
T:sse4gcc -march=native -mtune=native -O -fwrapv -fPIC -fPIE -gdwarf-4 -Wall (11.4.0)

Compiler output


encrypt.c: /tmp/cc8SDmjA.s: Assembler messages:
encrypt.c: /tmp/cc8SDmjA.s:960: Warning: dwarf line number information for .data ignored
encrypt.c: /tmp/cc8SDmjA.s:962: Warning: dwarf line number information for .data ignored
encrypt.c: /tmp/cc8SDmjA.s:964: Warning: dwarf line number information for .data ignored
encrypt.c: /tmp/cc8SDmjA.s:965: Warning: dwarf line number information for .data ignored
encrypt.c: /tmp/cc8SDmjA.s:966: Warning: dwarf line number information for .data ignored
encrypt.c: /tmp/cc8SDmjA.s:977: Warning: dwarf line number information for .data ignored
encrypt.c: /tmp/cc8SDmjA.s:984: Warning: dwarf line number information for .data ignored
encrypt.c: /tmp/cc8SDmjA.s:987: Warning: dwarf line number information for .data ignored
encrypt.c: /tmp/cc8SDmjA.s:988: Warning: dwarf line number information for .data ignored
encrypt.c: /tmp/cc8SDmjA.s:995: Warning: dwarf line number information for .data ignored
encrypt.c: /tmp/cc8SDmjA.s:996: Warning: dwarf line number information for .data ignored
encrypt.c: /tmp/cc8SDmjA.s:999: Warning: dwarf line number information for .data ignored
encrypt.c: /tmp/cc8SDmjA.s:1001: Warning: dwarf line number information for .data ignored
encrypt.c: /tmp/cc8SDmjA.s:1004: Warning: dwarf line number information for .data ignored
encrypt.c: /tmp/cc8SDmjA.s:1012: Warning: dwarf line number information for .data ignored
encrypt.c: /tmp/cc8SDmjA.s:1022: Warning: dwarf line number information for .data ignored
encrypt.c: /tmp/cc8SDmjA.s:1024: Warning: dwarf line number information for .data ignored
encrypt.c: /tmp/cc8SDmjA.s:1026: Warning: dwarf line number information for .data ignored
encrypt.c: /tmp/cc8SDmjA.s:1027: Warning: dwarf line number information for .data ignored
encrypt.c: /tmp/cc8SDmjA.s:1028: Warning: dwarf line number information for .data ignored
encrypt.c: /tmp/cc8SDmjA.s:1035: Warning: dwarf line number information for .data ignored
encrypt.c: /tmp/cc8SDmjA.s:1042: Warning: dwarf line number information for .data ignored
encrypt.c: /tmp/cc8SDmjA.s:1045: Warning: dwarf line number information for .data ignored
encrypt.c: /tmp/cc8SDmjA.s:1048: Warning: dwarf line number information for .data ignored
encrypt.c: ...

Number of similar (implementation,compiler) pairs: 1, namely:
ImplementationCompiler
T:sse4gcc -march=native -mtune=native -Os -fwrapv -fPIC -fPIE -gdwarf-4 -Wall (11.4.0)