Test results for amd64, bolero, crypto_aead/omdsha256k128n96tau96v1

[Page version: 20250314 17:16:01]

Measurements for amd64, bolero, crypto_aead Test results for amd64, bolero, crypto_aead Test results for crypto_aead/omdsha256k128n96tau96v1
Computer: bolero
Microarchitecture: amd64; Broadwell+AES (406f1)
Architecture: amd64
CPU ID: GenuineIntel-000406f1-1fc9cbf5
SUPERCOP version: 20250307
Operation: crypto_aead
Primitive: omdsha256k128n96tau96v1
TimeObject sizeTest sizeImplementationCompilerBenchmark dateSUPERCOP version
16833614802 0 038069 784 928T:refgcc -march=native -mtune=native -O3 -fwrapv -fPIC -fPIE -gdwarf-4 -Wall2025030920250307
17701211613 0 034772 816 872T:refclang -march=native -O2 -fwrapv -Qunused-arguments -fPIC -fPIE -gdwarf-4 -Wall2025030920250307
18296010871 0 034276 816 872T:refclang -march=native -O3 -fwrapv -Qunused-arguments -fPIC -fPIE -gdwarf-4 -Wall2025030920250307
1943364584 0 024830 808 920T:refclang -march=native -Os -fwrapv -Qunused-arguments -fPIC -fPIE -gdwarf-4 -Wall2025030920250307
1960366453 0 027677 784 928T:refgcc -march=native -mtune=native -O2 -fwrapv -fPIC -fPIE -gdwarf-4 -Wall2025030920250307
2064766052 0 026708 776 928T:refgcc -march=native -mtune=native -O -fwrapv -fPIC -fPIE -gdwarf-4 -Wall2025030920250307
2070245697 0 025132 816 856T:refclang -march=native -O -fwrapv -Qunused-arguments -fPIC -fPIE -gdwarf-4 -Wall2025030920250307
2176564619 0 023656 760 896T:refgcc -march=native -mtune=native -Os -fwrapv -fPIC -fPIE -gdwarf-4 -Wall2025030920250307
21812012170 0 033980 816 856T:refclang -mcpu=native -O3 -fwrapv -Qunused-arguments -fPIC -fPIE -gdwarf-4 -Wall2025030920250307

Compiler output


try.c: /usr/bin/ld: libcrypto_aead_omdsha256k128n96tau96v1.a(omdsha256.o):.../supercop-data/bolero/amd64/try/c/clang_-march=native_-O2_-fwrapv_-Qunused-arguments_-fPIC_-fPIE_-gdwarf-4_-Wall/timingleaks/crypto_aead/omdsha256k128n96tau96v1/avx1/work/./omdsha256.h:137: multiple definition of `Hash'; libcrypto_aead_omdsha256k128n96tau96v1.a(encrypt.o):.../supercop-data/bolero/amd64/try/c/clang_-march=native_-O2_-fwrapv_-Qunused-arguments_-fPIC_-fPIE_-gdwarf-4_-Wall/timingleaks/crypto_aead/omdsha256k128n96tau96v1/avx1/work/./omdsha256.h:137: first defined here
try.c: clang: error: linker command failed with exit code 1 (use -v to see invocation)

Number of similar (implementation,compiler) pairs: 1, namely:
ImplementationCompiler
T:avx1clang -march=native -O2 -fwrapv -Qunused-arguments -fPIC -fPIE -gdwarf-4 -Wall (Ubuntu_Clang_14.0.0)

Compiler output


try.c: /usr/bin/ld: libcrypto_aead_omdsha256k128n96tau96v1.a(omdsha256.o):.../supercop-data/bolero/amd64/try/c/clang_-march=native_-O3_-fwrapv_-Qunused-arguments_-fPIC_-fPIE_-gdwarf-4_-Wall/timingleaks/crypto_aead/omdsha256k128n96tau96v1/avx1/work/./omdsha256.h:137: multiple definition of `Hash'; libcrypto_aead_omdsha256k128n96tau96v1.a(encrypt.o):.../supercop-data/bolero/amd64/try/c/clang_-march=native_-O3_-fwrapv_-Qunused-arguments_-fPIC_-fPIE_-gdwarf-4_-Wall/timingleaks/crypto_aead/omdsha256k128n96tau96v1/avx1/work/./omdsha256.h:137: first defined here
try.c: clang: error: linker command failed with exit code 1 (use -v to see invocation)

Number of similar (implementation,compiler) pairs: 1, namely:
ImplementationCompiler
T:avx1clang -march=native -O3 -fwrapv -Qunused-arguments -fPIC -fPIE -gdwarf-4 -Wall (Ubuntu_Clang_14.0.0)

Compiler output


try.c: /usr/bin/ld: libcrypto_aead_omdsha256k128n96tau96v1.a(omdsha256.o):.../supercop-data/bolero/amd64/try/c/clang_-march=native_-O_-fwrapv_-Qunused-arguments_-fPIC_-fPIE_-gdwarf-4_-Wall/timingleaks/crypto_aead/omdsha256k128n96tau96v1/avx1/work/./omdsha256.h:137: multiple definition of `Hash'; libcrypto_aead_omdsha256k128n96tau96v1.a(encrypt.o):.../supercop-data/bolero/amd64/try/c/clang_-march=native_-O_-fwrapv_-Qunused-arguments_-fPIC_-fPIE_-gdwarf-4_-Wall/timingleaks/crypto_aead/omdsha256k128n96tau96v1/avx1/work/./omdsha256.h:137: first defined here
try.c: clang: error: linker command failed with exit code 1 (use -v to see invocation)

Number of similar (implementation,compiler) pairs: 1, namely:
ImplementationCompiler
T:avx1clang -march=native -O -fwrapv -Qunused-arguments -fPIC -fPIE -gdwarf-4 -Wall (Ubuntu_Clang_14.0.0)

Compiler output


try.c: /usr/bin/ld: libcrypto_aead_omdsha256k128n96tau96v1.a(omdsha256.o):.../supercop-data/bolero/amd64/try/c/clang_-march=native_-Os_-fwrapv_-Qunused-arguments_-fPIC_-fPIE_-gdwarf-4_-Wall/timingleaks/crypto_aead/omdsha256k128n96tau96v1/avx1/work/./omdsha256.h:137: multiple definition of `Hash'; libcrypto_aead_omdsha256k128n96tau96v1.a(encrypt.o):.../supercop-data/bolero/amd64/try/c/clang_-march=native_-Os_-fwrapv_-Qunused-arguments_-fPIC_-fPIE_-gdwarf-4_-Wall/timingleaks/crypto_aead/omdsha256k128n96tau96v1/avx1/work/./omdsha256.h:137: first defined here
try.c: clang: error: linker command failed with exit code 1 (use -v to see invocation)

Number of similar (implementation,compiler) pairs: 1, namely:
ImplementationCompiler
T:avx1clang -march=native -Os -fwrapv -Qunused-arguments -fPIC -fPIE -gdwarf-4 -Wall (Ubuntu_Clang_14.0.0)

Compiler output


try.c: /usr/bin/ld: libcrypto_aead_omdsha256k128n96tau96v1.a(omdsha256.o):.../supercop-data/bolero/amd64/try/c/clang_-mcpu=native_-O3_-fwrapv_-Qunused-arguments_-fPIC_-fPIE_-gdwarf-4_-Wall/timingleaks/crypto_aead/omdsha256k128n96tau96v1/avx1/work/./omdsha256.h:137: multiple definition of `Hash'; libcrypto_aead_omdsha256k128n96tau96v1.a(encrypt.o):.../supercop-data/bolero/amd64/try/c/clang_-mcpu=native_-O3_-fwrapv_-Qunused-arguments_-fPIC_-fPIE_-gdwarf-4_-Wall/timingleaks/crypto_aead/omdsha256k128n96tau96v1/avx1/work/./omdsha256.h:137: first defined here
try.c: clang: error: linker command failed with exit code 1 (use -v to see invocation)

Number of similar (implementation,compiler) pairs: 1, namely:
ImplementationCompiler
T:avx1clang -mcpu=native -O3 -fwrapv -Qunused-arguments -fPIC -fPIE -gdwarf-4 -Wall (Ubuntu_Clang_14.0.0)

Compiler output


encrypt.c: /tmp/cc664DfX.s: Assembler messages:
encrypt.c: /tmp/cc664DfX.s:922: Warning: dwarf line number information for .data ignored
encrypt.c: /tmp/cc664DfX.s:924: Warning: dwarf line number information for .data ignored
encrypt.c: /tmp/cc664DfX.s:926: Warning: dwarf line number information for .data ignored
encrypt.c: /tmp/cc664DfX.s:927: Warning: dwarf line number information for .data ignored
encrypt.c: /tmp/cc664DfX.s:928: Warning: dwarf line number information for .data ignored
encrypt.c: /tmp/cc664DfX.s:939: Warning: dwarf line number information for .data ignored
encrypt.c: /tmp/cc664DfX.s:946: Warning: dwarf line number information for .data ignored
encrypt.c: /tmp/cc664DfX.s:949: Warning: dwarf line number information for .data ignored
encrypt.c: /tmp/cc664DfX.s:950: Warning: dwarf line number information for .data ignored
encrypt.c: /tmp/cc664DfX.s:957: Warning: dwarf line number information for .data ignored
encrypt.c: /tmp/cc664DfX.s:958: Warning: dwarf line number information for .data ignored
encrypt.c: /tmp/cc664DfX.s:961: Warning: dwarf line number information for .data ignored
encrypt.c: /tmp/cc664DfX.s:963: Warning: dwarf line number information for .data ignored
encrypt.c: /tmp/cc664DfX.s:966: Warning: dwarf line number information for .data ignored
encrypt.c: /tmp/cc664DfX.s:974: Warning: dwarf line number information for .data ignored
encrypt.c: /tmp/cc664DfX.s:985: Warning: dwarf line number information for .data ignored
encrypt.c: /tmp/cc664DfX.s:987: Warning: dwarf line number information for .data ignored
encrypt.c: /tmp/cc664DfX.s:989: Warning: dwarf line number information for .data ignored
encrypt.c: /tmp/cc664DfX.s:990: Warning: dwarf line number information for .data ignored
encrypt.c: /tmp/cc664DfX.s:991: Warning: dwarf line number information for .data ignored
encrypt.c: /tmp/cc664DfX.s:998: Warning: dwarf line number information for .data ignored
encrypt.c: /tmp/cc664DfX.s:1005: Warning: dwarf line number information for .data ignored
encrypt.c: /tmp/cc664DfX.s:1008: Warning: dwarf line number information for .data ignored
encrypt.c: /tmp/cc664DfX.s:1011: Warning: dwarf line number information for .data ignored
encrypt.c: ...

Number of similar (implementation,compiler) pairs: 1, namely:
ImplementationCompiler
T:avx1gcc -march=native -mtune=native -O2 -fwrapv -fPIC -fPIE -gdwarf-4 -Wall (11.4.0)

Compiler output


encrypt.c: /tmp/ccrZSyjc.s: Assembler messages:
encrypt.c: /tmp/ccrZSyjc.s:922: Warning: dwarf line number information for .data ignored
encrypt.c: /tmp/ccrZSyjc.s:924: Warning: dwarf line number information for .data ignored
encrypt.c: /tmp/ccrZSyjc.s:926: Warning: dwarf line number information for .data ignored
encrypt.c: /tmp/ccrZSyjc.s:927: Warning: dwarf line number information for .data ignored
encrypt.c: /tmp/ccrZSyjc.s:928: Warning: dwarf line number information for .data ignored
encrypt.c: /tmp/ccrZSyjc.s:939: Warning: dwarf line number information for .data ignored
encrypt.c: /tmp/ccrZSyjc.s:946: Warning: dwarf line number information for .data ignored
encrypt.c: /tmp/ccrZSyjc.s:949: Warning: dwarf line number information for .data ignored
encrypt.c: /tmp/ccrZSyjc.s:950: Warning: dwarf line number information for .data ignored
encrypt.c: /tmp/ccrZSyjc.s:957: Warning: dwarf line number information for .data ignored
encrypt.c: /tmp/ccrZSyjc.s:958: Warning: dwarf line number information for .data ignored
encrypt.c: /tmp/ccrZSyjc.s:961: Warning: dwarf line number information for .data ignored
encrypt.c: /tmp/ccrZSyjc.s:963: Warning: dwarf line number information for .data ignored
encrypt.c: /tmp/ccrZSyjc.s:966: Warning: dwarf line number information for .data ignored
encrypt.c: /tmp/ccrZSyjc.s:974: Warning: dwarf line number information for .data ignored
encrypt.c: /tmp/ccrZSyjc.s:985: Warning: dwarf line number information for .data ignored
encrypt.c: /tmp/ccrZSyjc.s:987: Warning: dwarf line number information for .data ignored
encrypt.c: /tmp/ccrZSyjc.s:989: Warning: dwarf line number information for .data ignored
encrypt.c: /tmp/ccrZSyjc.s:990: Warning: dwarf line number information for .data ignored
encrypt.c: /tmp/ccrZSyjc.s:991: Warning: dwarf line number information for .data ignored
encrypt.c: /tmp/ccrZSyjc.s:998: Warning: dwarf line number information for .data ignored
encrypt.c: /tmp/ccrZSyjc.s:1005: Warning: dwarf line number information for .data ignored
encrypt.c: /tmp/ccrZSyjc.s:1008: Warning: dwarf line number information for .data ignored
encrypt.c: /tmp/ccrZSyjc.s:1011: Warning: dwarf line number information for .data ignored
encrypt.c: ...

Number of similar (implementation,compiler) pairs: 1, namely:
ImplementationCompiler
T:avx1gcc -march=native -mtune=native -O3 -fwrapv -fPIC -fPIE -gdwarf-4 -Wall (11.4.0)

Compiler output


encrypt.c: /tmp/ccUghbJI.s: Assembler messages:
encrypt.c: /tmp/ccUghbJI.s:921: Warning: dwarf line number information for .data ignored
encrypt.c: /tmp/ccUghbJI.s:923: Warning: dwarf line number information for .data ignored
encrypt.c: /tmp/ccUghbJI.s:935: Warning: dwarf line number information for .data ignored
encrypt.c: /tmp/ccUghbJI.s:936: Warning: dwarf line number information for .data ignored
encrypt.c: /tmp/ccUghbJI.s:937: Warning: dwarf line number information for .data ignored
encrypt.c: /tmp/ccUghbJI.s:944: Warning: dwarf line number information for .data ignored
encrypt.c: /tmp/ccUghbJI.s:947: Warning: dwarf line number information for .data ignored
encrypt.c: /tmp/ccUghbJI.s:948: Warning: dwarf line number information for .data ignored
encrypt.c: /tmp/ccUghbJI.s:953: Warning: dwarf line number information for .data ignored
encrypt.c: /tmp/ccUghbJI.s:954: Warning: dwarf line number information for .data ignored
encrypt.c: /tmp/ccUghbJI.s:957: Warning: dwarf line number information for .data ignored
encrypt.c: /tmp/ccUghbJI.s:959: Warning: dwarf line number information for .data ignored
encrypt.c: /tmp/ccUghbJI.s:962: Warning: dwarf line number information for .data ignored
encrypt.c: /tmp/ccUghbJI.s:970: Warning: dwarf line number information for .data ignored
encrypt.c: /tmp/ccUghbJI.s:980: Warning: dwarf line number information for .data ignored
encrypt.c: /tmp/ccUghbJI.s:982: Warning: dwarf line number information for .data ignored
encrypt.c: /tmp/ccUghbJI.s:995: Warning: dwarf line number information for .data ignored
encrypt.c: /tmp/ccUghbJI.s:999: Warning: dwarf line number information for .data ignored
encrypt.c: /tmp/ccUghbJI.s:1000: Warning: dwarf line number information for .data ignored
encrypt.c: /tmp/ccUghbJI.s:1001: Warning: dwarf line number information for .data ignored
encrypt.c: /tmp/ccUghbJI.s:1008: Warning: dwarf line number information for .data ignored
encrypt.c: /tmp/ccUghbJI.s:1011: Warning: dwarf line number information for .data ignored
encrypt.c: /tmp/ccUghbJI.s:1014: Warning: dwarf line number information for .data ignored
encrypt.c: /tmp/ccUghbJI.s:1017: Warning: dwarf line number information for .data ignored
encrypt.c: ...

Number of similar (implementation,compiler) pairs: 1, namely:
ImplementationCompiler
T:avx1gcc -march=native -mtune=native -O -fwrapv -fPIC -fPIE -gdwarf-4 -Wall (11.4.0)

Compiler output


encrypt.c: /tmp/cciZKFGH.s: Assembler messages:
encrypt.c: /tmp/cciZKFGH.s:921: Warning: dwarf line number information for .data ignored
encrypt.c: /tmp/cciZKFGH.s:923: Warning: dwarf line number information for .data ignored
encrypt.c: /tmp/cciZKFGH.s:925: Warning: dwarf line number information for .data ignored
encrypt.c: /tmp/cciZKFGH.s:926: Warning: dwarf line number information for .data ignored
encrypt.c: /tmp/cciZKFGH.s:927: Warning: dwarf line number information for .data ignored
encrypt.c: /tmp/cciZKFGH.s:938: Warning: dwarf line number information for .data ignored
encrypt.c: /tmp/cciZKFGH.s:945: Warning: dwarf line number information for .data ignored
encrypt.c: /tmp/cciZKFGH.s:948: Warning: dwarf line number information for .data ignored
encrypt.c: /tmp/cciZKFGH.s:949: Warning: dwarf line number information for .data ignored
encrypt.c: /tmp/cciZKFGH.s:956: Warning: dwarf line number information for .data ignored
encrypt.c: /tmp/cciZKFGH.s:957: Warning: dwarf line number information for .data ignored
encrypt.c: /tmp/cciZKFGH.s:960: Warning: dwarf line number information for .data ignored
encrypt.c: /tmp/cciZKFGH.s:962: Warning: dwarf line number information for .data ignored
encrypt.c: /tmp/cciZKFGH.s:965: Warning: dwarf line number information for .data ignored
encrypt.c: /tmp/cciZKFGH.s:973: Warning: dwarf line number information for .data ignored
encrypt.c: /tmp/cciZKFGH.s:983: Warning: dwarf line number information for .data ignored
encrypt.c: /tmp/cciZKFGH.s:985: Warning: dwarf line number information for .data ignored
encrypt.c: /tmp/cciZKFGH.s:987: Warning: dwarf line number information for .data ignored
encrypt.c: /tmp/cciZKFGH.s:988: Warning: dwarf line number information for .data ignored
encrypt.c: /tmp/cciZKFGH.s:989: Warning: dwarf line number information for .data ignored
encrypt.c: /tmp/cciZKFGH.s:996: Warning: dwarf line number information for .data ignored
encrypt.c: /tmp/cciZKFGH.s:1003: Warning: dwarf line number information for .data ignored
encrypt.c: /tmp/cciZKFGH.s:1006: Warning: dwarf line number information for .data ignored
encrypt.c: /tmp/cciZKFGH.s:1009: Warning: dwarf line number information for .data ignored
encrypt.c: ...

Number of similar (implementation,compiler) pairs: 1, namely:
ImplementationCompiler
T:avx1gcc -march=native -mtune=native -Os -fwrapv -fPIC -fPIE -gdwarf-4 -Wall (11.4.0)

Compiler output


try.c: /usr/bin/ld: libcrypto_aead_omdsha256k128n96tau96v1.a(omdsha256.o):.../supercop-data/bolero/amd64/try/c/clang_-march=native_-O2_-fwrapv_-Qunused-arguments_-fPIC_-fPIE_-gdwarf-4_-Wall/timingleaks/crypto_aead/omdsha256k128n96tau96v1/sse4/work/./omdsha256.h:137: multiple definition of `Hash'; libcrypto_aead_omdsha256k128n96tau96v1.a(encrypt.o):.../supercop-data/bolero/amd64/try/c/clang_-march=native_-O2_-fwrapv_-Qunused-arguments_-fPIC_-fPIE_-gdwarf-4_-Wall/timingleaks/crypto_aead/omdsha256k128n96tau96v1/sse4/work/./omdsha256.h:137: first defined here
try.c: clang: error: linker command failed with exit code 1 (use -v to see invocation)

Number of similar (implementation,compiler) pairs: 1, namely:
ImplementationCompiler
T:sse4clang -march=native -O2 -fwrapv -Qunused-arguments -fPIC -fPIE -gdwarf-4 -Wall (Ubuntu_Clang_14.0.0)

Compiler output


try.c: /usr/bin/ld: libcrypto_aead_omdsha256k128n96tau96v1.a(omdsha256.o):.../supercop-data/bolero/amd64/try/c/clang_-march=native_-O3_-fwrapv_-Qunused-arguments_-fPIC_-fPIE_-gdwarf-4_-Wall/timingleaks/crypto_aead/omdsha256k128n96tau96v1/sse4/work/./omdsha256.h:137: multiple definition of `Hash'; libcrypto_aead_omdsha256k128n96tau96v1.a(encrypt.o):.../supercop-data/bolero/amd64/try/c/clang_-march=native_-O3_-fwrapv_-Qunused-arguments_-fPIC_-fPIE_-gdwarf-4_-Wall/timingleaks/crypto_aead/omdsha256k128n96tau96v1/sse4/work/./omdsha256.h:137: first defined here
try.c: clang: error: linker command failed with exit code 1 (use -v to see invocation)

Number of similar (implementation,compiler) pairs: 1, namely:
ImplementationCompiler
T:sse4clang -march=native -O3 -fwrapv -Qunused-arguments -fPIC -fPIE -gdwarf-4 -Wall (Ubuntu_Clang_14.0.0)

Compiler output


try.c: /usr/bin/ld: libcrypto_aead_omdsha256k128n96tau96v1.a(omdsha256.o):.../supercop-data/bolero/amd64/try/c/clang_-march=native_-O_-fwrapv_-Qunused-arguments_-fPIC_-fPIE_-gdwarf-4_-Wall/timingleaks/crypto_aead/omdsha256k128n96tau96v1/sse4/work/./omdsha256.h:137: multiple definition of `Hash'; libcrypto_aead_omdsha256k128n96tau96v1.a(encrypt.o):.../supercop-data/bolero/amd64/try/c/clang_-march=native_-O_-fwrapv_-Qunused-arguments_-fPIC_-fPIE_-gdwarf-4_-Wall/timingleaks/crypto_aead/omdsha256k128n96tau96v1/sse4/work/./omdsha256.h:137: first defined here
try.c: clang: error: linker command failed with exit code 1 (use -v to see invocation)

Number of similar (implementation,compiler) pairs: 1, namely:
ImplementationCompiler
T:sse4clang -march=native -O -fwrapv -Qunused-arguments -fPIC -fPIE -gdwarf-4 -Wall (Ubuntu_Clang_14.0.0)

Compiler output


try.c: /usr/bin/ld: libcrypto_aead_omdsha256k128n96tau96v1.a(omdsha256.o):.../supercop-data/bolero/amd64/try/c/clang_-march=native_-Os_-fwrapv_-Qunused-arguments_-fPIC_-fPIE_-gdwarf-4_-Wall/timingleaks/crypto_aead/omdsha256k128n96tau96v1/sse4/work/./omdsha256.h:137: multiple definition of `Hash'; libcrypto_aead_omdsha256k128n96tau96v1.a(encrypt.o):.../supercop-data/bolero/amd64/try/c/clang_-march=native_-Os_-fwrapv_-Qunused-arguments_-fPIC_-fPIE_-gdwarf-4_-Wall/timingleaks/crypto_aead/omdsha256k128n96tau96v1/sse4/work/./omdsha256.h:137: first defined here
try.c: clang: error: linker command failed with exit code 1 (use -v to see invocation)

Number of similar (implementation,compiler) pairs: 1, namely:
ImplementationCompiler
T:sse4clang -march=native -Os -fwrapv -Qunused-arguments -fPIC -fPIE -gdwarf-4 -Wall (Ubuntu_Clang_14.0.0)

Compiler output


try.c: /usr/bin/ld: libcrypto_aead_omdsha256k128n96tau96v1.a(omdsha256.o):.../supercop-data/bolero/amd64/try/c/clang_-mcpu=native_-O3_-fwrapv_-Qunused-arguments_-fPIC_-fPIE_-gdwarf-4_-Wall/timingleaks/crypto_aead/omdsha256k128n96tau96v1/sse4/work/./omdsha256.h:137: multiple definition of `Hash'; libcrypto_aead_omdsha256k128n96tau96v1.a(encrypt.o):.../supercop-data/bolero/amd64/try/c/clang_-mcpu=native_-O3_-fwrapv_-Qunused-arguments_-fPIC_-fPIE_-gdwarf-4_-Wall/timingleaks/crypto_aead/omdsha256k128n96tau96v1/sse4/work/./omdsha256.h:137: first defined here
try.c: clang: error: linker command failed with exit code 1 (use -v to see invocation)

Number of similar (implementation,compiler) pairs: 1, namely:
ImplementationCompiler
T:sse4clang -mcpu=native -O3 -fwrapv -Qunused-arguments -fPIC -fPIE -gdwarf-4 -Wall (Ubuntu_Clang_14.0.0)

Compiler output


encrypt.c: /tmp/ccL2hib6.s: Assembler messages:
encrypt.c: /tmp/ccL2hib6.s:961: Warning: dwarf line number information for .data ignored
encrypt.c: /tmp/ccL2hib6.s:963: Warning: dwarf line number information for .data ignored
encrypt.c: /tmp/ccL2hib6.s:965: Warning: dwarf line number information for .data ignored
encrypt.c: /tmp/ccL2hib6.s:966: Warning: dwarf line number information for .data ignored
encrypt.c: /tmp/ccL2hib6.s:967: Warning: dwarf line number information for .data ignored
encrypt.c: /tmp/ccL2hib6.s:978: Warning: dwarf line number information for .data ignored
encrypt.c: /tmp/ccL2hib6.s:985: Warning: dwarf line number information for .data ignored
encrypt.c: /tmp/ccL2hib6.s:988: Warning: dwarf line number information for .data ignored
encrypt.c: /tmp/ccL2hib6.s:989: Warning: dwarf line number information for .data ignored
encrypt.c: /tmp/ccL2hib6.s:996: Warning: dwarf line number information for .data ignored
encrypt.c: /tmp/ccL2hib6.s:997: Warning: dwarf line number information for .data ignored
encrypt.c: /tmp/ccL2hib6.s:1000: Warning: dwarf line number information for .data ignored
encrypt.c: /tmp/ccL2hib6.s:1002: Warning: dwarf line number information for .data ignored
encrypt.c: /tmp/ccL2hib6.s:1005: Warning: dwarf line number information for .data ignored
encrypt.c: /tmp/ccL2hib6.s:1013: Warning: dwarf line number information for .data ignored
encrypt.c: /tmp/ccL2hib6.s:1024: Warning: dwarf line number information for .data ignored
encrypt.c: /tmp/ccL2hib6.s:1026: Warning: dwarf line number information for .data ignored
encrypt.c: /tmp/ccL2hib6.s:1028: Warning: dwarf line number information for .data ignored
encrypt.c: /tmp/ccL2hib6.s:1029: Warning: dwarf line number information for .data ignored
encrypt.c: /tmp/ccL2hib6.s:1030: Warning: dwarf line number information for .data ignored
encrypt.c: /tmp/ccL2hib6.s:1037: Warning: dwarf line number information for .data ignored
encrypt.c: /tmp/ccL2hib6.s:1044: Warning: dwarf line number information for .data ignored
encrypt.c: /tmp/ccL2hib6.s:1047: Warning: dwarf line number information for .data ignored
encrypt.c: /tmp/ccL2hib6.s:1050: Warning: dwarf line number information for .data ignored
encrypt.c: ...

Number of similar (implementation,compiler) pairs: 1, namely:
ImplementationCompiler
T:sse4gcc -march=native -mtune=native -O2 -fwrapv -fPIC -fPIE -gdwarf-4 -Wall (11.4.0)

Compiler output


encrypt.c: /tmp/ccOVOHaS.s: Assembler messages:
encrypt.c: /tmp/ccOVOHaS.s:961: Warning: dwarf line number information for .data ignored
encrypt.c: /tmp/ccOVOHaS.s:963: Warning: dwarf line number information for .data ignored
encrypt.c: /tmp/ccOVOHaS.s:965: Warning: dwarf line number information for .data ignored
encrypt.c: /tmp/ccOVOHaS.s:966: Warning: dwarf line number information for .data ignored
encrypt.c: /tmp/ccOVOHaS.s:967: Warning: dwarf line number information for .data ignored
encrypt.c: /tmp/ccOVOHaS.s:978: Warning: dwarf line number information for .data ignored
encrypt.c: /tmp/ccOVOHaS.s:985: Warning: dwarf line number information for .data ignored
encrypt.c: /tmp/ccOVOHaS.s:988: Warning: dwarf line number information for .data ignored
encrypt.c: /tmp/ccOVOHaS.s:989: Warning: dwarf line number information for .data ignored
encrypt.c: /tmp/ccOVOHaS.s:996: Warning: dwarf line number information for .data ignored
encrypt.c: /tmp/ccOVOHaS.s:997: Warning: dwarf line number information for .data ignored
encrypt.c: /tmp/ccOVOHaS.s:1000: Warning: dwarf line number information for .data ignored
encrypt.c: /tmp/ccOVOHaS.s:1002: Warning: dwarf line number information for .data ignored
encrypt.c: /tmp/ccOVOHaS.s:1005: Warning: dwarf line number information for .data ignored
encrypt.c: /tmp/ccOVOHaS.s:1013: Warning: dwarf line number information for .data ignored
encrypt.c: /tmp/ccOVOHaS.s:1024: Warning: dwarf line number information for .data ignored
encrypt.c: /tmp/ccOVOHaS.s:1026: Warning: dwarf line number information for .data ignored
encrypt.c: /tmp/ccOVOHaS.s:1028: Warning: dwarf line number information for .data ignored
encrypt.c: /tmp/ccOVOHaS.s:1029: Warning: dwarf line number information for .data ignored
encrypt.c: /tmp/ccOVOHaS.s:1030: Warning: dwarf line number information for .data ignored
encrypt.c: /tmp/ccOVOHaS.s:1037: Warning: dwarf line number information for .data ignored
encrypt.c: /tmp/ccOVOHaS.s:1044: Warning: dwarf line number information for .data ignored
encrypt.c: /tmp/ccOVOHaS.s:1047: Warning: dwarf line number information for .data ignored
encrypt.c: /tmp/ccOVOHaS.s:1050: Warning: dwarf line number information for .data ignored
encrypt.c: ...

Number of similar (implementation,compiler) pairs: 1, namely:
ImplementationCompiler
T:sse4gcc -march=native -mtune=native -O3 -fwrapv -fPIC -fPIE -gdwarf-4 -Wall (11.4.0)

Compiler output


encrypt.c: /tmp/ccaNpYGb.s: Assembler messages:
encrypt.c: /tmp/ccaNpYGb.s:960: Warning: dwarf line number information for .data ignored
encrypt.c: /tmp/ccaNpYGb.s:962: Warning: dwarf line number information for .data ignored
encrypt.c: /tmp/ccaNpYGb.s:974: Warning: dwarf line number information for .data ignored
encrypt.c: /tmp/ccaNpYGb.s:975: Warning: dwarf line number information for .data ignored
encrypt.c: /tmp/ccaNpYGb.s:976: Warning: dwarf line number information for .data ignored
encrypt.c: /tmp/ccaNpYGb.s:983: Warning: dwarf line number information for .data ignored
encrypt.c: /tmp/ccaNpYGb.s:986: Warning: dwarf line number information for .data ignored
encrypt.c: /tmp/ccaNpYGb.s:987: Warning: dwarf line number information for .data ignored
encrypt.c: /tmp/ccaNpYGb.s:992: Warning: dwarf line number information for .data ignored
encrypt.c: /tmp/ccaNpYGb.s:993: Warning: dwarf line number information for .data ignored
encrypt.c: /tmp/ccaNpYGb.s:996: Warning: dwarf line number information for .data ignored
encrypt.c: /tmp/ccaNpYGb.s:998: Warning: dwarf line number information for .data ignored
encrypt.c: /tmp/ccaNpYGb.s:1001: Warning: dwarf line number information for .data ignored
encrypt.c: /tmp/ccaNpYGb.s:1009: Warning: dwarf line number information for .data ignored
encrypt.c: /tmp/ccaNpYGb.s:1019: Warning: dwarf line number information for .data ignored
encrypt.c: /tmp/ccaNpYGb.s:1021: Warning: dwarf line number information for .data ignored
encrypt.c: /tmp/ccaNpYGb.s:1034: Warning: dwarf line number information for .data ignored
encrypt.c: /tmp/ccaNpYGb.s:1038: Warning: dwarf line number information for .data ignored
encrypt.c: /tmp/ccaNpYGb.s:1039: Warning: dwarf line number information for .data ignored
encrypt.c: /tmp/ccaNpYGb.s:1040: Warning: dwarf line number information for .data ignored
encrypt.c: /tmp/ccaNpYGb.s:1047: Warning: dwarf line number information for .data ignored
encrypt.c: /tmp/ccaNpYGb.s:1050: Warning: dwarf line number information for .data ignored
encrypt.c: /tmp/ccaNpYGb.s:1053: Warning: dwarf line number information for .data ignored
encrypt.c: /tmp/ccaNpYGb.s:1056: Warning: dwarf line number information for .data ignored
encrypt.c: ...

Number of similar (implementation,compiler) pairs: 1, namely:
ImplementationCompiler
T:sse4gcc -march=native -mtune=native -O -fwrapv -fPIC -fPIE -gdwarf-4 -Wall (11.4.0)

Compiler output


encrypt.c: /tmp/ccFKttla.s: Assembler messages:
encrypt.c: /tmp/ccFKttla.s:960: Warning: dwarf line number information for .data ignored
encrypt.c: /tmp/ccFKttla.s:962: Warning: dwarf line number information for .data ignored
encrypt.c: /tmp/ccFKttla.s:964: Warning: dwarf line number information for .data ignored
encrypt.c: /tmp/ccFKttla.s:965: Warning: dwarf line number information for .data ignored
encrypt.c: /tmp/ccFKttla.s:966: Warning: dwarf line number information for .data ignored
encrypt.c: /tmp/ccFKttla.s:977: Warning: dwarf line number information for .data ignored
encrypt.c: /tmp/ccFKttla.s:984: Warning: dwarf line number information for .data ignored
encrypt.c: /tmp/ccFKttla.s:987: Warning: dwarf line number information for .data ignored
encrypt.c: /tmp/ccFKttla.s:988: Warning: dwarf line number information for .data ignored
encrypt.c: /tmp/ccFKttla.s:995: Warning: dwarf line number information for .data ignored
encrypt.c: /tmp/ccFKttla.s:996: Warning: dwarf line number information for .data ignored
encrypt.c: /tmp/ccFKttla.s:999: Warning: dwarf line number information for .data ignored
encrypt.c: /tmp/ccFKttla.s:1001: Warning: dwarf line number information for .data ignored
encrypt.c: /tmp/ccFKttla.s:1004: Warning: dwarf line number information for .data ignored
encrypt.c: /tmp/ccFKttla.s:1012: Warning: dwarf line number information for .data ignored
encrypt.c: /tmp/ccFKttla.s:1022: Warning: dwarf line number information for .data ignored
encrypt.c: /tmp/ccFKttla.s:1024: Warning: dwarf line number information for .data ignored
encrypt.c: /tmp/ccFKttla.s:1026: Warning: dwarf line number information for .data ignored
encrypt.c: /tmp/ccFKttla.s:1027: Warning: dwarf line number information for .data ignored
encrypt.c: /tmp/ccFKttla.s:1028: Warning: dwarf line number information for .data ignored
encrypt.c: /tmp/ccFKttla.s:1035: Warning: dwarf line number information for .data ignored
encrypt.c: /tmp/ccFKttla.s:1042: Warning: dwarf line number information for .data ignored
encrypt.c: /tmp/ccFKttla.s:1045: Warning: dwarf line number information for .data ignored
encrypt.c: /tmp/ccFKttla.s:1048: Warning: dwarf line number information for .data ignored
encrypt.c: ...

Number of similar (implementation,compiler) pairs: 1, namely:
ImplementationCompiler
T:sse4gcc -march=native -mtune=native -Os -fwrapv -fPIC -fPIE -gdwarf-4 -Wall (11.4.0)

Namespace violations


omdsha256.o calc_L_i T
omdsha256.o double_block T
omdsha256.o final_masking_associated_data T
omdsha256.o final_masking_message T
omdsha256.o hash T
omdsha256.o increment_masking_associated_data T
omdsha256.o increment_masking_message T
omdsha256.o key_func T
omdsha256.o l2b T
omdsha256.o ntz T
omdsha256.o omdsha256_process T
omdsha256.o triple_block T
omdsha256.o xor_block T
sha256.o sha256_comp T

Number of similar (implementation,compiler) pairs: 9, namely:
ImplementationCompiler
T:refclang -march=native -O2 -fwrapv -Qunused-arguments -fPIC -fPIE -gdwarf-4 -Wall (Ubuntu_Clang_14.0.0)
T:refclang -march=native -O3 -fwrapv -Qunused-arguments -fPIC -fPIE -gdwarf-4 -Wall (Ubuntu_Clang_14.0.0)
T:refclang -march=native -O -fwrapv -Qunused-arguments -fPIC -fPIE -gdwarf-4 -Wall (Ubuntu_Clang_14.0.0)
T:refclang -march=native -Os -fwrapv -Qunused-arguments -fPIC -fPIE -gdwarf-4 -Wall (Ubuntu_Clang_14.0.0)
T:refclang -mcpu=native -O3 -fwrapv -Qunused-arguments -fPIC -fPIE -gdwarf-4 -Wall (Ubuntu_Clang_14.0.0)
T:refgcc -march=native -mtune=native -O2 -fwrapv -fPIC -fPIE -gdwarf-4 -Wall (11.4.0)
T:refgcc -march=native -mtune=native -O3 -fwrapv -fPIC -fPIE -gdwarf-4 -Wall (11.4.0)
T:refgcc -march=native -mtune=native -O -fwrapv -fPIC -fPIE -gdwarf-4 -Wall (11.4.0)
T:refgcc -march=native -mtune=native -Os -fwrapv -fPIC -fPIE -gdwarf-4 -Wall (11.4.0)