Test results for amd64, alder2,1f626960,5600000, crypto_kem/titaniumccalite

[Page version: 20250324 16:19:50]

Measurements for amd64, alder2,1f626960,5600000, crypto_kem Test results for amd64, alder2,1f626960,5600000, crypto_kem Test results for crypto_kem/titaniumccalite
Computer: alder2,1f626960,5600000
Microarchitecture: amd64; Golden Cove (906a4-40)
Architecture: amd64
CPU ID: GenuineIntel-000906a4-40-bfebfbff
SUPERCOP version: 20250307
Operation: crypto_kem
Primitive: titaniumccalite
TimeObject sizeTest sizeImplementationCompilerBenchmark dateSUPERCOP version
149164372564 0 64193120 788 1848T:avx2gcc -march=native -mtune=native -O3 -fwrapv -fPIC -fPIE -gdwarf-4 -Wall2025032320250307
154466371045 0 64189736 788 1848T:avx2gcc -march=native -mtune=native -O2 -fwrapv -fPIC -fPIE -gdwarf-4 -Wall2025032320250307
155224071042 0 64189312 788 1848T:avx2gcc -march=native -mtune=native -O -fwrapv -fPIC -fPIE -gdwarf-4 -Wall2025032320250307
200783263964 0 36183768 820 1784T:optclang -march=native -O2 -fwrapv -Qunused-arguments -fPIC -fPIE -gdwarf-4 -Wall2025032320250307
200820574059 0 36194024 820 1784T:optclang -march=native -O3 -fwrapv -Qunused-arguments -fPIC -fPIE -gdwarf-4 -Wall2025032320250307
210589337558 0 36155222 812 1784T:optclang -march=native -Os -fwrapv -Qunused-arguments -fPIC -fPIE -gdwarf-4 -Wall2025032320250307
216379054685 0 36175000 820 1784T:optclang -mcpu=native -O3 -fwrapv -Qunused-arguments -fPIC -fPIE -gdwarf-4 -Wall2025032320250307
223597271424 0 64191752 788 1848T:optgcc -march=native -mtune=native -O3 -fwrapv -fPIC -fPIE -gdwarf-4 -Wall2025032320250307
224536639494 0 64158384 788 1848T:optgcc -march=native -mtune=native -O2 -fwrapv -fPIC -fPIE -gdwarf-4 -Wall2025032320250307
232936239633 0 64158080 788 1848T:optgcc -march=native -mtune=native -O -fwrapv -fPIC -fPIE -gdwarf-4 -Wall2025032320250307
27643083151727 0 64172080 788 1848T:refgcc -march=native -mtune=native -O3 -fwrapv -fPIC -fPIE -gdwarf-4 -Wall2025032320250307
27670379329445 0 64148200 788 1848T:refgcc -march=native -mtune=native -O2 -fwrapv -fPIC -fPIE -gdwarf-4 -Wall2025032320250307
27784439251943 0 36172200 820 1784T:refclang -mcpu=native -O3 -fwrapv -Qunused-arguments -fPIC -fPIE -gdwarf-4 -Wall2025032320250307
27937194072817 0 36193008 820 1784T:refclang -march=native -O3 -fwrapv -Qunused-arguments -fPIC -fPIE -gdwarf-4 -Wall2025032320250307
27950176738952 0 36158984 820 1784T:refclang -march=native -O2 -fwrapv -Qunused-arguments -fPIC -fPIE -gdwarf-4 -Wall2025032320250307
27986517729534 0 36147150 812 1784T:refclang -march=native -Os -fwrapv -Qunused-arguments -fPIC -fPIE -gdwarf-4 -Wall2025032320250307
27997435229971 0 36148014 812 1784T:refclang -march=native -O -fwrapv -Qunused-arguments -fPIC -fPIE -gdwarf-4 -Wall2025032320250307
28026038729651 0 64147968 788 1848T:refgcc -march=native -mtune=native -O -fwrapv -fPIC -fPIE -gdwarf-4 -Wall2025032320250307
61518594528189 0 64145320 780 1816T:refgcc -march=native -mtune=native -Os -fwrapv -fPIC -fPIE -gdwarf-4 -Wall2025032320250307

Compiler output


encrypt.c: In file included from encrypt.c:18:
encrypt.c: In file included from /usr/lib/llvm-11/lib/clang/11.0.1/include/x86intrin.h:13:
encrypt.c: /usr/lib/llvm-11/lib/clang/11.0.1/include/ia32intrin.h:210:16: error: expected identifier or '('
encrypt.c:   unsigned int D;
encrypt.c:                ^
encrypt.c: ./param.h:30:11: note: expanded from macro 'D'
encrypt.c: #define D 256
encrypt.c:           ^
encrypt.c: In file included from encrypt.c:18:
encrypt.c: In file included from /usr/lib/llvm-11/lib/clang/11.0.1/include/x86intrin.h:13:
encrypt.c: /usr/lib/llvm-11/lib/clang/11.0.1/include/ia32intrin.h:211:20: error: cannot take the address of an rvalue of type 'int'
encrypt.c:   __builtin_memcpy(&D, &__A, sizeof(__A));
encrypt.c:                    ^~
encrypt.c: /usr/lib/llvm-11/lib/clang/11.0.1/include/ia32intrin.h:227:22: error: expected identifier or '('
encrypt.c:   unsigned long long D;
encrypt.c:                      ^
encrypt.c: ./param.h:30:11: note: expanded from macro 'D'
encrypt.c: #define D 256
encrypt.c:           ^
encrypt.c: In file included from encrypt.c:18:
encrypt.c: In file included from /usr/lib/llvm-11/lib/clang/11.0.1/include/x86intrin.h:13:
encrypt.c: /usr/lib/llvm-11/lib/clang/11.0.1/include/ia32intrin.h:228:20: error: cannot take the address of an rvalue of type 'int'
encrypt.c:   __builtin_memcpy(&D, &__A, sizeof(__A));
encrypt.c:                    ^~
encrypt.c: /usr/lib/llvm-11/lib/clang/11.0.1/include/ia32intrin.h:244:9: error: expected identifier or '('
encrypt.c: ...

Number of similar (implementation,compiler) pairs: 5, namely:
ImplementationCompiler
T:avx2clang -march=native -O2 -fwrapv -Qunused-arguments -fPIC -fPIE -gdwarf-4 -Wall (Debian_Clang_11.0.1)
T:avx2clang -march=native -O3 -fwrapv -Qunused-arguments -fPIC -fPIE -gdwarf-4 -Wall (Debian_Clang_11.0.1)
T:avx2clang -march=native -O -fwrapv -Qunused-arguments -fPIC -fPIE -gdwarf-4 -Wall (Debian_Clang_11.0.1)
T:avx2clang -march=native -Os -fwrapv -Qunused-arguments -fPIC -fPIE -gdwarf-4 -Wall (Debian_Clang_11.0.1)
T:avx2clang -mcpu=native -O3 -fwrapv -Qunused-arguments -fPIC -fPIE -gdwarf-4 -Wall (Debian_Clang_11.0.1)

Compiler output


try.c: /usr/bin/ld: libcrypto_kem_titaniumccalite.a(sampler.o): in function `sampler_zq':
try.c: .../supercop-data/alder2,1f626960,5600000/amd64/try/c/gcc_-march=native_-mtune=native_-Os_-fwrapv_-fPIC_-fPIE_-gdwarf-4_-Wall/timingleaks/crypto_kem/titaniumccalite/avx2/work/sampler.c:160: undefined reference to `barrett_zq'
try.c: collect2: error: ld returned 1 exit status

Number of similar (implementation,compiler) pairs: 1, namely:
ImplementationCompiler
T:avx2gcc -march=native -mtune=native -Os -fwrapv -fPIC -fPIE -gdwarf-4 -Wall (10.2.1_20210110)

Compiler output


try.c: /usr/bin/ld: libcrypto_kem_titaniumccalite.a(encrypt.o): in function `crypto_encrypt_keypair':
try.c: .../supercop-data/alder2,1f626960,5600000/amd64/try/c/clang_-march=native_-O_-fwrapv_-Qunused-arguments_-fPIC_-fPIE_-gdwarf-4_-Wall/timingleaks/crypto_kem/titaniumccalite/opt/work/encrypt.c:56: undefined reference to `barrett_4q2'
try.c: /usr/bin/ld: .../supercop-data/alder2,1f626960,5600000/amd64/try/c/clang_-march=native_-O_-fwrapv_-Qunused-arguments_-fPIC_-fPIE_-gdwarf-4_-Wall/timingleaks/crypto_kem/titaniumccalite/opt/work/encrypt.c:64: undefined reference to `barrett_4q'
try.c: /usr/bin/ld: libcrypto_kem_titaniumccalite.a(encrypt.o): in function `crypto_encrypt':
try.c: .../supercop-data/alder2,1f626960,5600000/amd64/try/c/clang_-march=native_-O_-fwrapv_-Qunused-arguments_-fPIC_-fPIE_-gdwarf-4_-Wall/timingleaks/crypto_kem/titaniumccalite/opt/work/encrypt.c:146: undefined reference to `barrett_4q2'
try.c: /usr/bin/ld: .../supercop-data/alder2,1f626960,5600000/amd64/try/c/clang_-march=native_-O_-fwrapv_-Qunused-arguments_-fPIC_-fPIE_-gdwarf-4_-Wall/timingleaks/crypto_kem/titaniumccalite/opt/work/encrypt.c:156: undefined reference to `barrett_4q2'
try.c: /usr/bin/ld: libcrypto_kem_titaniumccalite.a(encrypt.o): in function `crypto_encrypt_open':
try.c: .../supercop-data/alder2,1f626960,5600000/amd64/try/c/clang_-march=native_-O_-fwrapv_-Qunused-arguments_-fPIC_-fPIE_-gdwarf-4_-Wall/timingleaks/crypto_kem/titaniumccalite/opt/work/encrypt.c:200: undefined reference to `barrett_4q2'
try.c: /usr/bin/ld: libcrypto_kem_titaniumccalite.a(ntt.o): in function `ntt_core':
try.c: .../supercop-data/alder2,1f626960,5600000/amd64/try/c/clang_-march=native_-O_-fwrapv_-Qunused-arguments_-fPIC_-fPIE_-gdwarf-4_-Wall/timingleaks/crypto_kem/titaniumccalite/opt/work/ntt.c:288: undefined reference to `barrett_2q2'
try.c: /usr/bin/ld: libcrypto_kem_titaniumccalite.a(ntt.o): in function `ntt_butterfly_1024_1536':
try.c: .../supercop-data/alder2,1f626960,5600000/amd64/try/c/clang_-march=native_-O_-fwrapv_-Qunused-arguments_-fPIC_-fPIE_-gdwarf-4_-Wall/timingleaks/crypto_kem/titaniumccalite/opt/work/ntt.c:342: undefined reference to `barrett_8q'
try.c: /usr/bin/ld: libcrypto_kem_titaniumccalite.a(ntt.o): in function `intt_core':
try.c: .../supercop-data/alder2,1f626960,5600000/amd64/try/c/clang_-march=native_-O_-fwrapv_-Qunused-arguments_-fPIC_-fPIE_-gdwarf-4_-Wall/timingleaks/crypto_kem/titaniumccalite/opt/work/ntt.c:316: undefined reference to `barrett_2q2'
try.c: /usr/bin/ld: .../supercop-data/alder2,1f626960,5600000/amd64/try/c/clang_-march=native_-O_-fwrapv_-Qunused-arguments_-fPIC_-fPIE_-gdwarf-4_-Wall/timingleaks/crypto_kem/titaniumccalite/opt/work/ntt.c:328: undefined reference to `barrett_2q2'
try.c: /usr/bin/ld: libcrypto_kem_titaniumccalite.a(ntt.o): in function `ntt_butterfly_1536_768':
try.c: .../supercop-data/alder2,1f626960,5600000/amd64/try/c/clang_-march=native_-O_-fwrapv_-Qunused-arguments_-fPIC_-fPIE_-gdwarf-4_-Wall/timingleaks/crypto_kem/titaniumccalite/opt/work/ntt.c:362: undefined reference to `barrett_16q'
try.c: /usr/bin/ld: libcrypto_kem_titaniumccalite.a(ntt.o): in function `ntt_butterfly_512_1280':
try.c: .../supercop-data/alder2,1f626960,5600000/amd64/try/c/clang_-march=native_-O_-fwrapv_-Qunused-arguments_-fPIC_-fPIE_-gdwarf-4_-Wall/timingleaks/crypto_kem/titaniumccalite/opt/work/ntt.c:375: undefined reference to `barrett_4q'
try.c: /usr/bin/ld: libcrypto_kem_titaniumccalite.a(ntt.o): in function `ntt_butterfly_1024_1280':
try.c: .../supercop-data/alder2,1f626960,5600000/amd64/try/c/clang_-march=native_-O_-fwrapv_-Qunused-arguments_-fPIC_-fPIE_-gdwarf-4_-Wall/timingleaks/crypto_kem/titaniumccalite/opt/work/ntt.c:392: undefined reference to `barrett_8q'
try.c: /usr/bin/ld: libcrypto_kem_titaniumccalite.a(ntt.o): in function `ntt_butterfly_1280_1280_inv':
try.c: .../supercop-data/alder2,1f626960,5600000/amd64/try/c/clang_-march=native_-O_-fwrapv_-Qunused-arguments_-fPIC_-fPIE_-gdwarf-4_-Wall/timingleaks/crypto_kem/titaniumccalite/opt/work/ntt.c:410: undefined reference to `barrett_16q'
try.c: /usr/bin/ld: libcrypto_kem_titaniumccalite.a(ntt.o): in function `ntt_butterfly_768_768_inv':
try.c: .../supercop-data/alder2,1f626960,5600000/amd64/try/c/clang_-march=native_-O_-fwrapv_-Qunused-arguments_-fPIC_-fPIE_-gdwarf-4_-Wall/timingleaks/crypto_kem/titaniumccalite/opt/work/ntt.c:426: undefined reference to `barrett_8q'
try.c: ...

Number of similar (implementation,compiler) pairs: 1, namely:
ImplementationCompiler
T:optclang -march=native -O -fwrapv -Qunused-arguments -fPIC -fPIE -gdwarf-4 -Wall (Debian_Clang_11.0.1)

Compiler output


try.c: /usr/bin/ld: libcrypto_kem_titaniumccalite.a(encrypt.o): in function `crypto_encrypt_keypair':
try.c: .../supercop-data/alder2,1f626960,5600000/amd64/try/c/gcc_-march=native_-mtune=native_-Os_-fwrapv_-fPIC_-fPIE_-gdwarf-4_-Wall/timingleaks/crypto_kem/titaniumccalite/opt/work/encrypt.c:56: undefined reference to `barrett_4q2'
try.c: /usr/bin/ld: .../supercop-data/alder2,1f626960,5600000/amd64/try/c/gcc_-march=native_-mtune=native_-Os_-fwrapv_-fPIC_-fPIE_-gdwarf-4_-Wall/timingleaks/crypto_kem/titaniumccalite/opt/work/encrypt.c:64: undefined reference to `barrett_4q'
try.c: /usr/bin/ld: libcrypto_kem_titaniumccalite.a(encrypt.o): in function `crypto_encrypt':
try.c: .../supercop-data/alder2,1f626960,5600000/amd64/try/c/gcc_-march=native_-mtune=native_-Os_-fwrapv_-fPIC_-fPIE_-gdwarf-4_-Wall/timingleaks/crypto_kem/titaniumccalite/opt/work/encrypt.c:146: undefined reference to `barrett_4q2'
try.c: /usr/bin/ld: .../supercop-data/alder2,1f626960,5600000/amd64/try/c/gcc_-march=native_-mtune=native_-Os_-fwrapv_-fPIC_-fPIE_-gdwarf-4_-Wall/timingleaks/crypto_kem/titaniumccalite/opt/work/encrypt.c:156: undefined reference to `barrett_4q2'
try.c: /usr/bin/ld: libcrypto_kem_titaniumccalite.a(encrypt.o): in function `crypto_encrypt_open':
try.c: .../supercop-data/alder2,1f626960,5600000/amd64/try/c/gcc_-march=native_-mtune=native_-Os_-fwrapv_-fPIC_-fPIE_-gdwarf-4_-Wall/timingleaks/crypto_kem/titaniumccalite/opt/work/encrypt.c:200: undefined reference to `barrett_4q2'
try.c: /usr/bin/ld: libcrypto_kem_titaniumccalite.a(ntt.o): in function `ntt_butterfly_1024_1536':
try.c: .../supercop-data/alder2,1f626960,5600000/amd64/try/c/gcc_-march=native_-mtune=native_-Os_-fwrapv_-fPIC_-fPIE_-gdwarf-4_-Wall/timingleaks/crypto_kem/titaniumccalite/opt/work/ntt.c:342: undefined reference to `barrett_8q'
try.c: /usr/bin/ld: libcrypto_kem_titaniumccalite.a(ntt.o): in function `ntt_butterfly_1536_768':
try.c: .../supercop-data/alder2,1f626960,5600000/amd64/try/c/gcc_-march=native_-mtune=native_-Os_-fwrapv_-fPIC_-fPIE_-gdwarf-4_-Wall/timingleaks/crypto_kem/titaniumccalite/opt/work/ntt.c:362: undefined reference to `barrett_16q'
try.c: /usr/bin/ld: libcrypto_kem_titaniumccalite.a(ntt.o): in function `ntt_butterfly_512_1280':
try.c: .../supercop-data/alder2,1f626960,5600000/amd64/try/c/gcc_-march=native_-mtune=native_-Os_-fwrapv_-fPIC_-fPIE_-gdwarf-4_-Wall/timingleaks/crypto_kem/titaniumccalite/opt/work/ntt.c:375: undefined reference to `barrett_4q'
try.c: /usr/bin/ld: libcrypto_kem_titaniumccalite.a(ntt.o): in function `ntt_butterfly_1024_1280':
try.c: .../supercop-data/alder2,1f626960,5600000/amd64/try/c/gcc_-march=native_-mtune=native_-Os_-fwrapv_-fPIC_-fPIE_-gdwarf-4_-Wall/timingleaks/crypto_kem/titaniumccalite/opt/work/ntt.c:392: undefined reference to `barrett_8q'
try.c: /usr/bin/ld: libcrypto_kem_titaniumccalite.a(ntt.o): in function `ntt_butterfly_1280_1280_inv':
try.c: .../supercop-data/alder2,1f626960,5600000/amd64/try/c/gcc_-march=native_-mtune=native_-Os_-fwrapv_-fPIC_-fPIE_-gdwarf-4_-Wall/timingleaks/crypto_kem/titaniumccalite/opt/work/ntt.c:410: undefined reference to `barrett_16q'
try.c: /usr/bin/ld: libcrypto_kem_titaniumccalite.a(ntt.o): in function `ntt_butterfly_768_768_inv':
try.c: .../supercop-data/alder2,1f626960,5600000/amd64/try/c/gcc_-march=native_-mtune=native_-Os_-fwrapv_-fPIC_-fPIE_-gdwarf-4_-Wall/timingleaks/crypto_kem/titaniumccalite/opt/work/ntt.c:426: undefined reference to `barrett_8q'
try.c: /usr/bin/ld: libcrypto_kem_titaniumccalite.a(ntt.o): in function `ntt_butterfly_512_768':
try.c: .../supercop-data/alder2,1f626960,5600000/amd64/try/c/gcc_-march=native_-mtune=native_-Os_-fwrapv_-fPIC_-fPIE_-gdwarf-4_-Wall/timingleaks/crypto_kem/titaniumccalite/opt/work/ntt.c:439: undefined reference to `barrett_4q'
try.c: /usr/bin/ld: libcrypto_kem_titaniumccalite.a(ntt.o): in function `ntt_butterfly_768_256':
try.c: .../supercop-data/alder2,1f626960,5600000/amd64/try/c/gcc_-march=native_-mtune=native_-Os_-fwrapv_-fPIC_-fPIE_-gdwarf-4_-Wall/timingleaks/crypto_kem/titaniumccalite/opt/work/ntt.c:447: undefined reference to `barrett_8q'
try.c: /usr/bin/ld: libcrypto_kem_titaniumccalite.a(ntt.o): in function `ntt_butterfly_1280_1536':
try.c: ...

Number of similar (implementation,compiler) pairs: 1, namely:
ImplementationCompiler
T:optgcc -march=native -mtune=native -Os -fwrapv -fPIC -fPIE -gdwarf-4 -Wall (10.2.1_20210110)

Namespace violations


encrypt.o crypto_encrypt T
encrypt.o crypto_encrypt_keypair T
encrypt.o crypto_encrypt_open T
fastrandombytes.o fastrandombytes T
fastrandombytes.o fastrandombytes_setseed T
fastrandombytes.o iv B
fastrandombytes.o key B
ntt.o intt_1280_1280_inv T
ntt.o intt_1536_256 T
ntt.o intt_1536_768 T
ntt.o intt_768_256 T
ntt.o ntt_1024_1280 T
ntt.o ntt_1024_1536 T
ntt.o ntt_1280_1536 T
ntt.o ntt_512_1280 T
ntt.o ntt_512_768 T
ntt.o ntt_768_768_inv T
pack.o poly_decode T
pack.o poly_decode_c2 T
pack.o poly_encode T
pack.o poly_encode_c2 T
sampler.o sampler_binomial T
sampler.o sampler_zb T
sampler.o sampler_zq T

Number of similar (implementation,compiler) pairs: 10, namely:
ImplementationCompiler
T:avx2gcc -march=native -mtune=native -O2 -fwrapv -fPIC -fPIE -gdwarf-4 -Wall (10.2.1_20210110)
T:avx2gcc -march=native -mtune=native -O3 -fwrapv -fPIC -fPIE -gdwarf-4 -Wall (10.2.1_20210110)
T:avx2gcc -march=native -mtune=native -O -fwrapv -fPIC -fPIE -gdwarf-4 -Wall (10.2.1_20210110)
T:optclang -march=native -O2 -fwrapv -Qunused-arguments -fPIC -fPIE -gdwarf-4 -Wall (Debian_Clang_11.0.1)
T:optclang -march=native -O3 -fwrapv -Qunused-arguments -fPIC -fPIE -gdwarf-4 -Wall (Debian_Clang_11.0.1)
T:optclang -march=native -Os -fwrapv -Qunused-arguments -fPIC -fPIE -gdwarf-4 -Wall (Debian_Clang_11.0.1)
T:optclang -mcpu=native -O3 -fwrapv -Qunused-arguments -fPIC -fPIE -gdwarf-4 -Wall (Debian_Clang_11.0.1)
T:optgcc -march=native -mtune=native -O2 -fwrapv -fPIC -fPIE -gdwarf-4 -Wall (10.2.1_20210110)
T:optgcc -march=native -mtune=native -O3 -fwrapv -fPIC -fPIE -gdwarf-4 -Wall (10.2.1_20210110)
T:optgcc -march=native -mtune=native -O -fwrapv -fPIC -fPIE -gdwarf-4 -Wall (10.2.1_20210110)

Namespace violations


encrypt.o crypto_encrypt T
encrypt.o crypto_encrypt_keypair T
encrypt.o crypto_encrypt_open T
fastrandombytes.o fastrandombytes T
fastrandombytes.o fastrandombytes_setseed T
fastrandombytes.o iv B
fastrandombytes.o key B
ntt.o intt_1280_1280_inv T
ntt.o intt_1536_1536 T
ntt.o intt_768_768 T
ntt.o ntt_1280_1280 T
ntt.o ntt_768_768_inv T
pack.o poly_decode T
pack.o poly_decode_c2 T
pack.o poly_encode T
pack.o poly_encode_c2 T
product.o mp T
product.o product T
sampler.o sampler_binomial T
sampler.o sampler_zb T
sampler.o sampler_zq T

Number of similar (implementation,compiler) pairs: 9, namely:
ImplementationCompiler
T:refclang -march=native -O2 -fwrapv -Qunused-arguments -fPIC -fPIE -gdwarf-4 -Wall (Debian_Clang_11.0.1)
T:refclang -march=native -O3 -fwrapv -Qunused-arguments -fPIC -fPIE -gdwarf-4 -Wall (Debian_Clang_11.0.1)
T:refclang -march=native -O -fwrapv -Qunused-arguments -fPIC -fPIE -gdwarf-4 -Wall (Debian_Clang_11.0.1)
T:refclang -march=native -Os -fwrapv -Qunused-arguments -fPIC -fPIE -gdwarf-4 -Wall (Debian_Clang_11.0.1)
T:refclang -mcpu=native -O3 -fwrapv -Qunused-arguments -fPIC -fPIE -gdwarf-4 -Wall (Debian_Clang_11.0.1)
T:refgcc -march=native -mtune=native -O2 -fwrapv -fPIC -fPIE -gdwarf-4 -Wall (10.2.1_20210110)
T:refgcc -march=native -mtune=native -O3 -fwrapv -fPIC -fPIE -gdwarf-4 -Wall (10.2.1_20210110)
T:refgcc -march=native -mtune=native -O -fwrapv -fPIC -fPIE -gdwarf-4 -Wall (10.2.1_20210110)
T:refgcc -march=native -mtune=native -Os -fwrapv -fPIC -fPIE -gdwarf-4 -Wall (10.2.1_20210110)