Implementation notes: amd64, alder2,1f626960,5600000, crypto_hash/k12

Computer: alder2,1f626960,5600000
Microarchitecture: amd64; Golden Cove (906a4-40)
Architecture: amd64
CPU ID: GenuineIntel-000906a4-40-bfebfbff
SUPERCOP version: 20240425
Operation: crypto_hash
Primitive: k12
TimeObject sizeTest sizeImplementationCompilerBenchmark dateSUPERCOP version
436929370 0 040496 780 952T:kcp/optimized1600u6gcc_-march=native_-mtune=native_-O2_-fomit-frame-pointer_-fwrapv_-fPIC_-fPIE2024042720240425
437757848 0 067595 756 920T:kcp/optimized1600ufullgcc_-march=native_-mtune=native_-Os_-fomit-frame-pointer_-fwrapv_-fPIC_-fPIE2024042720240425
440830482 0 043320 812 920T:kcp/optimized1600u6clang_-march=native_-O2_-fomit-frame-pointer_-fwrapv_-Qunused-arguments_-fPIC_-fPIE2024042720240425
442526789 0 036539 756 920T:kcp/optimized1600u6gcc_-march=native_-mtune=native_-Os_-fomit-frame-pointer_-fwrapv_-fPIC_-fPIE2024042720240425
444128931 0 039630 804 888T:kcp/optimized1600u6clang_-march=native_-O_-fomit-frame-pointer_-fwrapv_-Qunused-arguments_-fPIC_-fPIE2024042720240425
444560430 0 071248 780 952T:kcp/optimized1600ufullgcc_-march=native_-mtune=native_-O_-fomit-frame-pointer_-fwrapv_-fPIC_-fPIE2024042720240425
445130682 0 043664 812 920T:kcp/optimized1600u6clang_-march=native_-O3_-fomit-frame-pointer_-fwrapv_-Qunused-arguments_-fPIC_-fPIE2024042720240425
450666309 0 079440 780 952T:kcp/optimized1600ufullgcc_-march=native_-mtune=native_-O3_-fomit-frame-pointer_-fwrapv_-fPIC_-fPIE2024042720240425
452061691 0 072816 780 952T:kcp/optimized1600ufullgcc_-march=native_-mtune=native_-O2_-fomit-frame-pointer_-fwrapv_-fPIC_-fPIE2024042720240425
453033236 0 046368 780 952T:kcp/optimized1600u6gcc_-march=native_-mtune=native_-O3_-fomit-frame-pointer_-fwrapv_-fPIC_-fPIE2024042720240425
455063680 0 076520 812 920T:kcp/optimized1600ufullclang_-march=native_-O2_-fomit-frame-pointer_-fwrapv_-Qunused-arguments_-fPIC_-fPIE2024042720240425
455328525 0 039328 780 952T:kcp/optimized1600u6gcc_-march=native_-mtune=native_-O_-fomit-frame-pointer_-fwrapv_-fPIC_-fPIE2024042720240425
458163880 0 076864 812 920T:kcp/optimized1600ufullclang_-march=native_-O3_-fomit-frame-pointer_-fwrapv_-Qunused-arguments_-fPIC_-fPIE2024042720240425
461262049 0 072750 804 888T:kcp/optimized1600ufullclang_-march=native_-O_-fomit-frame-pointer_-fwrapv_-Qunused-arguments_-fPIC_-fPIE2024042720240425
461661757 0 072190 804 888T:kcp/optimized1600ufullclang_-march=native_-Os_-fomit-frame-pointer_-fwrapv_-Qunused-arguments_-fPIC_-fPIE2024042720240425
462728335 0 038766 804 888T:kcp/optimized1600u6clang_-march=native_-Os_-fomit-frame-pointer_-fwrapv_-Qunused-arguments_-fPIC_-fPIE2024042720240425
483078077 0 090920 812 888T:kcp/optimized1600AsmX86-64shldclang_-mcpu=native_-O3_-fomit-frame-pointer_-fwrapv_-Qunused-arguments_-fPIC_-fPIE2024042720240425
490429225 0 039967 772 952T:kcp/optimized1600lcu6gcc_-march=native_-mtune=native_-O_-fomit-frame-pointer_-fwrapv_-fPIC_-fPIE2024042720240425
493859764 0 069523 756 920T:kcp/optimized1600lcufullgcc_-march=native_-mtune=native_-Os_-fomit-frame-pointer_-fwrapv_-fPIC_-fPIE2024042720240425
499530135 0 041272 780 952T:kcp/optimized1600lcu6gcc_-march=native_-mtune=native_-O2_-fomit-frame-pointer_-fwrapv_-fPIC_-fPIE2024042720240425
500163661 0 074792 780 952T:kcp/optimized1600lcufullgcc_-march=native_-mtune=native_-O2_-fomit-frame-pointer_-fwrapv_-fPIC_-fPIE2024042720240425
501262807 0 073551 772 952T:kcp/optimized1600lcufullgcc_-march=native_-mtune=native_-O_-fomit-frame-pointer_-fwrapv_-fPIC_-fPIE2024042720240425
509466065 0 078904 812 920T:kcp/optimized1600lcufullclang_-march=native_-O2_-fomit-frame-pointer_-fwrapv_-Qunused-arguments_-fPIC_-fPIE2024042720240425
509733184 0 046160 812 920T:kcp/optimized1600lcu6clang_-march=native_-O3_-fomit-frame-pointer_-fwrapv_-Qunused-arguments_-fPIC_-fPIE2024042720240425
510363413 0 074568 780 952T:kcp/optimized1600lcufullshldgcc_-march=native_-mtune=native_-O2_-fomit-frame-pointer_-fwrapv_-fPIC_-fPIE2024042720240425
512935152 0 048288 780 952T:kcp/optimized1600lcu6gcc_-march=native_-mtune=native_-O3_-fomit-frame-pointer_-fwrapv_-fPIC_-fPIE2024042720240425
514577792 0 088334 804 888T:kcp/optimized1600AsmX86-64shldclang_-march=native_-O_-fomit-frame-pointer_-fwrapv_-Qunused-arguments_-fPIC_-fPIE2024042720240425
515174475 0 084766 804 888T:kcp/optimized1600AsmX86-64clang_-march=native_-Os_-fomit-frame-pointer_-fwrapv_-Qunused-arguments_-fPIC_-fPIE2024042720240425
515275133 0 087960 812 920T:kcp/optimized1600AsmX86-64clang_-march=native_-O3_-fomit-frame-pointer_-fwrapv_-Qunused-arguments_-fPIC_-fPIE2024042720240425
518769096 0 082224 780 952T:kcp/optimized1600lcufullgcc_-march=native_-mtune=native_-O3_-fomit-frame-pointer_-fwrapv_-fPIC_-fPIE2024042720240425
519674848 0 085390 804 888T:kcp/optimized1600AsmX86-64clang_-march=native_-O_-fomit-frame-pointer_-fwrapv_-Qunused-arguments_-fPIC_-fPIE2024042720240425
519963893 0 074326 804 888T:kcp/optimized1600lcufullclang_-march=native_-Os_-fomit-frame-pointer_-fwrapv_-Qunused-arguments_-fPIC_-fPIE2024042720240425
520458695 0 068451 756 920T:kcp/optimized1600lcufullshldgcc_-march=native_-mtune=native_-Os_-fomit-frame-pointer_-fwrapv_-fPIC_-fPIE2024042720240425
522178077 0 090904 812 920T:kcp/optimized1600AsmX86-64shldclang_-march=native_-O3_-fomit-frame-pointer_-fwrapv_-Qunused-arguments_-fPIC_-fPIE2024042720240425
522227774 0 037523 756 920T:kcp/optimized1600lcu6gcc_-march=native_-mtune=native_-Os_-fomit-frame-pointer_-fwrapv_-fPIC_-fPIE2024042720240425
523262832 0 073254 804 888T:kcp/optimized1600lcufullshldclang_-march=native_-Os_-fomit-frame-pointer_-fwrapv_-Qunused-arguments_-fPIC_-fPIE2024042720240425
524733250 0 046248 812 888T:kcp/optimized1600lcu6clang_-mcpu=native_-O3_-fomit-frame-pointer_-fwrapv_-Qunused-arguments_-fPIC_-fPIE2024042720240425
525975013 0 087696 812 920T:kcp/optimized1600AsmX86-64clang_-march=native_-O2_-fomit-frame-pointer_-fwrapv_-Qunused-arguments_-fPIC_-fPIE2024042720240425
525977419 0 087710 804 888T:kcp/optimized1600AsmX86-64shldclang_-march=native_-Os_-fomit-frame-pointer_-fwrapv_-Qunused-arguments_-fPIC_-fPIE2024042720240425
527068741 0 081904 780 952T:kcp/optimized1600lcufullshldgcc_-march=native_-mtune=native_-O3_-fomit-frame-pointer_-fwrapv_-fPIC_-fPIE2024042720240425
527964996 0 077968 812 920T:kcp/optimized1600lcufullshldclang_-march=native_-O3_-fomit-frame-pointer_-fwrapv_-Qunused-arguments_-fPIC_-fPIE2024042720240425
530677957 0 090640 812 920T:kcp/optimized1600AsmX86-64shldclang_-march=native_-O2_-fomit-frame-pointer_-fwrapv_-Qunused-arguments_-fPIC_-fPIE2024042720240425
531866265 0 079248 812 920T:kcp/optimized1600lcufullclang_-march=native_-O3_-fomit-frame-pointer_-fwrapv_-Qunused-arguments_-fPIC_-fPIE2024042720240425
532463802 0 074502 804 888T:kcp/optimized1600lcufullclang_-march=native_-O_-fomit-frame-pointer_-fwrapv_-Qunused-arguments_-fPIC_-fPIE2024042720240425
539175133 0 087976 812 888T:kcp/optimized1600AsmX86-64clang_-mcpu=native_-O3_-fomit-frame-pointer_-fwrapv_-Qunused-arguments_-fPIC_-fPIE2024042720240425
540964796 0 077624 812 920T:kcp/optimized1600lcufullshldclang_-march=native_-O2_-fomit-frame-pointer_-fwrapv_-Qunused-arguments_-fPIC_-fPIE2024042720240425
551162517 0 073206 804 888T:kcp/optimized1600lcufullshldclang_-march=native_-O_-fomit-frame-pointer_-fwrapv_-Qunused-arguments_-fPIC_-fPIE2024042720240425
553267324 0 080320 812 888T:kcp/optimized1600lcufullshldclang_-mcpu=native_-O3_-fomit-frame-pointer_-fwrapv_-Qunused-arguments_-fPIC_-fPIE2024042720240425
557332984 0 045816 812 920T:kcp/optimized1600lcu6clang_-march=native_-O2_-fomit-frame-pointer_-fwrapv_-Qunused-arguments_-fPIC_-fPIE2024042720240425
558730737 0 041430 804 888T:kcp/optimized1600lcu6clang_-march=native_-O_-fomit-frame-pointer_-fwrapv_-Qunused-arguments_-fPIC_-fPIE2024042720240425
562030642 0 041078 804 888T:kcp/optimized1600lcu6clang_-march=native_-Os_-fomit-frame-pointer_-fwrapv_-Qunused-arguments_-fPIC_-fPIE2024042720240425
562262098 0 072863 772 952T:kcp/optimized1600lcufullshldgcc_-march=native_-mtune=native_-O_-fomit-frame-pointer_-fwrapv_-fPIC_-fPIE2024042720240425
571033524 0 046520 812 888T:kcp/optimized1600u6clang_-mcpu=native_-O3_-fomit-frame-pointer_-fwrapv_-Qunused-arguments_-fPIC_-fPIE2024042720240425
583765835 0 078832 812 888T:kcp/optimized1600lcufullclang_-mcpu=native_-O3_-fomit-frame-pointer_-fwrapv_-Qunused-arguments_-fPIC_-fPIE2024042720240425
654669190 0 082184 812 888T:kcp/optimized1600ufullclang_-mcpu=native_-O3_-fomit-frame-pointer_-fwrapv_-Qunused-arguments_-fPIC_-fPIE2024042720240425
659010260 0 023224 812 920T:kcp/compact1600clang_-march=native_-O3_-fomit-frame-pointer_-fwrapv_-Qunused-arguments_-fPIC_-fPIE2024042720240425
698810081 0 023203 828 888T:kcp/reference1600clang_-mcpu=native_-O3_-fomit-frame-pointer_-fwrapv_-Qunused-arguments_-fPIC_-fPIE2024042720240425
757911323 0 024312 812 888T:kcp/compact1600clang_-mcpu=native_-O3_-fomit-frame-pointer_-fwrapv_-Qunused-arguments_-fPIC_-fPIE2024042720240425
91009912 0 022907 828 920T:kcp/reference1600clang_-march=native_-O2_-fomit-frame-pointer_-fwrapv_-Qunused-arguments_-fPIC_-fPIE2024042720240425
98179984 0 023107 828 920T:kcp/reference1600clang_-march=native_-O3_-fomit-frame-pointer_-fwrapv_-Qunused-arguments_-fPIC_-fPIE2024042720240425
1160216684 0 027504 780 952T:kcp/inplace1600bigcc_-march=native_-mtune=native_-O_-fomit-frame-pointer_-fwrapv_-fPIC_-fPIE2024042720240425
1169415043 0 028152 780 952T:kcp/compact1600gcc_-march=native_-mtune=native_-O3_-fomit-frame-pointer_-fwrapv_-fPIC_-fPIE2024042720240425
127779788 0 022624 812 920T:kcp/compact1600clang_-march=native_-O2_-fomit-frame-pointer_-fwrapv_-Qunused-arguments_-fPIC_-fPIE2024042720240425
1319116841 0 026619 756 920T:kcp/inplace1600bigcc_-march=native_-mtune=native_-Os_-fomit-frame-pointer_-fwrapv_-fPIC_-fPIE2024042720240425
1346228350 0 041496 780 952T:kcp/inplace1600bigcc_-march=native_-mtune=native_-O3_-fomit-frame-pointer_-fwrapv_-fPIC_-fPIE2024042720240425
1496717319 0 028022 804 888T:kcp/inplace1600biclang_-march=native_-O_-fomit-frame-pointer_-fwrapv_-Qunused-arguments_-fPIC_-fPIE2024042720240425
1516723195 0 035912 812 888T:kcp/inplace1600biclang_-mcpu=native_-O3_-fomit-frame-pointer_-fwrapv_-Qunused-arguments_-fPIC_-fPIE2024042720240425
1528324099 0 037040 812 920T:kcp/inplace1600biclang_-march=native_-O3_-fomit-frame-pointer_-fwrapv_-Qunused-arguments_-fPIC_-fPIE2024042720240425
1564023755 0 036568 812 920T:kcp/inplace1600biclang_-march=native_-O2_-fomit-frame-pointer_-fwrapv_-Qunused-arguments_-fPIC_-fPIE2024042720240425
1584919620 0 030760 780 952T:kcp/inplace1600bigcc_-march=native_-mtune=native_-O2_-fomit-frame-pointer_-fwrapv_-fPIC_-fPIE2024042720240425
1719318986 0 029446 804 888T:kcp/inplace1600biclang_-march=native_-Os_-fomit-frame-pointer_-fwrapv_-Qunused-arguments_-fPIC_-fPIE2024042720240425
218967233 0 017918 804 888T:kcp/compact1600clang_-march=native_-O_-fomit-frame-pointer_-fwrapv_-Qunused-arguments_-fPIC_-fPIE2024042720240425
226209346 0 022587 796 952T:kcp/reference1600gcc_-march=native_-mtune=native_-O3_-fomit-frame-pointer_-fwrapv_-fPIC_-fPIE2024042720240425
248538152 0 019272 780 952T:kcp/compact1600gcc_-march=native_-mtune=native_-O2_-fomit-frame-pointer_-fwrapv_-fPIC_-fPIE2024042720240425
251766295 0 016051 756 920T:kcp/compact1600gcc_-march=native_-mtune=native_-Os_-fomit-frame-pointer_-fwrapv_-fPIC_-fPIE2024042720240425
284597142 0 017944 780 952T:kcp/compact1600gcc_-march=native_-mtune=native_-O_-fomit-frame-pointer_-fwrapv_-fPIC_-fPIE2024042720240425
296316530 0 016918 804 888T:kcp/compact1600clang_-march=native_-Os_-fomit-frame-pointer_-fwrapv_-Qunused-arguments_-fPIC_-fPIE2024042720240425
4061825253 0 034611 828 920T:kcp/reference1600-32bitsclang_-march=native_-O3_-fomit-frame-pointer_-fwrapv_-Qunused-arguments_-fPIC_-fPIE2024042720240425
512518218 0 019086 820 888T:kcp/reference1600clang_-march=native_-O_-fomit-frame-pointer_-fwrapv_-Qunused-arguments_-fPIC_-fPIE2024042720240425
5863020473 0 030347 828 920T:kcp/reference1600-32bitsclang_-march=native_-O2_-fomit-frame-pointer_-fwrapv_-Qunused-arguments_-fPIC_-fPIE2024042720240425
586848208 0 019419 796 952T:kcp/reference1600gcc_-march=native_-mtune=native_-O2_-fomit-frame-pointer_-fwrapv_-fPIC_-fPIE2024042720240425
814177877 0 018698 788 952T:kcp/reference1600gcc_-march=native_-mtune=native_-O_-fomit-frame-pointer_-fwrapv_-fPIC_-fPIE2024042720240425
845477721 0 018286 820 888T:kcp/reference1600clang_-march=native_-Os_-fomit-frame-pointer_-fwrapv_-Qunused-arguments_-fPIC_-fPIE2024042720240425
895466762 0 016611 772 920T:kcp/reference1600gcc_-march=native_-mtune=native_-Os_-fomit-frame-pointer_-fwrapv_-fPIC_-fPIE2024042720240425
15683510492 0 021030 820 888T:kcp/reference1600-32bitsclang_-march=native_-Os_-fomit-frame-pointer_-fwrapv_-Qunused-arguments_-fPIC_-fPIE2024042720240425
20507613307 0 026651 796 952T:kcp/reference1600-32bitsgcc_-march=native_-mtune=native_-O3_-fomit-frame-pointer_-fwrapv_-fPIC_-fPIE2024042720240425
23179916062 0 029219 828 888T:kcp/reference1600-32bitsclang_-mcpu=native_-O3_-fomit-frame-pointer_-fwrapv_-Qunused-arguments_-fPIC_-fPIE2024042720240425
25393811041 0 022339 796 952T:kcp/reference1600-32bitsgcc_-march=native_-mtune=native_-O2_-fomit-frame-pointer_-fwrapv_-fPIC_-fPIE2024042720240425
30711810489 0 021390 820 888T:kcp/reference1600-32bitsclang_-march=native_-O_-fomit-frame-pointer_-fwrapv_-Qunused-arguments_-fPIC_-fPIE2024042720240425
3217018689 0 018603 772 920T:kcp/reference1600-32bitsgcc_-march=native_-mtune=native_-Os_-fomit-frame-pointer_-fwrapv_-fPIC_-fPIE2024042720240425
3461629959 0 020850 788 952T:kcp/reference1600-32bitsgcc_-march=native_-mtune=native_-O_-fomit-frame-pointer_-fwrapv_-fPIC_-fPIE2024042720240425

Compiler output

Implementation: T:kcp/inplace1600ARMv6M
Security model: timingleaks
Compiler: clang -march=native -O2 -fomit-frame-pointer -fwrapv -Qunused-arguments -fPIC -fPIE
keccak.s: keccak.s:1:1: error: unexpected token at start of statement
keccak.s: @
keccak.s: ^
keccak.s: keccak.s:2:1: error: unexpected token at start of statement
keccak.s: @ Implementation by the Keccak, Keyak and Ketje Teams, namely, Guido Bertoni,
keccak.s: ^
keccak.s: keccak.s:3:1: error: unexpected token at start of statement
keccak.s: @ Joan Daemen, Michaƫl Peeters, Gilles Van Assche and Ronny Van Keer, hereby
keccak.s: keccak.s:4:1: error: unexpected token at start of statement
keccak.s: @ denoted as "the implementer".
keccak.s: ^
keccak.s: keccak.s:5:1: error: unexpected token at start of statement
keccak.s: @
keccak.s: ^
keccak.s: keccak.s:6:1: error: unexpected token at start of statement
keccak.s: @ For more information, feedback or questions, please refer to our websites:
keccak.s: ^
keccak.s: keccak.s:7:1: error: unexpected token at start of statement
keccak.s: @ http://keccak.noekeon.org/
keccak.s: ^
keccak.s: keccak.s:8:1: error: unexpected token at start of statement
keccak.s: @ http://keyak.noekeon.org/
keccak.s: ^
keccak.s: keccak.s:9:1: error: unexpected token at start of statement
keccak.s: @ http://ketje.noekeon.org/
keccak.s: ...

Number of similar (compiler,implementation) pairs: 30, namely:
CompilerImplementations
clang -march=native -O2 -fomit-frame-pointer -fwrapv -Qunused-arguments -fPIC -fPIE T:kcp/inplace1600ARMv6M
clang -march=native -O3 -fomit-frame-pointer -fwrapv -Qunused-arguments -fPIC -fPIE T:kcp/inplace1600ARMv6M
clang -march=native -O -fomit-frame-pointer -fwrapv -Qunused-arguments -fPIC -fPIE T:kcp/inplace1600ARMv6M
clang -march=native -Os -fomit-frame-pointer -fwrapv -Qunused-arguments -fPIC -fPIE T:kcp/inplace1600ARMv6M
clang -mcpu=native -O3 -fomit-frame-pointer -fwrapv -Qunused-arguments -fPIC -fPIE T:kcp/inplace1600ARMv6M
clang -march=native -O2 -fomit-frame-pointer -fwrapv -Qunused-arguments -fPIC -fPIE T:kcp/inplace1600ARMv7A
clang -march=native -O3 -fomit-frame-pointer -fwrapv -Qunused-arguments -fPIC -fPIE T:kcp/inplace1600ARMv7A
clang -march=native -O -fomit-frame-pointer -fwrapv -Qunused-arguments -fPIC -fPIE T:kcp/inplace1600ARMv7A
clang -march=native -Os -fomit-frame-pointer -fwrapv -Qunused-arguments -fPIC -fPIE T:kcp/inplace1600ARMv7A
clang -mcpu=native -O3 -fomit-frame-pointer -fwrapv -Qunused-arguments -fPIC -fPIE T:kcp/inplace1600ARMv7A
clang -march=native -O2 -fomit-frame-pointer -fwrapv -Qunused-arguments -fPIC -fPIE T:kcp/inplace1600ARMv7M
clang -march=native -O3 -fomit-frame-pointer -fwrapv -Qunused-arguments -fPIC -fPIE T:kcp/inplace1600ARMv7M
clang -march=native -O -fomit-frame-pointer -fwrapv -Qunused-arguments -fPIC -fPIE T:kcp/inplace1600ARMv7M
clang -march=native -Os -fomit-frame-pointer -fwrapv -Qunused-arguments -fPIC -fPIE T:kcp/inplace1600ARMv7M
clang -mcpu=native -O3 -fomit-frame-pointer -fwrapv -Qunused-arguments -fPIC -fPIE T:kcp/inplace1600ARMv7M
clang -march=native -O2 -fomit-frame-pointer -fwrapv -Qunused-arguments -fPIC -fPIE T:kcp/optimized1600ARMv6Mu1
clang -march=native -O3 -fomit-frame-pointer -fwrapv -Qunused-arguments -fPIC -fPIE T:kcp/optimized1600ARMv6Mu1
clang -march=native -O -fomit-frame-pointer -fwrapv -Qunused-arguments -fPIC -fPIE T:kcp/optimized1600ARMv6Mu1
clang -march=native -Os -fomit-frame-pointer -fwrapv -Qunused-arguments -fPIC -fPIE T:kcp/optimized1600ARMv6Mu1
clang -mcpu=native -O3 -fomit-frame-pointer -fwrapv -Qunused-arguments -fPIC -fPIE T:kcp/optimized1600ARMv6Mu1
clang -march=native -O2 -fomit-frame-pointer -fwrapv -Qunused-arguments -fPIC -fPIE T:kcp/optimized1600ARMv6Mu2
clang -march=native -O3 -fomit-frame-pointer -fwrapv -Qunused-arguments -fPIC -fPIE T:kcp/optimized1600ARMv6Mu2
clang -march=native -O -fomit-frame-pointer -fwrapv -Qunused-arguments -fPIC -fPIE T:kcp/optimized1600ARMv6Mu2
clang -march=native -Os -fomit-frame-pointer -fwrapv -Qunused-arguments -fPIC -fPIE T:kcp/optimized1600ARMv6Mu2
clang -mcpu=native -O3 -fomit-frame-pointer -fwrapv -Qunused-arguments -fPIC -fPIE T:kcp/optimized1600ARMv6Mu2
clang -march=native -O2 -fomit-frame-pointer -fwrapv -Qunused-arguments -fPIC -fPIE T:kcp/optimized1600ARMv7A
clang -march=native -O3 -fomit-frame-pointer -fwrapv -Qunused-arguments -fPIC -fPIE T:kcp/optimized1600ARMv7A
clang -march=native -O -fomit-frame-pointer -fwrapv -Qunused-arguments -fPIC -fPIE T:kcp/optimized1600ARMv7A
clang -march=native -Os -fomit-frame-pointer -fwrapv -Qunused-arguments -fPIC -fPIE T:kcp/optimized1600ARMv7A
clang -mcpu=native -O3 -fomit-frame-pointer -fwrapv -Qunused-arguments -fPIC -fPIE T:kcp/optimized1600ARMv7A

Compiler output

Implementation: T:kcp/inplace1600ARMv6M
Security model: timingleaks
Compiler: gcc -march=native -mtune=native -O2 -fomit-frame-pointer -fwrapv -fPIC -fPIE
keccak.s: keccak.s: Assembler messages:
keccak.s: keccak.s:1: Error: junk at end of line, first unrecognized character is `@'
keccak.s: keccak.s:2: Error: junk at end of line, first unrecognized character is `@'
keccak.s: keccak.s:3: Error: junk at end of line, first unrecognized character is `@'
keccak.s: keccak.s:4: Error: junk at end of line, first unrecognized character is `@'
keccak.s: keccak.s:5: Error: junk at end of line, first unrecognized character is `@'
keccak.s: keccak.s:6: Error: junk at end of line, first unrecognized character is `@'
keccak.s: keccak.s:7: Error: junk at end of line, first unrecognized character is `@'
keccak.s: keccak.s:8: Error: junk at end of line, first unrecognized character is `@'
keccak.s: keccak.s:9: Error: junk at end of line, first unrecognized character is `@'
keccak.s: keccak.s:10: Error: junk at end of line, first unrecognized character is `@'
keccak.s: keccak.s:11: Error: junk at end of line, first unrecognized character is `@'
keccak.s: keccak.s:12: Error: junk at end of line, first unrecognized character is `@'
keccak.s: keccak.s:13: Error: junk at end of line, first unrecognized character is `@'
keccak.s: keccak.s:14: Error: junk at end of line, first unrecognized character is `@'
keccak.s: keccak.s:16: Error: junk at end of line, first unrecognized character is `@'
keccak.s: keccak.s:19: Error: unknown pseudo-op: `.thumb'
keccak.s: keccak.s:20: Error: unknown pseudo-op: `.syntax'
keccak.s: keccak.s:23: Error: junk at end of line, first unrecognized character is `@'
keccak.s: keccak.s:109: Error: junk at end of line, first unrecognized character is `@'
keccak.s: keccak.s:142: Error: junk at end of line, first unrecognized character is `@'
keccak.s: keccak.s:194: Error: junk at end of line, first unrecognized character is `@'
keccak.s: keccak.s:203: Error: junk at end of line, first unrecognized character is `@'
keccak.s: keccak.s:611: Error: junk at end of line, first unrecognized character is `@'
keccak.s: keccak.s:612: Error: junk at end of line, first unrecognized character is `@'
keccak.s: ...

Number of similar (compiler,implementation) pairs: 4, namely:
CompilerImplementations
gcc -march=native -mtune=native -O2 -fomit-frame-pointer -fwrapv -fPIC -fPIE T:kcp/inplace1600ARMv6M
gcc -march=native -mtune=native -O3 -fomit-frame-pointer -fwrapv -fPIC -fPIE T:kcp/inplace1600ARMv6M
gcc -march=native -mtune=native -O -fomit-frame-pointer -fwrapv -fPIC -fPIE T:kcp/inplace1600ARMv6M
gcc -march=native -mtune=native -Os -fomit-frame-pointer -fwrapv -fPIC -fPIE T:kcp/inplace1600ARMv6M

Compiler output

Implementation: T:kcp/inplace1600ARMv7A
Security model: timingleaks
Compiler: gcc -march=native -mtune=native -O2 -fomit-frame-pointer -fwrapv -fPIC -fPIE
keccak.s: keccak.s: Assembler messages:
keccak.s: keccak.s:1: Error: junk at end of line, first unrecognized character is `@'
keccak.s: keccak.s:2: Error: junk at end of line, first unrecognized character is `@'
keccak.s: keccak.s:3: Error: junk at end of line, first unrecognized character is `@'
keccak.s: keccak.s:4: Error: junk at end of line, first unrecognized character is `@'
keccak.s: keccak.s:5: Error: junk at end of line, first unrecognized character is `@'
keccak.s: keccak.s:6: Error: junk at end of line, first unrecognized character is `@'
keccak.s: keccak.s:7: Error: junk at end of line, first unrecognized character is `@'
keccak.s: keccak.s:8: Error: junk at end of line, first unrecognized character is `@'
keccak.s: keccak.s:9: Error: junk at end of line, first unrecognized character is `@'
keccak.s: keccak.s:10: Error: junk at end of line, first unrecognized character is `@'
keccak.s: keccak.s:11: Error: junk at end of line, first unrecognized character is `@'
keccak.s: keccak.s:12: Error: junk at end of line, first unrecognized character is `@'
keccak.s: keccak.s:13: Error: junk at end of line, first unrecognized character is `@'
keccak.s: keccak.s:14: Error: junk at end of line, first unrecognized character is `@'
keccak.s: keccak.s:16: Error: junk at end of line, first unrecognized character is `@'
keccak.s: keccak.s:18: Error: junk at end of line, first unrecognized character is `@'
keccak.s: keccak.s:21: Error: unknown pseudo-op: `.syntax'
keccak.s: keccak.s:22: Error: unknown pseudo-op: `.thumb'
keccak.s: keccak.s:25: Error: junk at end of line, first unrecognized character is `@'
keccak.s: keccak.s:78: Error: junk at end of line, first unrecognized character is `@'
keccak.s: keccak.s:127: Error: junk at end of line, first unrecognized character is `@'
keccak.s: keccak.s:179: Error: junk at end of line, first unrecognized character is `@'
keccak.s: keccak.s:471: Error: junk at end of line, first unrecognized character is `@'
keccak.s: keccak.s:472: Error: junk at end of line, first unrecognized character is `@'
keccak.s: ...

Number of similar (compiler,implementation) pairs: 4, namely:
CompilerImplementations
gcc -march=native -mtune=native -O2 -fomit-frame-pointer -fwrapv -fPIC -fPIE T:kcp/inplace1600ARMv7A
gcc -march=native -mtune=native -O3 -fomit-frame-pointer -fwrapv -fPIC -fPIE T:kcp/inplace1600ARMv7A
gcc -march=native -mtune=native -O -fomit-frame-pointer -fwrapv -fPIC -fPIE T:kcp/inplace1600ARMv7A
gcc -march=native -mtune=native -Os -fomit-frame-pointer -fwrapv -fPIC -fPIE T:kcp/inplace1600ARMv7A

Compiler output

Implementation: T:kcp/inplace1600ARMv7M
Security model: timingleaks
Compiler: gcc -march=native -mtune=native -O2 -fomit-frame-pointer -fwrapv -fPIC -fPIE
keccak.s: keccak.s: Assembler messages:
keccak.s: keccak.s:1: Error: junk at end of line, first unrecognized character is `@'
keccak.s: keccak.s:2: Error: junk at end of line, first unrecognized character is `@'
keccak.s: keccak.s:3: Error: junk at end of line, first unrecognized character is `@'
keccak.s: keccak.s:4: Error: junk at end of line, first unrecognized character is `@'
keccak.s: keccak.s:5: Error: junk at end of line, first unrecognized character is `@'
keccak.s: keccak.s:6: Error: junk at end of line, first unrecognized character is `@'
keccak.s: keccak.s:7: Error: junk at end of line, first unrecognized character is `@'
keccak.s: keccak.s:8: Error: junk at end of line, first unrecognized character is `@'
keccak.s: keccak.s:9: Error: junk at end of line, first unrecognized character is `@'
keccak.s: keccak.s:10: Error: junk at end of line, first unrecognized character is `@'
keccak.s: keccak.s:11: Error: junk at end of line, first unrecognized character is `@'
keccak.s: keccak.s:12: Error: junk at end of line, first unrecognized character is `@'
keccak.s: keccak.s:13: Error: junk at end of line, first unrecognized character is `@'
keccak.s: keccak.s:14: Error: junk at end of line, first unrecognized character is `@'
keccak.s: keccak.s:16: Error: junk at end of line, first unrecognized character is `@'
keccak.s: keccak.s:19: Error: unknown pseudo-op: `.thumb'
keccak.s: keccak.s:20: Error: unknown pseudo-op: `.syntax'
keccak.s: keccak.s:23: Error: junk at end of line, first unrecognized character is `@'
keccak.s: keccak.s:76: Error: junk at end of line, first unrecognized character is `@'
keccak.s: keccak.s:125: Error: junk at end of line, first unrecognized character is `@'
keccak.s: keccak.s:177: Error: junk at end of line, first unrecognized character is `@'
keccak.s: keccak.s:470: Error: junk at end of line, first unrecognized character is `@'
keccak.s: keccak.s:471: Error: junk at end of line, first unrecognized character is `@'
keccak.s: keccak.s:472: Error: junk at end of line, first unrecognized character is `@'
keccak.s: ...

Number of similar (compiler,implementation) pairs: 4, namely:
CompilerImplementations
gcc -march=native -mtune=native -O2 -fomit-frame-pointer -fwrapv -fPIC -fPIE T:kcp/inplace1600ARMv7M
gcc -march=native -mtune=native -O3 -fomit-frame-pointer -fwrapv -fPIC -fPIE T:kcp/inplace1600ARMv7M
gcc -march=native -mtune=native -O -fomit-frame-pointer -fwrapv -fPIC -fPIE T:kcp/inplace1600ARMv7M
gcc -march=native -mtune=native -Os -fomit-frame-pointer -fwrapv -fPIC -fPIE T:kcp/inplace1600ARMv7M

Compiler output

Implementation: T:kcp/optimized1600ARMv6Mu1
Security model: timingleaks
Compiler: gcc -march=native -mtune=native -O2 -fomit-frame-pointer -fwrapv -fPIC -fPIE
keccak.s: keccak.s: Assembler messages:
keccak.s: keccak.s:1: Error: junk at end of line, first unrecognized character is `@'
keccak.s: keccak.s:2: Error: junk at end of line, first unrecognized character is `@'
keccak.s: keccak.s:3: Error: junk at end of line, first unrecognized character is `@'
keccak.s: keccak.s:4: Error: junk at end of line, first unrecognized character is `@'
keccak.s: keccak.s:5: Error: junk at end of line, first unrecognized character is `@'
keccak.s: keccak.s:6: Error: junk at end of line, first unrecognized character is `@'
keccak.s: keccak.s:7: Error: junk at end of line, first unrecognized character is `@'
keccak.s: keccak.s:8: Error: junk at end of line, first unrecognized character is `@'
keccak.s: keccak.s:9: Error: junk at end of line, first unrecognized character is `@'
keccak.s: keccak.s:10: Error: junk at end of line, first unrecognized character is `@'
keccak.s: keccak.s:11: Error: junk at end of line, first unrecognized character is `@'
keccak.s: keccak.s:12: Error: junk at end of line, first unrecognized character is `@'
keccak.s: keccak.s:13: Error: junk at end of line, first unrecognized character is `@'
keccak.s: keccak.s:14: Error: junk at end of line, first unrecognized character is `@'
keccak.s: keccak.s:16: Error: junk at end of line, first unrecognized character is `@'
keccak.s: keccak.s:19: Error: unknown pseudo-op: `.thumb'
keccak.s: keccak.s:20: Error: unknown pseudo-op: `.syntax'
keccak.s: keccak.s:23: Error: junk at end of line, first unrecognized character is `@'
keccak.s: keccak.s:109: Error: junk at end of line, first unrecognized character is `@'
keccak.s: keccak.s:142: Error: junk at end of line, first unrecognized character is `@'
keccak.s: keccak.s:194: Error: junk at end of line, first unrecognized character is `@'
keccak.s: keccak.s:195: Error: junk at end of line, first unrecognized character is `@'
keccak.s: keccak.s:205: Error: junk at end of line, first unrecognized character is `@'
keccak.s: keccak.s:300: Error: junk at end of line, first unrecognized character is `@'
keccak.s: ...

Number of similar (compiler,implementation) pairs: 4, namely:
CompilerImplementations
gcc -march=native -mtune=native -O2 -fomit-frame-pointer -fwrapv -fPIC -fPIE T:kcp/optimized1600ARMv6Mu1
gcc -march=native -mtune=native -O3 -fomit-frame-pointer -fwrapv -fPIC -fPIE T:kcp/optimized1600ARMv6Mu1
gcc -march=native -mtune=native -O -fomit-frame-pointer -fwrapv -fPIC -fPIE T:kcp/optimized1600ARMv6Mu1
gcc -march=native -mtune=native -Os -fomit-frame-pointer -fwrapv -fPIC -fPIE T:kcp/optimized1600ARMv6Mu1

Compiler output

Implementation: T:kcp/optimized1600ARMv6Mu2
Security model: timingleaks
Compiler: gcc -march=native -mtune=native -O2 -fomit-frame-pointer -fwrapv -fPIC -fPIE
keccak.s: keccak.s: Assembler messages:
keccak.s: keccak.s:1: Error: junk at end of line, first unrecognized character is `@'
keccak.s: keccak.s:2: Error: junk at end of line, first unrecognized character is `@'
keccak.s: keccak.s:3: Error: junk at end of line, first unrecognized character is `@'
keccak.s: keccak.s:4: Error: junk at end of line, first unrecognized character is `@'
keccak.s: keccak.s:5: Error: junk at end of line, first unrecognized character is `@'
keccak.s: keccak.s:6: Error: junk at end of line, first unrecognized character is `@'
keccak.s: keccak.s:7: Error: junk at end of line, first unrecognized character is `@'
keccak.s: keccak.s:8: Error: junk at end of line, first unrecognized character is `@'
keccak.s: keccak.s:9: Error: junk at end of line, first unrecognized character is `@'
keccak.s: keccak.s:10: Error: junk at end of line, first unrecognized character is `@'
keccak.s: keccak.s:11: Error: junk at end of line, first unrecognized character is `@'
keccak.s: keccak.s:12: Error: junk at end of line, first unrecognized character is `@'
keccak.s: keccak.s:13: Error: junk at end of line, first unrecognized character is `@'
keccak.s: keccak.s:14: Error: junk at end of line, first unrecognized character is `@'
keccak.s: keccak.s:16: Error: junk at end of line, first unrecognized character is `@'
keccak.s: keccak.s:19: Error: unknown pseudo-op: `.thumb'
keccak.s: keccak.s:20: Error: unknown pseudo-op: `.syntax'
keccak.s: keccak.s:23: Error: junk at end of line, first unrecognized character is `@'
keccak.s: keccak.s:109: Error: junk at end of line, first unrecognized character is `@'
keccak.s: keccak.s:142: Error: junk at end of line, first unrecognized character is `@'
keccak.s: keccak.s:194: Error: junk at end of line, first unrecognized character is `@'
keccak.s: keccak.s:195: Error: junk at end of line, first unrecognized character is `@'
keccak.s: keccak.s:205: Error: junk at end of line, first unrecognized character is `@'
keccak.s: keccak.s:374: Error: junk at end of line, first unrecognized character is `@'
keccak.s: ...

Number of similar (compiler,implementation) pairs: 4, namely:
CompilerImplementations
gcc -march=native -mtune=native -O2 -fomit-frame-pointer -fwrapv -fPIC -fPIE T:kcp/optimized1600ARMv6Mu2
gcc -march=native -mtune=native -O3 -fomit-frame-pointer -fwrapv -fPIC -fPIE T:kcp/optimized1600ARMv6Mu2
gcc -march=native -mtune=native -O -fomit-frame-pointer -fwrapv -fPIC -fPIE T:kcp/optimized1600ARMv6Mu2
gcc -march=native -mtune=native -Os -fomit-frame-pointer -fwrapv -fPIC -fPIE T:kcp/optimized1600ARMv6Mu2

Compiler output

Implementation: T:kcp/optimized1600ARMv7A
Security model: timingleaks
Compiler: gcc -march=native -mtune=native -O2 -fomit-frame-pointer -fwrapv -fPIC -fPIE
keccak.s: keccak.s: Assembler messages:
keccak.s: keccak.s:1: Error: junk at end of line, first unrecognized character is `@'
keccak.s: keccak.s:2: Error: junk at end of line, first unrecognized character is `@'
keccak.s: keccak.s:3: Error: junk at end of line, first unrecognized character is `@'
keccak.s: keccak.s:4: Error: junk at end of line, first unrecognized character is `@'
keccak.s: keccak.s:5: Error: junk at end of line, first unrecognized character is `@'
keccak.s: keccak.s:6: Error: junk at end of line, first unrecognized character is `@'
keccak.s: keccak.s:7: Error: junk at end of line, first unrecognized character is `@'
keccak.s: keccak.s:8: Error: junk at end of line, first unrecognized character is `@'
keccak.s: keccak.s:9: Error: junk at end of line, first unrecognized character is `@'
keccak.s: keccak.s:10: Error: junk at end of line, first unrecognized character is `@'
keccak.s: keccak.s:11: Error: junk at end of line, first unrecognized character is `@'
keccak.s: keccak.s:12: Error: junk at end of line, first unrecognized character is `@'
keccak.s: keccak.s:13: Error: junk at end of line, first unrecognized character is `@'
keccak.s: keccak.s:14: Error: junk at end of line, first unrecognized character is `@'
keccak.s: keccak.s:16: Error: junk at end of line, first unrecognized character is `@'
keccak.s: keccak.s:17: Error: junk at end of line, first unrecognized character is `@'
keccak.s: keccak.s:18: Error: junk at end of line, first unrecognized character is `@'
keccak.s: keccak.s:21: Error: unknown pseudo-op: `.syntax'
keccak.s: keccak.s:22: Error: unknown pseudo-op: `.fpu'
keccak.s: keccak.s:23: Error: unknown pseudo-op: `.arm'
keccak.s: keccak.s:26: Error: junk at end of line, first unrecognized character is `@'
keccak.s: keccak.s:27: Error: junk at end of line, first unrecognized character is `@'
keccak.s: keccak.s:29: Error: junk at end of line, first unrecognized character is `@'
keccak.s: keccak.s:56: Error: junk at end of line, first unrecognized character is `@'
keccak.s: ...

Number of similar (compiler,implementation) pairs: 4, namely:
CompilerImplementations
gcc -march=native -mtune=native -O2 -fomit-frame-pointer -fwrapv -fPIC -fPIE T:kcp/optimized1600ARMv7A
gcc -march=native -mtune=native -O3 -fomit-frame-pointer -fwrapv -fPIC -fPIE T:kcp/optimized1600ARMv7A
gcc -march=native -mtune=native -O -fomit-frame-pointer -fwrapv -fPIC -fPIE T:kcp/optimized1600ARMv7A
gcc -march=native -mtune=native -Os -fomit-frame-pointer -fwrapv -fPIC -fPIE T:kcp/optimized1600ARMv7A

Compiler output

Implementation: T:kcp/optimized1600ARMv8A
Security model: timingleaks
Compiler: clang -march=native -O2 -fomit-frame-pointer -fwrapv -Qunused-arguments -fPIC -fPIE
keccak.s: keccak.s:258:20: error: unknown token in expression
keccak.s: movi v0.2d, #0
keccak.s: ^
keccak.s: keccak.s:259:20: error: unknown token in expression
keccak.s: movi v1.2d, #0
keccak.s: ^
keccak.s: keccak.s:260:20: error: unknown token in expression
keccak.s: movi v2.2d, #0
keccak.s: ^
keccak.s: keccak.s:261:20: error: unknown token in expression
keccak.s: movi v3.2d, #0
keccak.s: ^
keccak.s: keccak.s:262:15: error: unknown token in expression
keccak.s: st4 { v0.2d, v1.2d, v2.2d, v3.2d }, [x0], #64 // Clear 8lanes=64 bytes at a time
keccak.s: ^
keccak.s: keccak.s:263:15: error: unknown token in expression
keccak.s: st4 { v0.2d, v1.2d, v2.2d, v3.2d }, [x0], #64
keccak.s: ^
keccak.s: keccak.s:264:15: error: unknown token in expression
keccak.s: st4 { v0.2d, v1.2d, v2.2d, v3.2d }, [x0], #64
keccak.s: ^
keccak.s: keccak.s:265:15: error: unknown token in expression
keccak.s: st1 { v0.d }[0], [x0], #8
keccak.s: ^
keccak.s: keccak.s:276:20: error: expected ']' in brackets expression
keccak.s: ...

Number of similar (compiler,implementation) pairs: 5, namely:
CompilerImplementations
clang -march=native -O2 -fomit-frame-pointer -fwrapv -Qunused-arguments -fPIC -fPIE T:kcp/optimized1600ARMv8A
clang -march=native -O3 -fomit-frame-pointer -fwrapv -Qunused-arguments -fPIC -fPIE T:kcp/optimized1600ARMv8A
clang -march=native -O -fomit-frame-pointer -fwrapv -Qunused-arguments -fPIC -fPIE T:kcp/optimized1600ARMv8A
clang -march=native -Os -fomit-frame-pointer -fwrapv -Qunused-arguments -fPIC -fPIE T:kcp/optimized1600ARMv8A
clang -mcpu=native -O3 -fomit-frame-pointer -fwrapv -Qunused-arguments -fPIC -fPIE T:kcp/optimized1600ARMv8A

Compiler output

Implementation: T:kcp/optimized1600ARMv8A
Security model: timingleaks
Compiler: gcc -march=native -mtune=native -O2 -fomit-frame-pointer -fwrapv -fPIC -fPIE
keccak.s: keccak.s: Assembler messages:
keccak.s: keccak.s:258: Error: no such instruction: `movi v0.2d,'
keccak.s: keccak.s:259: Error: no such instruction: `movi v1.2d,'
keccak.s: keccak.s:260: Error: no such instruction: `movi v2.2d,'
keccak.s: keccak.s:261: Error: no such instruction: `movi v3.2d,'
keccak.s: keccak.s:262: Error: no such instruction: `st4 { v0.2d,v1.2d,v2.2d,v3.2d },[x0],'
keccak.s: keccak.s:263: Error: no such instruction: `st4 { v0.2d,v1.2d,v2.2d,v3.2d },[x0],'
keccak.s: keccak.s:264: Error: no such instruction: `st4 { v0.2d,v1.2d,v2.2d,v3.2d },[x0],'
keccak.s: keccak.s:265: Error: no such instruction: `st1 { v0.d }[0],[x0],'
keccak.s: keccak.s:276: Error: no such instruction: `ldrb w3,[x0,x2]'
keccak.s: keccak.s:277: Error: no such instruction: `eor w3,w3,w1'
keccak.s: keccak.s:278: Error: invalid char '[' beginning operand 2 `[x0'
keccak.s: keccak.s:289: Error: too many memory references for `add'
keccak.s: keccak.s:290: Error: too many memory references for `sub'
keccak.s: keccak.s:291: Error: no such instruction: `b.cc KeccakP1600_AddBytes_Exit//length 0,move along'
keccak.s: keccak.s:293: Error: too many memory references for `sub'
keccak.s: keccak.s:294: Error: no such instruction: `b.cc KeccakP1600_AddBytes_Lanes//Jump if length is negative'
keccak.s: keccak.s:295: Error: no such instruction: `ld4 { v0.2d,v1.2d,v2.2d,v3.2d },[x0]'
keccak.s: keccak.s:296: Error: no such instruction: `ld4 { v4.2d,v5.2d,v6.2d,v7.2d },[x1],'
keccak.s: keccak.s:297: Error: no such instruction: `eor v0.16b,v0.16b,v4.16b'
keccak.s: keccak.s:298: Error: no such instruction: `eor v1.16b,v1.16b,v5.16b'
keccak.s: keccak.s:299: Error: no such instruction: `eor v2.16b,v2.16b,v6.16b'
keccak.s: keccak.s:300: Error: no such instruction: `eor v3.16b,v3.16b,v7.16b'
keccak.s: keccak.s:301: Error: no such instruction: `st4 { v0.2d,v1.2d,v2.2d,v3.2d },[x0],'
keccak.s: keccak.s:302: Error: no such instruction: `b KeccakP1600_AddBytes_8LanesLoop'
keccak.s: ...

Number of similar (compiler,implementation) pairs: 4, namely:
CompilerImplementations
gcc -march=native -mtune=native -O2 -fomit-frame-pointer -fwrapv -fPIC -fPIE T:kcp/optimized1600ARMv8A
gcc -march=native -mtune=native -O3 -fomit-frame-pointer -fwrapv -fPIC -fPIE T:kcp/optimized1600ARMv8A
gcc -march=native -mtune=native -O -fomit-frame-pointer -fwrapv -fPIC -fPIE T:kcp/optimized1600ARMv8A
gcc -march=native -mtune=native -Os -fomit-frame-pointer -fwrapv -fPIC -fPIE T:kcp/optimized1600ARMv8A

Compiler output

Implementation: T:kcp/optimized1600AVX2
Security model: timingleaks
Compiler: clang++ -march=native -O2 -fomit-frame-pointer -fwrapv -Qunused-arguments -fPIC -fPIE
K12.c: clang: warning: treating 'c' input as 'c++' when in C++ mode, this behavior is deprecated [-Wdeprecated]
KangarooTwelve.c: clang: warning: treating 'c' input as 'c++' when in C++ mode, this behavior is deprecated [-Wdeprecated]
KeccakSpongeWidth1600.c: clang: warning: treating 'c' input as 'c++' when in C++ mode, this behavior is deprecated [-Wdeprecated]
try.cpp: /usr/bin/ld: libcrypto_hash_k12.a(KeccakSpongeWidth1600.o): in function `KeccakWidth1600_Sponge(unsigned int, unsigned int, unsigned char const*, unsigned long, unsigned char, unsigned char*, unsigned long)':
try.cpp: KeccakSpongeWidth1600.c:(.text+0x...): undefined reference to `KeccakP1600_StaticInitialize()'
try.cpp: /usr/bin/ld: KeccakSpongeWidth1600.c:(.text+0x...): undefined reference to `KeccakP1600_Initialize(void*)'
try.cpp: /usr/bin/ld: KeccakSpongeWidth1600.c:(.text+0x...): undefined reference to `KeccakF1600_FastLoop_Absorb(void*, unsigned int, unsigned char const*, unsigned long)'
try.cpp: /usr/bin/ld: KeccakSpongeWidth1600.c:(.text+0x...): undefined reference to `KeccakP1600_AddBytes(void*, unsigned char const*, unsigned int, unsigned int)'
try.cpp: /usr/bin/ld: KeccakSpongeWidth1600.c:(.text+0x...): undefined reference to `KeccakP1600_Permute_24rounds(void*)'
try.cpp: /usr/bin/ld: KeccakSpongeWidth1600.c:(.text+0x...): undefined reference to `KeccakP1600_AddBytes(void*, unsigned char const*, unsigned int, unsigned int)'
try.cpp: /usr/bin/ld: KeccakSpongeWidth1600.c:(.text+0x...): undefined reference to `KeccakP1600_AddByte(void*, unsigned char, unsigned int)'
try.cpp: /usr/bin/ld: KeccakSpongeWidth1600.c:(.text+0x...): undefined reference to `KeccakP1600_Permute_24rounds(void*)'
try.cpp: /usr/bin/ld: KeccakSpongeWidth1600.c:(.text+0x...): undefined reference to `KeccakP1600_AddByte(void*, unsigned char, unsigned int)'
try.cpp: /usr/bin/ld: KeccakSpongeWidth1600.c:(.text+0x...): undefined reference to `KeccakP1600_Permute_24rounds(void*)'
try.cpp: /usr/bin/ld: KeccakSpongeWidth1600.c:(.text+0x...): undefined reference to `KeccakP1600_ExtractBytes(void const*, unsigned char*, unsigned int, unsigned int)'
try.cpp: /usr/bin/ld: KeccakSpongeWidth1600.c:(.text+0x...): undefined reference to `KeccakP1600_Permute_24rounds(void*)'
try.cpp: /usr/bin/ld: KeccakSpongeWidth1600.c:(.text+0x...): undefined reference to `KeccakP1600_ExtractBytes(void const*, unsigned char*, unsigned int, unsigned int)'
try.cpp: /usr/bin/ld: libcrypto_hash_k12.a(KeccakSpongeWidth1600.o): in function `KeccakWidth1600_SpongeInitialize(KeccakWidth1600_SpongeInstanceStruct*, unsigned int, unsigned int)':
try.cpp: KeccakSpongeWidth1600.c:(.text+0x...): undefined reference to `KeccakP1600_StaticInitialize()'
try.cpp: /usr/bin/ld: KeccakSpongeWidth1600.c:(.text+0x...): undefined reference to `KeccakP1600_Initialize(void*)'
try.cpp: /usr/bin/ld: libcrypto_hash_k12.a(KeccakSpongeWidth1600.o): in function `KeccakWidth1600_SpongeAbsorb(KeccakWidth1600_SpongeInstanceStruct*, unsigned char const*, unsigned long)':
try.cpp: KeccakSpongeWidth1600.c:(.text+0x...): undefined reference to `KeccakP1600_AddBytes(void*, unsigned char const*, unsigned int, unsigned int)'
try.cpp: /usr/bin/ld: KeccakSpongeWidth1600.c:(.text+0x...): undefined reference to `KeccakP1600_Permute_24rounds(void*)'
try.cpp: /usr/bin/ld: KeccakSpongeWidth1600.c:(.text+0x...): undefined reference to `KeccakP1600_AddBytes(void*, unsigned char const*, unsigned int, unsigned int)'
try.cpp: /usr/bin/ld: KeccakSpongeWidth1600.c:(.text+0x...): undefined reference to `KeccakP1600_Permute_24rounds(void*)'
try.cpp: /usr/bin/ld: KeccakSpongeWidth1600.c:(.text+0x...): undefined reference to `KeccakF1600_FastLoop_Absorb(void*, unsigned int, unsigned char const*, unsigned long)'
try.cpp: /usr/bin/ld: libcrypto_hash_k12.a(KeccakSpongeWidth1600.o): in function `KeccakWidth1600_SpongeAbsorbLastFewBits(KeccakWidth1600_SpongeInstanceStruct*, unsigned char)':
try.cpp: KeccakSpongeWidth1600.c:(.text+0x...): undefined reference to `KeccakP1600_AddByte(void*, unsigned char, unsigned int)'
try.cpp: ...

Number of similar (compiler,implementation) pairs: 3, namely:
CompilerImplementations
clang++ -march=native -O2 -fomit-frame-pointer -fwrapv -Qunused-arguments -fPIC -fPIE T:kcp/optimized1600AVX2
clang++ -march=native -O -fomit-frame-pointer -fwrapv -Qunused-arguments -fPIC -fPIE T:kcp/optimized1600AVX2
clang++ -march=native -Os -fomit-frame-pointer -fwrapv -Qunused-arguments -fPIC -fPIE T:kcp/optimized1600AVX2

Compiler output

Implementation: T:kcp/optimized1600AVX2
Security model: timingleaks
Compiler: clang++ -march=native -O3 -fomit-frame-pointer -fwrapv -Qunused-arguments -fPIC -fPIE
K12.c: clang: warning: treating 'c' input as 'c++' when in C++ mode, this behavior is deprecated [-Wdeprecated]
KangarooTwelve.c: clang: warning: treating 'c' input as 'c++' when in C++ mode, this behavior is deprecated [-Wdeprecated]
KeccakSpongeWidth1600.c: clang: warning: treating 'c' input as 'c++' when in C++ mode, this behavior is deprecated [-Wdeprecated]
try.cpp: /usr/bin/ld: libcrypto_hash_k12.a(KeccakSpongeWidth1600.o): in function `KeccakWidth1600_Sponge(unsigned int, unsigned int, unsigned char const*, unsigned long, unsigned char, unsigned char*, unsigned long)':
try.cpp: KeccakSpongeWidth1600.c:(.text+0x...): undefined reference to `KeccakP1600_StaticInitialize()'
try.cpp: /usr/bin/ld: KeccakSpongeWidth1600.c:(.text+0x...): undefined reference to `KeccakP1600_Initialize(void*)'
try.cpp: /usr/bin/ld: KeccakSpongeWidth1600.c:(.text+0x...): undefined reference to `KeccakF1600_FastLoop_Absorb(void*, unsigned int, unsigned char const*, unsigned long)'
try.cpp: /usr/bin/ld: KeccakSpongeWidth1600.c:(.text+0x...): undefined reference to `KeccakP1600_AddBytes(void*, unsigned char const*, unsigned int, unsigned int)'
try.cpp: /usr/bin/ld: KeccakSpongeWidth1600.c:(.text+0x...): undefined reference to `KeccakP1600_Permute_24rounds(void*)'
try.cpp: /usr/bin/ld: KeccakSpongeWidth1600.c:(.text+0x...): undefined reference to `KeccakP1600_AddBytes(void*, unsigned char const*, unsigned int, unsigned int)'
try.cpp: /usr/bin/ld: KeccakSpongeWidth1600.c:(.text+0x...): undefined reference to `KeccakP1600_AddByte(void*, unsigned char, unsigned int)'
try.cpp: /usr/bin/ld: KeccakSpongeWidth1600.c:(.text+0x...): undefined reference to `KeccakP1600_Permute_24rounds(void*)'
try.cpp: /usr/bin/ld: KeccakSpongeWidth1600.c:(.text+0x...): undefined reference to `KeccakP1600_AddByte(void*, unsigned char, unsigned int)'
try.cpp: /usr/bin/ld: KeccakSpongeWidth1600.c:(.text+0x...): undefined reference to `KeccakP1600_Permute_24rounds(void*)'
try.cpp: /usr/bin/ld: KeccakSpongeWidth1600.c:(.text+0x...): undefined reference to `KeccakP1600_ExtractBytes(void const*, unsigned char*, unsigned int, unsigned int)'
try.cpp: /usr/bin/ld: KeccakSpongeWidth1600.c:(.text+0x...): undefined reference to `KeccakP1600_Permute_24rounds(void*)'
try.cpp: /usr/bin/ld: KeccakSpongeWidth1600.c:(.text+0x...): undefined reference to `KeccakP1600_ExtractBytes(void const*, unsigned char*, unsigned int, unsigned int)'
try.cpp: /usr/bin/ld: libcrypto_hash_k12.a(KeccakSpongeWidth1600.o): in function `KeccakWidth1600_SpongeInitialize(KeccakWidth1600_SpongeInstanceStruct*, unsigned int, unsigned int)':
try.cpp: KeccakSpongeWidth1600.c:(.text+0x...): undefined reference to `KeccakP1600_StaticInitialize()'
try.cpp: /usr/bin/ld: KeccakSpongeWidth1600.c:(.text+0x...): undefined reference to `KeccakP1600_Initialize(void*)'
try.cpp: /usr/bin/ld: libcrypto_hash_k12.a(KeccakSpongeWidth1600.o): in function `KeccakWidth1600_SpongeAbsorb(KeccakWidth1600_SpongeInstanceStruct*, unsigned char const*, unsigned long)':
try.cpp: KeccakSpongeWidth1600.c:(.text+0x...): undefined reference to `KeccakP1600_AddBytes(void*, unsigned char const*, unsigned int, unsigned int)'
try.cpp: /usr/bin/ld: KeccakSpongeWidth1600.c:(.text+0x...): undefined reference to `KeccakP1600_Permute_24rounds(void*)'
try.cpp: /usr/bin/ld: KeccakSpongeWidth1600.c:(.text+0x...): undefined reference to `KeccakP1600_AddBytes(void*, unsigned char const*, unsigned int, unsigned int)'
try.cpp: /usr/bin/ld: KeccakSpongeWidth1600.c:(.text+0x...): undefined reference to `KeccakP1600_Permute_24rounds(void*)'
try.cpp: /usr/bin/ld: KeccakSpongeWidth1600.c:(.text+0x...): undefined reference to `KeccakF1600_FastLoop_Absorb(void*, unsigned int, unsigned char const*, unsigned long)'
try.cpp: /usr/bin/ld: KeccakSpongeWidth1600.c:(.text+0x...): undefined reference to `KeccakP1600_AddBytes(void*, unsigned char const*, unsigned int, unsigned int)'
try.cpp: /usr/bin/ld: KeccakSpongeWidth1600.c:(.text+0x...): undefined reference to `KeccakP1600_Permute_24rounds(void*)'
try.cpp: ...

Number of similar (compiler,implementation) pairs: 1, namely:
CompilerImplementations
clang++ -march=native -O3 -fomit-frame-pointer -fwrapv -Qunused-arguments -fPIC -fPIE T:kcp/optimized1600AVX2

Compiler output

Implementation: T:kcp/optimized1600AVX2
Security model: timingleaks
Compiler: g++ -march=native -mtune=native -O2 -fomit-frame-pointer -fwrapv -fPIC -fPIE
try.cpp: /usr/bin/ld: libcrypto_hash_k12.a(KeccakSpongeWidth1600.o): in function `KeccakWidth1600_Sponge(unsigned int, unsigned int, unsigned char const*, unsigned long, unsigned char, unsigned char*, unsigned long)':
try.cpp: KeccakSpongeWidth1600.c:(.text+0x...): undefined reference to `KeccakP1600_StaticInitialize()'
try.cpp: /usr/bin/ld: KeccakSpongeWidth1600.c:(.text+0x...): undefined reference to `KeccakP1600_Initialize(void*)'
try.cpp: /usr/bin/ld: KeccakSpongeWidth1600.c:(.text+0x...): undefined reference to `KeccakP1600_AddBytes(void*, unsigned char const*, unsigned int, unsigned int)'
try.cpp: /usr/bin/ld: KeccakSpongeWidth1600.c:(.text+0x...): undefined reference to `KeccakP1600_AddByte(void*, unsigned char, unsigned int)'
try.cpp: /usr/bin/ld: KeccakSpongeWidth1600.c:(.text+0x...): undefined reference to `KeccakP1600_AddByte(void*, unsigned char, unsigned int)'
try.cpp: /usr/bin/ld: KeccakSpongeWidth1600.c:(.text+0x...): undefined reference to `KeccakP1600_Permute_24rounds(void*)'
try.cpp: /usr/bin/ld: KeccakSpongeWidth1600.c:(.text+0x...): undefined reference to `KeccakP1600_ExtractBytes(void const*, unsigned char*, unsigned int, unsigned int)'
try.cpp: /usr/bin/ld: KeccakSpongeWidth1600.c:(.text+0x...): undefined reference to `KeccakP1600_Permute_24rounds(void*)'
try.cpp: /usr/bin/ld: KeccakSpongeWidth1600.c:(.text+0x...): undefined reference to `KeccakP1600_ExtractBytes(void const*, unsigned char*, unsigned int, unsigned int)'
try.cpp: /usr/bin/ld: KeccakSpongeWidth1600.c:(.text+0x...): undefined reference to `KeccakP1600_AddBytes(void*, unsigned char const*, unsigned int, unsigned int)'
try.cpp: /usr/bin/ld: KeccakSpongeWidth1600.c:(.text+0x...): undefined reference to `KeccakP1600_Permute_24rounds(void*)'
try.cpp: /usr/bin/ld: KeccakSpongeWidth1600.c:(.text+0x...): undefined reference to `KeccakF1600_FastLoop_Absorb(void*, unsigned int, unsigned char const*, unsigned long)'
try.cpp: /usr/bin/ld: KeccakSpongeWidth1600.c:(.text+0x...): undefined reference to `KeccakP1600_Permute_24rounds(void*)'
try.cpp: /usr/bin/ld: libcrypto_hash_k12.a(KeccakSpongeWidth1600.o): in function `KeccakWidth1600_SpongeInitialize(KeccakWidth1600_SpongeInstanceStruct*, unsigned int, unsigned int)':
try.cpp: KeccakSpongeWidth1600.c:(.text+0x...): undefined reference to `KeccakP1600_StaticInitialize()'
try.cpp: /usr/bin/ld: KeccakSpongeWidth1600.c:(.text+0x...): undefined reference to `KeccakP1600_Initialize(void*)'
try.cpp: /usr/bin/ld: libcrypto_hash_k12.a(KeccakSpongeWidth1600.o): in function `KeccakWidth1600_SpongeAbsorb(KeccakWidth1600_SpongeInstanceStruct*, unsigned char const*, unsigned long)':
try.cpp: KeccakSpongeWidth1600.c:(.text+0x...): undefined reference to `KeccakF1600_FastLoop_Absorb(void*, unsigned int, unsigned char const*, unsigned long)'
try.cpp: /usr/bin/ld: KeccakSpongeWidth1600.c:(.text+0x...): undefined reference to `KeccakP1600_AddBytes(void*, unsigned char const*, unsigned int, unsigned int)'
try.cpp: /usr/bin/ld: KeccakSpongeWidth1600.c:(.text+0x...): undefined reference to `KeccakP1600_Permute_24rounds(void*)'
try.cpp: /usr/bin/ld: KeccakSpongeWidth1600.c:(.text+0x...): undefined reference to `KeccakP1600_AddBytes(void*, unsigned char const*, unsigned int, unsigned int)'
try.cpp: /usr/bin/ld: KeccakSpongeWidth1600.c:(.text+0x...): undefined reference to `KeccakP1600_Permute_24rounds(void*)'
try.cpp: /usr/bin/ld: libcrypto_hash_k12.a(KeccakSpongeWidth1600.o): in function `KeccakWidth1600_SpongeAbsorbLastFewBits(KeccakWidth1600_SpongeInstanceStruct*, unsigned char)':
try.cpp: KeccakSpongeWidth1600.c:(.text+0x...): undefined reference to `KeccakP1600_AddByte(void*, unsigned char, unsigned int)'
try.cpp: ...

Number of similar (compiler,implementation) pairs: 2, namely:
CompilerImplementations
g++ -march=native -mtune=native -O2 -fomit-frame-pointer -fwrapv -fPIC -fPIE T:kcp/optimized1600AVX2
g++ -march=native -mtune=native -O3 -fomit-frame-pointer -fwrapv -fPIC -fPIE T:kcp/optimized1600AVX2

Compiler output

Implementation: T:kcp/optimized1600AVX2
Security model: timingleaks
Compiler: g++ -march=native -mtune=native -O -fomit-frame-pointer -fwrapv -fPIC -fPIE
try.cpp: /usr/bin/ld: libcrypto_hash_k12.a(KeccakSpongeWidth1600.o): in function `KeccakWidth1600_Sponge(unsigned int, unsigned int, unsigned char const*, unsigned long, unsigned char, unsigned char*, unsigned long)':
try.cpp: KeccakSpongeWidth1600.c:(.text+0x...): undefined reference to `KeccakP1600_StaticInitialize()'
try.cpp: /usr/bin/ld: KeccakSpongeWidth1600.c:(.text+0x...): undefined reference to `KeccakP1600_Initialize(void*)'
try.cpp: /usr/bin/ld: KeccakSpongeWidth1600.c:(.text+0x...): undefined reference to `KeccakF1600_FastLoop_Absorb(void*, unsigned int, unsigned char const*, unsigned long)'
try.cpp: /usr/bin/ld: KeccakSpongeWidth1600.c:(.text+0x...): undefined reference to `KeccakP1600_AddBytes(void*, unsigned char const*, unsigned int, unsigned int)'
try.cpp: /usr/bin/ld: KeccakSpongeWidth1600.c:(.text+0x...): undefined reference to `KeccakP1600_Permute_24rounds(void*)'
try.cpp: /usr/bin/ld: KeccakSpongeWidth1600.c:(.text+0x...): undefined reference to `KeccakP1600_AddBytes(void*, unsigned char const*, unsigned int, unsigned int)'
try.cpp: /usr/bin/ld: KeccakSpongeWidth1600.c:(.text+0x...): undefined reference to `KeccakP1600_AddByte(void*, unsigned char, unsigned int)'
try.cpp: /usr/bin/ld: KeccakSpongeWidth1600.c:(.text+0x...): undefined reference to `KeccakP1600_AddByte(void*, unsigned char, unsigned int)'
try.cpp: /usr/bin/ld: KeccakSpongeWidth1600.c:(.text+0x...): undefined reference to `KeccakP1600_Permute_24rounds(void*)'
try.cpp: /usr/bin/ld: KeccakSpongeWidth1600.c:(.text+0x...): undefined reference to `KeccakP1600_ExtractBytes(void const*, unsigned char*, unsigned int, unsigned int)'
try.cpp: /usr/bin/ld: KeccakSpongeWidth1600.c:(.text+0x...): undefined reference to `KeccakP1600_Permute_24rounds(void*)'
try.cpp: /usr/bin/ld: KeccakSpongeWidth1600.c:(.text+0x...): undefined reference to `KeccakP1600_ExtractBytes(void const*, unsigned char*, unsigned int, unsigned int)'
try.cpp: /usr/bin/ld: KeccakSpongeWidth1600.c:(.text+0x...): undefined reference to `KeccakP1600_Permute_24rounds(void*)'
try.cpp: /usr/bin/ld: libcrypto_hash_k12.a(KeccakSpongeWidth1600.o): in function `KeccakWidth1600_SpongeInitialize(KeccakWidth1600_SpongeInstanceStruct*, unsigned int, unsigned int)':
try.cpp: KeccakSpongeWidth1600.c:(.text+0x...): undefined reference to `KeccakP1600_StaticInitialize()'
try.cpp: /usr/bin/ld: KeccakSpongeWidth1600.c:(.text+0x...): undefined reference to `KeccakP1600_Initialize(void*)'
try.cpp: /usr/bin/ld: libcrypto_hash_k12.a(KeccakSpongeWidth1600.o): in function `KeccakWidth1600_SpongeAbsorb(KeccakWidth1600_SpongeInstanceStruct*, unsigned char const*, unsigned long)':
try.cpp: KeccakSpongeWidth1600.c:(.text+0x...): undefined reference to `KeccakP1600_AddBytes(void*, unsigned char const*, unsigned int, unsigned int)'
try.cpp: /usr/bin/ld: KeccakSpongeWidth1600.c:(.text+0x...): undefined reference to `KeccakP1600_Permute_24rounds(void*)'
try.cpp: /usr/bin/ld: KeccakSpongeWidth1600.c:(.text+0x...): undefined reference to `KeccakP1600_AddBytes(void*, unsigned char const*, unsigned int, unsigned int)'
try.cpp: /usr/bin/ld: KeccakSpongeWidth1600.c:(.text+0x...): undefined reference to `KeccakF1600_FastLoop_Absorb(void*, unsigned int, unsigned char const*, unsigned long)'
try.cpp: /usr/bin/ld: KeccakSpongeWidth1600.c:(.text+0x...): undefined reference to `KeccakP1600_Permute_24rounds(void*)'
try.cpp: /usr/bin/ld: libcrypto_hash_k12.a(KeccakSpongeWidth1600.o): in function `KeccakWidth1600_SpongeAbsorbLastFewBits(KeccakWidth1600_SpongeInstanceStruct*, unsigned char)':
try.cpp: KeccakSpongeWidth1600.c:(.text+0x...): undefined reference to `KeccakP1600_AddByte(void*, unsigned char, unsigned int)'
try.cpp: ...

Number of similar (compiler,implementation) pairs: 1, namely:
CompilerImplementations
g++ -march=native -mtune=native -O -fomit-frame-pointer -fwrapv -fPIC -fPIE T:kcp/optimized1600AVX2

Compiler output

Implementation: T:kcp/optimized1600AVX2
Security model: timingleaks
Compiler: g++ -march=native -mtune=native -Os -fomit-frame-pointer -fwrapv -fPIC -fPIE
try.cpp: /usr/bin/ld: libcrypto_hash_k12.a(KeccakSpongeWidth1600.o): in function `KeccakWidth1600_Sponge(unsigned int, unsigned int, unsigned char const*, unsigned long, unsigned char, unsigned char*, unsigned long)':
try.cpp: KeccakSpongeWidth1600.c:(.text+0x...): undefined reference to `KeccakP1600_StaticInitialize()'
try.cpp: /usr/bin/ld: KeccakSpongeWidth1600.c:(.text+0x...): undefined reference to `KeccakP1600_Initialize(void*)'
try.cpp: /usr/bin/ld: KeccakSpongeWidth1600.c:(.text+0x...): undefined reference to `KeccakF1600_FastLoop_Absorb(void*, unsigned int, unsigned char const*, unsigned long)'
try.cpp: /usr/bin/ld: KeccakSpongeWidth1600.c:(.text+0x...): undefined reference to `KeccakP1600_AddBytes(void*, unsigned char const*, unsigned int, unsigned int)'
try.cpp: /usr/bin/ld: KeccakSpongeWidth1600.c:(.text+0x...): undefined reference to `KeccakP1600_Permute_24rounds(void*)'
try.cpp: /usr/bin/ld: KeccakSpongeWidth1600.c:(.text+0x...): undefined reference to `KeccakP1600_AddBytes(void*, unsigned char const*, unsigned int, unsigned int)'
try.cpp: /usr/bin/ld: KeccakSpongeWidth1600.c:(.text+0x...): undefined reference to `KeccakP1600_AddByte(void*, unsigned char, unsigned int)'
try.cpp: /usr/bin/ld: KeccakSpongeWidth1600.c:(.text+0x...): undefined reference to `KeccakP1600_Permute_24rounds(void*)'
try.cpp: /usr/bin/ld: KeccakSpongeWidth1600.c:(.text+0x...): undefined reference to `KeccakP1600_AddByte(void*, unsigned char, unsigned int)'
try.cpp: /usr/bin/ld: KeccakSpongeWidth1600.c:(.text+0x...): undefined reference to `KeccakP1600_Permute_24rounds(void*)'
try.cpp: /usr/bin/ld: KeccakSpongeWidth1600.c:(.text+0x...): undefined reference to `KeccakP1600_ExtractBytes(void const*, unsigned char*, unsigned int, unsigned int)'
try.cpp: /usr/bin/ld: KeccakSpongeWidth1600.c:(.text+0x...): undefined reference to `KeccakP1600_Permute_24rounds(void*)'
try.cpp: /usr/bin/ld: KeccakSpongeWidth1600.c:(.text+0x...): undefined reference to `KeccakP1600_ExtractBytes(void const*, unsigned char*, unsigned int, unsigned int)'
try.cpp: /usr/bin/ld: libcrypto_hash_k12.a(KeccakSpongeWidth1600.o): in function `KeccakWidth1600_SpongeInitialize(KeccakWidth1600_SpongeInstanceStruct*, unsigned int, unsigned int)':
try.cpp: KeccakSpongeWidth1600.c:(.text+0x...): undefined reference to `KeccakP1600_StaticInitialize()'
try.cpp: /usr/bin/ld: KeccakSpongeWidth1600.c:(.text+0x...): undefined reference to `KeccakP1600_Initialize(void*)'
try.cpp: /usr/bin/ld: libcrypto_hash_k12.a(KeccakSpongeWidth1600.o): in function `KeccakWidth1600_SpongeAbsorb(KeccakWidth1600_SpongeInstanceStruct*, unsigned char const*, unsigned long)':
try.cpp: KeccakSpongeWidth1600.c:(.text+0x...): undefined reference to `KeccakF1600_FastLoop_Absorb(void*, unsigned int, unsigned char const*, unsigned long)'
try.cpp: /usr/bin/ld: KeccakSpongeWidth1600.c:(.text+0x...): undefined reference to `KeccakP1600_AddBytes(void*, unsigned char const*, unsigned int, unsigned int)'
try.cpp: /usr/bin/ld: KeccakSpongeWidth1600.c:(.text+0x...): undefined reference to `KeccakP1600_Permute_24rounds(void*)'
try.cpp: /usr/bin/ld: KeccakSpongeWidth1600.c:(.text+0x...): undefined reference to `KeccakP1600_AddBytes(void*, unsigned char const*, unsigned int, unsigned int)'
try.cpp: /usr/bin/ld: KeccakSpongeWidth1600.c:(.text+0x...): undefined reference to `KeccakP1600_Permute_24rounds(void*)'
try.cpp: /usr/bin/ld: libcrypto_hash_k12.a(KeccakSpongeWidth1600.o): in function `KeccakWidth1600_SpongeAbsorbLastFewBits(KeccakWidth1600_SpongeInstanceStruct*, unsigned char)':
try.cpp: KeccakSpongeWidth1600.c:(.text+0x...): undefined reference to `KeccakP1600_AddByte(void*, unsigned char, unsigned int)'
try.cpp: ...

Number of similar (compiler,implementation) pairs: 1, namely:
CompilerImplementations
g++ -march=native -mtune=native -Os -fomit-frame-pointer -fwrapv -fPIC -fPIE T:kcp/optimized1600AVX2

Compiler output

Implementation: T:kcp/optimized1600AVX512
Security model: timingleaks
Compiler: clang -march=native -O2 -fomit-frame-pointer -fwrapv -Qunused-arguments -fPIC -fPIE
KeccakP-1600-AVX512.c: KeccakP-1600-AVX512.c:238:41: error: always_inline function '_mm512_maskz_loadu_epi64' requires target feature 'avx512f', but would be inlined into function 'KeccakP1600_AddBytes' that is compiled without support for 'avx512f'
KeccakP-1600-AVX512.c: STORE_8Lanes( stateAsLanes, XOR(LOAD_8Lanes(stateAsLanes), LOAD_8Lanes((const UINT64*)data)));
KeccakP-1600-AVX512.c: ^
KeccakP-1600-AVX512.c: KeccakP-1600-AVX512.c:215:37: note: expanded from macro 'LOAD_8Lanes'
KeccakP-1600-AVX512.c: #define LOAD_8Lanes(a) LOAD_Lanes(0xFF,a)
KeccakP-1600-AVX512.c: ^
KeccakP-1600-AVX512.c: KeccakP-1600-AVX512.c:212:37: note: expanded from macro 'LOAD_Lanes'
KeccakP-1600-AVX512.c: #define LOAD_Lanes(m,a) _mm512_maskz_loadu_epi64(m,a)
KeccakP-1600-AVX512.c: ^
KeccakP-1600-AVX512.c: KeccakP-1600-AVX512.c:238:41: error: AVX vector return of type '__m512i' (vector of 8 'long long' values) without 'avx512f' enabled changes the ABI
KeccakP-1600-AVX512.c: KeccakP-1600-AVX512.c:215:37: note: expanded from macro 'LOAD_8Lanes'
KeccakP-1600-AVX512.c: #define LOAD_8Lanes(a) LOAD_Lanes(0xFF,a)
KeccakP-1600-AVX512.c: ^
KeccakP-1600-AVX512.c: KeccakP-1600-AVX512.c:212:37: note: expanded from macro 'LOAD_Lanes'
KeccakP-1600-AVX512.c: #define LOAD_Lanes(m,a) _mm512_maskz_loadu_epi64(m,a)
KeccakP-1600-AVX512.c: ^
KeccakP-1600-AVX512.c: KeccakP-1600-AVX512.c:238:68: error: always_inline function '_mm512_maskz_loadu_epi64' requires target feature 'avx512f', but would be inlined into function 'KeccakP1600_AddBytes' that is compiled without support for 'avx512f'
KeccakP-1600-AVX512.c: STORE_8Lanes( stateAsLanes, XOR(LOAD_8Lanes(stateAsLanes), LOAD_8Lanes((const UINT64*)data)));
KeccakP-1600-AVX512.c: ^
KeccakP-1600-AVX512.c: KeccakP-1600-AVX512.c:215:37: note: expanded from macro 'LOAD_8Lanes'
KeccakP-1600-AVX512.c: #define LOAD_8Lanes(a) LOAD_Lanes(0xFF,a)
KeccakP-1600-AVX512.c: ^
KeccakP-1600-AVX512.c: KeccakP-1600-AVX512.c:212:37: note: expanded from macro 'LOAD_Lanes'
KeccakP-1600-AVX512.c: #define LOAD_Lanes(m,a) _mm512_maskz_loadu_epi64(m,a)
KeccakP-1600-AVX512.c: ^
KeccakP-1600-AVX512.c: ...

Number of similar (compiler,implementation) pairs: 5, namely:
CompilerImplementations
clang -march=native -O2 -fomit-frame-pointer -fwrapv -Qunused-arguments -fPIC -fPIE T:kcp/optimized1600AVX512
clang -march=native -O3 -fomit-frame-pointer -fwrapv -Qunused-arguments -fPIC -fPIE T:kcp/optimized1600AVX512
clang -march=native -O -fomit-frame-pointer -fwrapv -Qunused-arguments -fPIC -fPIE T:kcp/optimized1600AVX512
clang -march=native -Os -fomit-frame-pointer -fwrapv -Qunused-arguments -fPIC -fPIE T:kcp/optimized1600AVX512
clang -mcpu=native -O3 -fomit-frame-pointer -fwrapv -Qunused-arguments -fPIC -fPIE T:kcp/optimized1600AVX512

Compiler output

Implementation: T:kcp/optimized1600AVX512
Security model: timingleaks
Compiler: gcc -march=native -mtune=native -O2 -fomit-frame-pointer -fwrapv -fPIC -fPIE
KeccakP-1600-AVX512.c: KeccakP-1600-AVX512.c: In function 'KeccakP1600_AddBytes':
KeccakP-1600-AVX512.c: KeccakP-1600-AVX512.c:216:37: warning: AVX512F vector return without AVX512F enabled changes the ABI [-Wpsabi]
KeccakP-1600-AVX512.c: 216 | #define STORE_Lanes(a,m,v) _mm512_mask_storeu_epi64(a,m,v)
KeccakP-1600-AVX512.c: | ^~~~~~~~~~~~~~~~~~~~~~~~~~~~~~~
KeccakP-1600-AVX512.c: KeccakP-1600-AVX512.c:219:37: note: in expansion of macro 'STORE_Lanes'
KeccakP-1600-AVX512.c: 219 | #define STORE_8Lanes(a,v) STORE_Lanes(a,0xFF,v)
KeccakP-1600-AVX512.c: | ^~~~~~~~~~~
KeccakP-1600-AVX512.c: KeccakP-1600-AVX512.c:238:9: note: in expansion of macro 'STORE_8Lanes'
KeccakP-1600-AVX512.c: 238 | STORE_8Lanes( stateAsLanes, XOR(LOAD_8Lanes(stateAsLanes), LOAD_8Lanes((const UINT64*)data)));
KeccakP-1600-AVX512.c: | ^~~~~~~~~~~~
KeccakP-1600-AVX512.c: In file included from /usr/lib/gcc/x86_64-linux-gnu/10/include/immintrin.h:55,
KeccakP-1600-AVX512.c: from KeccakP-1600-AVX512.c:26:
KeccakP-1600-AVX512.c: /usr/lib/gcc/x86_64-linux-gnu/10/include/avx512fintrin.h:6388:1: error: inlining failed in call to 'always_inline' '_mm512_mask_storeu_epi64': target specific option mismatch
KeccakP-1600-AVX512.c: 6388 | _mm512_mask_storeu_epi64 (void *__P, __mmask8 __U, __m512i __A)
KeccakP-1600-AVX512.c: | ^~~~~~~~~~~~~~~~~~~~~~~~
KeccakP-1600-AVX512.c: KeccakP-1600-AVX512.c:216:37: note: called from here
KeccakP-1600-AVX512.c: 216 | #define STORE_Lanes(a,m,v) _mm512_mask_storeu_epi64(a,m,v)
KeccakP-1600-AVX512.c: | ^~~~~~~~~~~~~~~~~~~~~~~~~~~~~~~
KeccakP-1600-AVX512.c: KeccakP-1600-AVX512.c:219:37: note: in expansion of macro 'STORE_Lanes'
KeccakP-1600-AVX512.c: 219 | #define STORE_8Lanes(a,v) STORE_Lanes(a,0xFF,v)
KeccakP-1600-AVX512.c: | ^~~~~~~~~~~
KeccakP-1600-AVX512.c: KeccakP-1600-AVX512.c:238:9: note: in expansion of macro 'STORE_8Lanes'
KeccakP-1600-AVX512.c: 238 | STORE_8Lanes( stateAsLanes, XOR(LOAD_8Lanes(stateAsLanes), LOAD_8Lanes((const UINT64*)data)));
KeccakP-1600-AVX512.c: | ^~~~~~~~~~~~
KeccakP-1600-AVX512.c: In file included from /usr/lib/gcc/x86_64-linux-gnu/10/include/immintrin.h:55,
KeccakP-1600-AVX512.c: ...

Number of similar (compiler,implementation) pairs: 4, namely:
CompilerImplementations
gcc -march=native -mtune=native -O2 -fomit-frame-pointer -fwrapv -fPIC -fPIE T:kcp/optimized1600AVX512
gcc -march=native -mtune=native -O3 -fomit-frame-pointer -fwrapv -fPIC -fPIE T:kcp/optimized1600AVX512
gcc -march=native -mtune=native -O -fomit-frame-pointer -fwrapv -fPIC -fPIE T:kcp/optimized1600AVX512
gcc -march=native -mtune=native -Os -fomit-frame-pointer -fwrapv -fPIC -fPIE T:kcp/optimized1600AVX512

Compiler output

Implementation: T:kcp/optimized1600AsmX86-64
Security model: timingleaks
Compiler: gcc -march=native -mtune=native -O2 -fomit-frame-pointer -fwrapv -fPIC -fPIE
try.c: /usr/bin/ld: libcrypto_hash_k12.a(keccak.o): relocation R_X86_64_32S against `.text' can not be used when making a PIE object; recompile with -fPIE
try.c: collect2: error: ld returned 1 exit status

Number of similar (compiler,implementation) pairs: 8, namely:
CompilerImplementations
gcc -march=native -mtune=native -O2 -fomit-frame-pointer -fwrapv -fPIC -fPIE T:kcp/optimized1600AsmX86-64
gcc -march=native -mtune=native -O3 -fomit-frame-pointer -fwrapv -fPIC -fPIE T:kcp/optimized1600AsmX86-64
gcc -march=native -mtune=native -O -fomit-frame-pointer -fwrapv -fPIC -fPIE T:kcp/optimized1600AsmX86-64
gcc -march=native -mtune=native -Os -fomit-frame-pointer -fwrapv -fPIC -fPIE T:kcp/optimized1600AsmX86-64
gcc -march=native -mtune=native -O2 -fomit-frame-pointer -fwrapv -fPIC -fPIE T:kcp/optimized1600AsmX86-64shld
gcc -march=native -mtune=native -O3 -fomit-frame-pointer -fwrapv -fPIC -fPIE T:kcp/optimized1600AsmX86-64shld
gcc -march=native -mtune=native -O -fomit-frame-pointer -fwrapv -fPIC -fPIE T:kcp/optimized1600AsmX86-64shld
gcc -march=native -mtune=native -Os -fomit-frame-pointer -fwrapv -fPIC -fPIE T:kcp/optimized1600AsmX86-64shld

Compiler output

Implementation: T:kcp/optimized1600AsmX86-64Apple
Security model: timingleaks
Compiler: clang -march=native -O2 -fomit-frame-pointer -fwrapv -Qunused-arguments -fPIC -fPIE
keccak.s: keccak.s:555:24: error: expected register here
keccak.s: movq %rax, _ba(arg1)
keccak.s: ^
keccak.s: keccak.s:556:24: error: expected register here
keccak.s: movq %rcx, _be(arg1)
keccak.s: ^
keccak.s: keccak.s:557:24: error: expected register here
keccak.s: movq %rcx, _bi(arg1)
keccak.s: ^
keccak.s: keccak.s:558:24: error: expected register here
keccak.s: movq %rax, _bo(arg1)
keccak.s: ^
keccak.s: keccak.s:559:24: error: expected register here
keccak.s: movdqu %xmm0, _bu(arg1)
keccak.s: ^
keccak.s: keccak.s:560:24: error: expected register here
keccak.s: movdqu %xmm0, _ge(arg1)
keccak.s: ^
keccak.s: keccak.s:561:24: error: expected register here
keccak.s: movq %rcx, _go(arg1)
keccak.s: ^
keccak.s: keccak.s:562:24: error: expected register here
keccak.s: movq %rax, _gu(arg1)
keccak.s: ^
keccak.s: keccak.s:563:24: error: expected register here
keccak.s: ...

Number of similar (compiler,implementation) pairs: 5, namely:
CompilerImplementations
clang -march=native -O2 -fomit-frame-pointer -fwrapv -Qunused-arguments -fPIC -fPIE T:kcp/optimized1600AsmX86-64Apple
clang -march=native -O3 -fomit-frame-pointer -fwrapv -Qunused-arguments -fPIC -fPIE T:kcp/optimized1600AsmX86-64Apple
clang -march=native -O -fomit-frame-pointer -fwrapv -Qunused-arguments -fPIC -fPIE T:kcp/optimized1600AsmX86-64Apple
clang -march=native -Os -fomit-frame-pointer -fwrapv -Qunused-arguments -fPIC -fPIE T:kcp/optimized1600AsmX86-64Apple
clang -mcpu=native -O3 -fomit-frame-pointer -fwrapv -Qunused-arguments -fPIC -fPIE T:kcp/optimized1600AsmX86-64Apple

Compiler output

Implementation: T:kcp/optimized1600AsmX86-64Apple
Security model: timingleaks
Compiler: gcc -march=native -mtune=native -O2 -fomit-frame-pointer -fwrapv -fPIC -fPIE
keccak.s: keccak.s: Assembler messages:
keccak.s: keccak.s:555: Error: junk `(arg1)' after expression
keccak.s: keccak.s:556: Error: junk `(arg1)' after expression
keccak.s: keccak.s:557: Error: junk `(arg1)' after expression
keccak.s: keccak.s:558: Error: junk `(arg1)' after expression
keccak.s: keccak.s:559: Error: junk `(arg1)' after expression
keccak.s: keccak.s:560: Error: junk `(arg1)' after expression
keccak.s: keccak.s:561: Error: junk `(arg1)' after expression
keccak.s: keccak.s:562: Error: junk `(arg1)' after expression
keccak.s: keccak.s:563: Error: junk `(arg1)' after expression
keccak.s: keccak.s:564: Error: junk `(arg1)' after expression
keccak.s: keccak.s:565: Error: junk `(arg1)' after expression
keccak.s: keccak.s:566: Error: junk `(arg1)' after expression
keccak.s: keccak.s:567: Error: junk `(arg1)' after expression
keccak.s: keccak.s:568: Error: junk `(arg1)' after expression
keccak.s: keccak.s:569: Error: junk `(arg1)' after expression
keccak.s: keccak.s:570: Error: junk `(arg1)' after expression
keccak.s: keccak.s:571: Error: junk `(arg1)' after expression
keccak.s: keccak.s:572: Error: junk `(arg1)' after expression
keccak.s: keccak.s:573: Error: junk `(arg1)' after expression
keccak.s: keccak.s:583: Error: too many memory references for `add'
keccak.s: keccak.s:598: Error: too many memory references for `add'
keccak.s: keccak.s:601: Error: too many memory references for `movq'
keccak.s: keccak.s:605: Error: junk `(arg2)' after expression
keccak.s: keccak.s:605: Error: junk `(arg1)' after expression
keccak.s: ...

Number of similar (compiler,implementation) pairs: 4, namely:
CompilerImplementations
gcc -march=native -mtune=native -O2 -fomit-frame-pointer -fwrapv -fPIC -fPIE T:kcp/optimized1600AsmX86-64Apple
gcc -march=native -mtune=native -O3 -fomit-frame-pointer -fwrapv -fPIC -fPIE T:kcp/optimized1600AsmX86-64Apple
gcc -march=native -mtune=native -O -fomit-frame-pointer -fwrapv -fPIC -fPIE T:kcp/optimized1600AsmX86-64Apple
gcc -march=native -mtune=native -Os -fomit-frame-pointer -fwrapv -fPIC -fPIE T:kcp/optimized1600AsmX86-64Apple

Compiler output

Implementation: T:kcp/optimized1600XOPu6
Security model: timingleaks
Compiler: clang -march=native -O2 -fomit-frame-pointer -fwrapv -Qunused-arguments -fPIC -fPIE
KeccakP-1600-XOP.c: KeccakP-1600-XOP.c:400:5: error: '__builtin_ia32_vprotqi' needs target feature xop
KeccakP-1600-XOP.c: roundsN(nr)
KeccakP-1600-XOP.c: ^
KeccakP-1600-XOP.c: ./KeccakP-1600-unrolling.macros:297:9: note: expanded from macro 'roundsN'
KeccakP-1600-XOP.c: thetaRhoPiChiIotaPrepareTheta(i, A, E) \
KeccakP-1600-XOP.c: ^
KeccakP-1600-XOP.c: KeccakP-1600-XOP.c:200:5: note: expanded from macro 'thetaRhoPiChiIotaPrepareTheta'
KeccakP-1600-XOP.c: computeD \
KeccakP-1600-XOP.c: ^
KeccakP-1600-XOP.c: KeccakP-1600-XOP.c:187:23: note: expanded from macro 'computeD'
KeccakP-1600-XOP.c: Dei = XOR128(Cae, ROL6464same(Cio, 1)); \
KeccakP-1600-XOP.c: ^
KeccakP-1600-XOP.c: KeccakP-1600-XOP.c:60:29: note: expanded from macro 'ROL6464same'
KeccakP-1600-XOP.c: #define ROL6464same(a, o) _mm_roti_epi64(a, o)
KeccakP-1600-XOP.c: ^
KeccakP-1600-XOP.c: /usr/lib/llvm-11/lib/clang/11.0.1/include/xopintrin.h:237:12: note: expanded from macro '_mm_roti_epi64'
KeccakP-1600-XOP.c: (__m128i)__builtin_ia32_vprotqi((__v2di)(__m128i)(A), (N))
KeccakP-1600-XOP.c: ^
KeccakP-1600-XOP.c: KeccakP-1600-XOP.c:400:5: error: '__builtin_ia32_vprotqi' needs target feature xop
KeccakP-1600-XOP.c: ./KeccakP-1600-unrolling.macros:297:9: note: expanded from macro 'roundsN'
KeccakP-1600-XOP.c: thetaRhoPiChiIotaPrepareTheta(i, A, E) \
KeccakP-1600-XOP.c: ^
KeccakP-1600-XOP.c: KeccakP-1600-XOP.c:200:5: note: expanded from macro 'thetaRhoPiChiIotaPrepareTheta'
KeccakP-1600-XOP.c: computeD \
KeccakP-1600-XOP.c: ^
KeccakP-1600-XOP.c: ...

Number of similar (compiler,implementation) pairs: 10, namely:
CompilerImplementations
clang -march=native -O2 -fomit-frame-pointer -fwrapv -Qunused-arguments -fPIC -fPIE T:kcp/optimized1600XOPu6
clang -march=native -O3 -fomit-frame-pointer -fwrapv -Qunused-arguments -fPIC -fPIE T:kcp/optimized1600XOPu6
clang -march=native -O -fomit-frame-pointer -fwrapv -Qunused-arguments -fPIC -fPIE T:kcp/optimized1600XOPu6
clang -march=native -Os -fomit-frame-pointer -fwrapv -Qunused-arguments -fPIC -fPIE T:kcp/optimized1600XOPu6
clang -mcpu=native -O3 -fomit-frame-pointer -fwrapv -Qunused-arguments -fPIC -fPIE T:kcp/optimized1600XOPu6
clang -march=native -O2 -fomit-frame-pointer -fwrapv -Qunused-arguments -fPIC -fPIE T:kcp/optimized1600XOPufull
clang -march=native -O3 -fomit-frame-pointer -fwrapv -Qunused-arguments -fPIC -fPIE T:kcp/optimized1600XOPufull
clang -march=native -O -fomit-frame-pointer -fwrapv -Qunused-arguments -fPIC -fPIE T:kcp/optimized1600XOPufull
clang -march=native -Os -fomit-frame-pointer -fwrapv -Qunused-arguments -fPIC -fPIE T:kcp/optimized1600XOPufull
clang -mcpu=native -O3 -fomit-frame-pointer -fwrapv -Qunused-arguments -fPIC -fPIE T:kcp/optimized1600XOPufull

Compiler output

Implementation: T:kcp/optimized1600XOPu6
Security model: timingleaks
Compiler: gcc -march=native -mtune=native -O2 -fomit-frame-pointer -fwrapv -fPIC -fPIE
KeccakP-1600-XOP.c: In file included from /usr/lib/gcc/x86_64-linux-gnu/10/include/x86intrin.h:38,
KeccakP-1600-XOP.c: from KeccakP-1600-XOP.c:32:
KeccakP-1600-XOP.c: KeccakP-1600-XOP.c: In function 'KeccakP1600_Permute_Nrounds':
KeccakP-1600-XOP.c: /usr/lib/gcc/x86_64-linux-gnu/10/include/xopintrin.h:272:1: error: inlining failed in call to 'always_inline' '_mm_roti_epi64': target specific option mismatch
KeccakP-1600-XOP.c: 272 | _mm_roti_epi64(__m128i __A, const int __B)
KeccakP-1600-XOP.c: | ^~~~~~~~~~~~~~
KeccakP-1600-XOP.c: KeccakP-1600-XOP.c:60:29: note: called from here
KeccakP-1600-XOP.c: 60 | #define ROL6464same(a, o) _mm_roti_epi64(a, o)
KeccakP-1600-XOP.c: | ^~~~~~~~~~~~~~~~~~~~
KeccakP-1600-XOP.c: KeccakP-1600-XOP.c:250:13: note: in expansion of macro 'ROL6464same'
KeccakP-1600-XOP.c: 250 | Bsusa = ROL6464same(Bsusa, 2); \
KeccakP-1600-XOP.c: | ^~~~~~~~~~~
KeccakP-1600-XOP.c: KeccakP-1600-unrolling.macros:297:9: note: in expansion of macro 'thetaRhoPiChiIotaPrepareTheta'
KeccakP-1600-XOP.c: 297 | thetaRhoPiChiIotaPrepareTheta(i, A, E) \
KeccakP-1600-XOP.c: | ^~~~~~~~~~~~~~~~~~~~~~~~~~~~~
KeccakP-1600-XOP.c: KeccakP-1600-XOP.c:400:5: note: in expansion of macro 'roundsN'
KeccakP-1600-XOP.c: 400 | roundsN(nr)
KeccakP-1600-XOP.c: | ^~~~~~~
KeccakP-1600-XOP.c: In file included from /usr/lib/gcc/x86_64-linux-gnu/10/include/x86intrin.h:38,
KeccakP-1600-XOP.c: from KeccakP-1600-XOP.c:32:
KeccakP-1600-XOP.c: /usr/lib/gcc/x86_64-linux-gnu/10/include/xopintrin.h:245:1: error: inlining failed in call to 'always_inline' '_mm_rot_epi64': target specific option mismatch
KeccakP-1600-XOP.c: 245 | _mm_rot_epi64(__m128i __A, __m128i __B)
KeccakP-1600-XOP.c: | ^~~~~~~~~~~~~
KeccakP-1600-XOP.c: KeccakP-1600-XOP.c:61:29: note: called from here
KeccakP-1600-XOP.c: 61 | #define ROL6464(a, r1, r2) _mm_rot_epi64(a, CONST128( rot_##r1##_##r2 ))
KeccakP-1600-XOP.c: ...

Number of similar (compiler,implementation) pairs: 8, namely:
CompilerImplementations
gcc -march=native -mtune=native -O2 -fomit-frame-pointer -fwrapv -fPIC -fPIE T:kcp/optimized1600XOPu6
gcc -march=native -mtune=native -O3 -fomit-frame-pointer -fwrapv -fPIC -fPIE T:kcp/optimized1600XOPu6
gcc -march=native -mtune=native -O -fomit-frame-pointer -fwrapv -fPIC -fPIE T:kcp/optimized1600XOPu6
gcc -march=native -mtune=native -Os -fomit-frame-pointer -fwrapv -fPIC -fPIE T:kcp/optimized1600XOPu6
gcc -march=native -mtune=native -O2 -fomit-frame-pointer -fwrapv -fPIC -fPIE T:kcp/optimized1600XOPufull
gcc -march=native -mtune=native -O3 -fomit-frame-pointer -fwrapv -fPIC -fPIE T:kcp/optimized1600XOPufull
gcc -march=native -mtune=native -O -fomit-frame-pointer -fwrapv -fPIC -fPIE T:kcp/optimized1600XOPufull
gcc -march=native -mtune=native -Os -fomit-frame-pointer -fwrapv -fPIC -fPIE T:kcp/optimized1600XOPufull