Implementation notes: amd64, alder2,1f626960,3300000, crypto_kem/hqc1921

Computer: alder2,1f626960,3300000
Microarchitecture: amd64; Gracemont (906a4-20)
Architecture: amd64
CPU ID: GenuineIntel-000906a4-20-bfebfbff
SUPERCOP version: 20240425
Operation: crypto_kem
Primitive: hqc1921
TimeObject sizeTest sizeImplementationCompilerBenchmark dateSUPERCOP version
370974937074 0 5265392 884 1816T:optgcc_-march=native_-mtune=native_-O3_-fomit-frame-pointer_-fwrapv_-fPIC_-fPIE2024050320240425
455356813431 0 5239230 876 1816T:optgcc_-march=native_-mtune=native_-O_-fomit-frame-pointer_-fwrapv_-fPIC_-fPIE2024050320240425
471487314368 0 5240856 884 1816T:optgcc_-march=native_-mtune=native_-O2_-fomit-frame-pointer_-fwrapv_-fPIC_-fPIE2024050320240425
474719910351 0 5234984 876 1784T:optgcc_-march=native_-mtune=native_-Os_-fomit-frame-pointer_-fwrapv_-fPIC_-fPIE2024050320240425

Compiler output

Implementation: T:opt
Security model: timingleaks
Compiler: clang -march=native -O2 -fomit-frame-pointer -fwrapv -Qunused-arguments -fPIC -fPIE
gf2x_avx2.c: gf2x_avx2.c:87:19: error: use of unknown builtin '__builtin_shuffle' [-Wimplicit-function-declaration]
gf2x_avx2.c: rightVector = __builtin_shuffle(
gf2x_avx2.c: ^
gf2x_avx2.c: gf2x_avx2.c:87:17: error: assigning to 'v8uint32' (vector of 8 'uint32_t' values) from incompatible type 'int'
gf2x_avx2.c: rightVector = __builtin_shuffle(
gf2x_avx2.c: ^ ~~~~~~~~~~~~~~~~~~
gf2x_avx2.c: gf2x_avx2.c:89:16: error: assigning to 'v8uint32' (vector of 8 'uint32_t' values) from incompatible type 'int'
gf2x_avx2.c: leftVector = __builtin_shuffle(
gf2x_avx2.c: ^ ~~~~~~~~~~~~~~~~~~
gf2x_avx2.c: 3 errors generated.

Number of similar (compiler,implementation) pairs: 5, namely:
CompilerImplementations
clang -march=native -O2 -fomit-frame-pointer -fwrapv -Qunused-arguments -fPIC -fPIE T:opt
clang -march=native -O3 -fomit-frame-pointer -fwrapv -Qunused-arguments -fPIC -fPIE T:opt
clang -march=native -O -fomit-frame-pointer -fwrapv -Qunused-arguments -fPIC -fPIE T:opt
clang -march=native -Os -fomit-frame-pointer -fwrapv -Qunused-arguments -fPIC -fPIE T:opt
clang -mcpu=native -O3 -fomit-frame-pointer -fwrapv -Qunused-arguments -fPIC -fPIE T:opt

Compiler output

Implementation: T:ref
Security model: timingleaks
Compiler: clang++ -march=native -O2 -fomit-frame-pointer -fwrapv -Qunused-arguments -fPIC -fPIE
rng.c: clang: warning: treating 'c' input as 'c++' when in C++ mode, this behavior is deprecated [-Wdeprecated]
gf2x.cpp: In file included from gf2x.cpp:6:
gf2x.cpp: ./gf2x.h:9:10: fatal error: 'NTL/GF2X.h' file not found
gf2x.cpp: #include <NTL/GF2X.h>
gf2x.cpp: ^~~~~~~~~~~~
gf2x.cpp: 1 error generated.

Number of similar (compiler,implementation) pairs: 4, namely:
CompilerImplementations
clang++ -march=native -O2 -fomit-frame-pointer -fwrapv -Qunused-arguments -fPIC -fPIE T:ref
clang++ -march=native -O3 -fomit-frame-pointer -fwrapv -Qunused-arguments -fPIC -fPIE T:ref
clang++ -march=native -O -fomit-frame-pointer -fwrapv -Qunused-arguments -fPIC -fPIE T:ref
clang++ -march=native -Os -fomit-frame-pointer -fwrapv -Qunused-arguments -fPIC -fPIE T:ref

Compiler output

Implementation: T:ref
Security model: timingleaks
Compiler: g++ -march=native -mtune=native -O2 -fomit-frame-pointer -fwrapv -fPIC -fPIE
gf2x.cpp: In file included from gf2x.cpp:6:
gf2x.cpp: gf2x.h:9:10: fatal error: NTL/GF2X.h: No such file or directory
gf2x.cpp: 9 | #include <NTL/GF2X.h>
gf2x.cpp: | ^~~~~~~~~~~~
gf2x.cpp: compilation terminated.

Number of similar (compiler,implementation) pairs: 4, namely:
CompilerImplementations
g++ -march=native -mtune=native -O2 -fomit-frame-pointer -fwrapv -fPIC -fPIE T:ref
g++ -march=native -mtune=native -O3 -fomit-frame-pointer -fwrapv -fPIC -fPIE T:ref
g++ -march=native -mtune=native -O -fomit-frame-pointer -fwrapv -fPIC -fPIE T:ref
g++ -march=native -mtune=native -Os -fomit-frame-pointer -fwrapv -fPIC -fPIE T:ref