Implementation notes: amd64, alder, crypto_hash/groestl512

Computer: alder
Microarchitecture: amd64; Golden Cove (90675-00)
Architecture: amd64
CPU ID: GenuineIntel-00090675-00-bfebfbff
SUPERCOP version: 20240625
Operation: crypto_hash
Primitive: groestl512
TimeObject sizeTest sizeImplementationCompilerBenchmark dateSUPERCOP version
189068346 0 166421487 788 2616T:avx-intrgcc_-march=native_-mtune=native_-O3_-fwrapv_-fPIC_-fPIE_-gdwarf-4_-Wall2024062620240625
189517714 0 166418823 788 2616T:avx-intrgcc_-march=native_-mtune=native_-O2_-fwrapv_-fPIC_-fPIE_-gdwarf-4_-Wall2024062620240625
192259570 0 123222711 788 2200T:aesni-intrgcc_-march=native_-mtune=native_-O3_-fwrapv_-fPIC_-fPIE_-gdwarf-4_-Wall2024062620240625
192597350 0 166418006 780 2616T:avx-intrgcc_-march=native_-mtune=native_-O_-fwrapv_-fPIC_-fPIE_-gdwarf-4_-Wall2024062620240625
192808898 0 123220007 788 2200T:aesni-intrgcc_-march=native_-mtune=native_-O2_-fwrapv_-fPIC_-fPIE_-gdwarf-4_-Wall2024062620240625
195308004 0 177618393 812 2680T:avx-intrclang_-march=native_-Os_-fwrapv_-Qunused-arguments_-fPIC_-fPIE_-gdwarf-4_-Wall2024062620240625
195449332 0 177622115 820 2712T:avx-intrclang_-march=native_-O2_-fwrapv_-Qunused-arguments_-fPIC_-fPIE_-gdwarf-4_-Wall2024062620240625
195449332 0 177622243 820 2712T:avx-intrclang_-march=native_-O3_-fwrapv_-Qunused-arguments_-fPIC_-fPIE_-gdwarf-4_-Wall2024062620240625
197138565 0 123219222 780 2200T:aesni-intrgcc_-march=native_-mtune=native_-O_-fwrapv_-fPIC_-fPIE_-gdwarf-4_-Wall2024062620240625
198689916 0 120022707 820 2104T:aesni-intrclang_-march=native_-O2_-fwrapv_-Qunused-arguments_-fPIC_-fPIE_-gdwarf-4_-Wall2024062620240625
199479916 0 120022851 820 2104T:aesni-intrclang_-march=native_-O3_-fwrapv_-Qunused-arguments_-fPIC_-fPIE_-gdwarf-4_-Wall2024062620240625
199638558 0 120018953 812 2104T:aesni-intrclang_-march=native_-Os_-fwrapv_-Qunused-arguments_-fPIC_-fPIE_-gdwarf-4_-Wall2024062620240625
200657214 0 166416882 764 2584T:avx-intrgcc_-march=native_-mtune=native_-Os_-fwrapv_-fPIC_-fPIE_-gdwarf-4_-Wall2024062620240625
206718503 0 123218178 764 2168T:aesni-intrgcc_-march=native_-mtune=native_-Os_-fwrapv_-fPIC_-fPIE_-gdwarf-4_-Wall2024062620240625
3241827174 0 039952 812 888T:opteronclang_-mcpu=native_-O3_-fwrapv_-Qunused-arguments_-fPIC_-fPIE_-gdwarf-4_-Wall2024062620240625
3265926758 0 039408 812 920T:opteronclang_-march=native_-O2_-fwrapv_-Qunused-arguments_-fPIC_-fPIE_-gdwarf-4_-Wall2024062620240625
3308426758 0 039552 812 920T:opteronclang_-march=native_-O3_-fwrapv_-Qunused-arguments_-fPIC_-fPIE_-gdwarf-4_-Wall2024062620240625
3320819090 0 152032231 788 2488T:vperm-intrgcc_-march=native_-mtune=native_-O3_-fwrapv_-fPIC_-fPIE_-gdwarf-4_-Wall2024062620240625
3325218418 0 152029527 788 2488T:vperm-intrgcc_-march=native_-mtune=native_-O2_-fwrapv_-fPIC_-fPIE_-gdwarf-4_-Wall2024062620240625
3357317878 0 152028534 780 2488T:vperm-intrgcc_-march=native_-mtune=native_-O_-fwrapv_-fPIC_-fPIE_-gdwarf-4_-Wall2024062620240625
3402926053 0 036302 804 888T:opteronclang_-march=native_-Os_-fwrapv_-Qunused-arguments_-fPIC_-fPIE_-gdwarf-4_-Wall2024062620240625
3480618447 0 152028114 764 2456T:vperm-intrgcc_-march=native_-mtune=native_-Os_-fwrapv_-fPIC_-fPIE_-gdwarf-4_-Wall2024062620240625
3497020531 0 230430937 812 3192T:vperm-intrclang_-march=native_-Os_-fwrapv_-Qunused-arguments_-fPIC_-fPIE_-gdwarf-4_-Wall2024062620240625
3499723409 0 230435363 820 3224T:vperm-intrclang_-march=native_-O2_-fwrapv_-Qunused-arguments_-fPIC_-fPIE_-gdwarf-4_-Wall2024062620240625
3502823409 0 230435507 820 3224T:vperm-intrclang_-march=native_-O3_-fwrapv_-Qunused-arguments_-fPIC_-fPIE_-gdwarf-4_-Wall2024062620240625
3545312873 0 270423521 812 3608T:avx-intrclang_-march=native_-O_-fwrapv_-Qunused-arguments_-fPIC_-fPIE_-gdwarf-4_-Wall2024062620240625
3717743738 0 053427 756 920T:sphlib-adaptedgcc_-march=native_-mtune=native_-Os_-fwrapv_-fPIC_-fPIE_-gdwarf-4_-Wall2024062620240625
3773450255 0 063384 780 952T:sphlib-adaptedgcc_-march=native_-mtune=native_-O3_-fwrapv_-fPIC_-fPIE_-gdwarf-4_-Wall2024062620240625
3812041062 0 050755 756 920T:sphlibgcc_-march=native_-mtune=native_-Os_-fwrapv_-fPIC_-fPIE_-gdwarf-4_-Wall2024062620240625
3835550927 0 062048 780 952T:sphlib-adaptedgcc_-march=native_-mtune=native_-O2_-fwrapv_-fPIC_-fPIE_-gdwarf-4_-Wall2024062620240625
3837048310 0 059056 780 952T:sphlib-adaptedgcc_-march=native_-mtune=native_-O_-fwrapv_-fPIC_-fPIE_-gdwarf-4_-Wall2024062620240625
3847844586 0 055336 780 952T:sphlibgcc_-march=native_-mtune=native_-O_-fwrapv_-fPIC_-fPIE_-gdwarf-4_-Wall2024062620240625
4065215881 0 174426553 812 2648T:aesni-intrclang_-march=native_-O_-fwrapv_-Qunused-arguments_-fPIC_-fPIE_-gdwarf-4_-Wall2024062620240625
4116247487 0 060616 780 952T:sphlibgcc_-march=native_-mtune=native_-O3_-fwrapv_-fPIC_-fPIE_-gdwarf-4_-Wall2024062620240625
4194045791 0 056912 780 952T:sphlibgcc_-march=native_-mtune=native_-O2_-fwrapv_-fPIC_-fPIE_-gdwarf-4_-Wall2024062620240625
4202427742 0 040520 812 888T:core2duoclang_-mcpu=native_-O3_-fwrapv_-Qunused-arguments_-fPIC_-fPIE_-gdwarf-4_-Wall2024062620240625
4503069589 0 082848 796 952T:mmxgcc_-march=native_-mtune=native_-O3_-fwrapv_-fPIC_-fPIE_-gdwarf-4_-Wall2024062620240625
4526952641 0 065424 812 920T:sphlib-adaptedclang_-march=native_-O2_-fwrapv_-Qunused-arguments_-fPIC_-fPIE_-gdwarf-4_-Wall2024062620240625
4570052641 0 065568 812 920T:sphlib-adaptedclang_-march=native_-O3_-fwrapv_-Qunused-arguments_-fPIC_-fPIE_-gdwarf-4_-Wall2024062620240625
4579350001 0 062896 812 888T:sphlibclang_-mcpu=native_-O3_-fwrapv_-Qunused-arguments_-fPIC_-fPIE_-gdwarf-4_-Wall2024062620240625
4593550481 0 063248 812 920T:sphlibclang_-march=native_-O2_-fwrapv_-Qunused-arguments_-fPIC_-fPIE_-gdwarf-4_-Wall2024062620240625
4668753057 0 065968 812 888T:sphlib-adaptedclang_-mcpu=native_-O3_-fwrapv_-Qunused-arguments_-fPIC_-fPIE_-gdwarf-4_-Wall2024062620240625
4673450481 0 063392 812 920T:sphlibclang_-march=native_-O3_-fwrapv_-Qunused-arguments_-fPIC_-fPIE_-gdwarf-4_-Wall2024062620240625
4680027262 0 039928 812 920T:core2duoclang_-march=native_-O2_-fwrapv_-Qunused-arguments_-fPIC_-fPIE_-gdwarf-4_-Wall2024062620240625
4682027262 0 040056 812 920T:core2duoclang_-march=native_-O3_-fwrapv_-Qunused-arguments_-fPIC_-fPIE_-gdwarf-4_-Wall2024062620240625
4695826557 0 036830 804 888T:core2duoclang_-march=native_-Os_-fwrapv_-Qunused-arguments_-fPIC_-fPIE_-gdwarf-4_-Wall2024062620240625
4749967062 0 077847 788 952T:mmxgcc_-march=native_-mtune=native_-O_-fwrapv_-fPIC_-fPIE_-gdwarf-4_-Wall2024062620240625
4855150221 0 060910 804 888T:sphlibclang_-march=native_-O_-fwrapv_-Qunused-arguments_-fPIC_-fPIE_-gdwarf-4_-Wall2024062620240625
4916353853 0 064558 804 888T:sphlib-adaptedclang_-march=native_-O_-fwrapv_-Qunused-arguments_-fPIC_-fPIE_-gdwarf-4_-Wall2024062620240625
4928567103 0 078328 796 952T:mmxgcc_-march=native_-mtune=native_-O2_-fwrapv_-fPIC_-fPIE_-gdwarf-4_-Wall2024062620240625
5174749214 0 059566 804 888T:sphlibclang_-march=native_-Os_-fwrapv_-Qunused-arguments_-fPIC_-fPIE_-gdwarf-4_-Wall2024062620240625
5186365860 0 075651 772 920T:mmxgcc_-march=native_-mtune=native_-Os_-fwrapv_-fPIC_-fPIE_-gdwarf-4_-Wall2024062620240625
5253421377 0 033776 812 920T:sphlib-smallclang_-march=native_-O2_-fwrapv_-Qunused-arguments_-fPIC_-fPIE_-gdwarf-4_-Wall2024062620240625
5257321377 0 033904 812 920T:sphlib-smallclang_-march=native_-O3_-fwrapv_-Qunused-arguments_-fPIC_-fPIE_-gdwarf-4_-Wall2024062620240625
5401919989 0 030728 780 952T:sphlib-smallgcc_-march=native_-mtune=native_-O_-fwrapv_-fPIC_-fPIE_-gdwarf-4_-Wall2024062620240625
5538020158 0 030158 804 888T:sphlib-smallclang_-march=native_-Os_-fwrapv_-Qunused-arguments_-fPIC_-fPIE_-gdwarf-4_-Wall2024062620240625
5589253870 0 064254 804 888T:sphlib-adaptedclang_-march=native_-Os_-fwrapv_-Qunused-arguments_-fPIC_-fPIE_-gdwarf-4_-Wall2024062620240625
5739421887 0 033008 780 952T:sphlib-smallgcc_-march=native_-mtune=native_-O2_-fwrapv_-fPIC_-fPIE_-gdwarf-4_-Wall2024062620240625
5844423375 0 036504 780 952T:sphlib-smallgcc_-march=native_-mtune=native_-O3_-fwrapv_-fPIC_-fPIE_-gdwarf-4_-Wall2024062620240625
5982423441 0 036240 812 888T:sphlib-smallclang_-mcpu=native_-O3_-fwrapv_-Qunused-arguments_-fPIC_-fPIE_-gdwarf-4_-Wall2024062620240625
6420269235 0 082326 836 920T:mmxclang_-march=native_-O3_-fwrapv_-Qunused-arguments_-fPIC_-fPIE_-gdwarf-4_-Wall2024062620240625
6456821181 0 031886 804 888T:sphlib-smallclang_-march=native_-O_-fwrapv_-Qunused-arguments_-fPIC_-fPIE_-gdwarf-4_-Wall2024062620240625
6494469291 0 082358 836 888T:mmxclang_-mcpu=native_-O3_-fwrapv_-Qunused-arguments_-fPIC_-fPIE_-gdwarf-4_-Wall2024062620240625
6626066336 0 076790 820 888T:mmxclang_-march=native_-Os_-fwrapv_-Qunused-arguments_-fPIC_-fPIE_-gdwarf-4_-Wall2024062620240625
6649968443 0 081390 836 920T:mmxclang_-march=native_-O2_-fwrapv_-Qunused-arguments_-fPIC_-fPIE_-gdwarf-4_-Wall2024062620240625
6735969661 0 080406 820 888T:mmxclang_-march=native_-O_-fwrapv_-Qunused-arguments_-fPIC_-fPIE_-gdwarf-4_-Wall2024062620240625
6869418192 0 027875 756 920T:sphlib-smallgcc_-march=native_-mtune=native_-Os_-fwrapv_-fPIC_-fPIE_-gdwarf-4_-Wall2024062620240625
7202323271 0 036576 796 952T:opt32gcc_-march=native_-mtune=native_-O3_-fwrapv_-fPIC_-fPIE_-gdwarf-4_-Wall2024062620240625
7215120915 0 031735 788 952T:opt32gcc_-march=native_-mtune=native_-O_-fwrapv_-fPIC_-fPIE_-gdwarf-4_-Wall2024062620240625
7233021455 0 032688 796 952T:opt32gcc_-march=native_-mtune=native_-O2_-fwrapv_-fPIC_-fPIE_-gdwarf-4_-Wall2024062620240625
7321620872 0 030707 772 920T:opt32gcc_-march=native_-mtune=native_-Os_-fwrapv_-fPIC_-fPIE_-gdwarf-4_-Wall2024062620240625
7522926718 0 039870 836 888T:opt32clang_-mcpu=native_-O3_-fwrapv_-Qunused-arguments_-fPIC_-fPIE_-gdwarf-4_-Wall2024062620240625
7626726542 0 039710 836 920T:opt32clang_-march=native_-O3_-fwrapv_-Qunused-arguments_-fPIC_-fPIE_-gdwarf-4_-Wall2024062620240625
7639326398 0 039406 836 920T:opt32clang_-march=native_-O2_-fwrapv_-Qunused-arguments_-fPIC_-fPIE_-gdwarf-4_-Wall2024062620240625
7658624701 0 035478 820 888T:opt32clang_-march=native_-O_-fwrapv_-Qunused-arguments_-fPIC_-fPIE_-gdwarf-4_-Wall2024062620240625
8001724285 0 034790 820 888T:opt32clang_-march=native_-Os_-fwrapv_-Qunused-arguments_-fPIC_-fPIE_-gdwarf-4_-Wall2024062620240625
8526538089 0 249648761 812 3384T:vperm-intrclang_-march=native_-O_-fwrapv_-Qunused-arguments_-fPIC_-fPIE_-gdwarf-4_-Wall2024062620240625
2173295717 0 018520 812 888T:32bit-bytesliced-c-smallclang_-mcpu=native_-O3_-fwrapv_-Qunused-arguments_-fPIC_-fPIE_-gdwarf-4_-Wall2024062620240625
2260474537 0 017368 812 920T:32bit-bytesliced-c-smallclang_-march=native_-O3_-fwrapv_-Qunused-arguments_-fPIC_-fPIE_-gdwarf-4_-Wall2024062620240625
2274783374 0 016080 812 920T:32bit-bytesliced-c-smallclang_-march=native_-O2_-fwrapv_-Qunused-arguments_-fPIC_-fPIE_-gdwarf-4_-Wall2024062620240625
2768645112 0 018168 780 952T:32bit-bytesliced-c-smallgcc_-march=native_-mtune=native_-O3_-fwrapv_-fPIC_-fPIE_-gdwarf-4_-Wall2024062620240625
2897612279 0 013320 780 952T:32bit-bytesliced-c-smallgcc_-march=native_-mtune=native_-O2_-fwrapv_-fPIC_-fPIE_-gdwarf-4_-Wall2024062620240625
2915862211 0 012766 804 888T:32bit-bytesliced-c-smallclang_-march=native_-O_-fwrapv_-Qunused-arguments_-fPIC_-fPIE_-gdwarf-4_-Wall2024062620240625
3193841763 0 011347 756 920T:32bit-bytesliced-c-smallgcc_-march=native_-mtune=native_-Os_-fwrapv_-fPIC_-fPIE_-gdwarf-4_-Wall2024062620240625
3259252950 0 013230 804 888T:32bit-bytesliced-c-smallclang_-march=native_-Os_-fwrapv_-Qunused-arguments_-fPIC_-fPIE_-gdwarf-4_-Wall2024062620240625
4240592598 0 013207 772 952T:32bit-bytesliced-c-smallgcc_-march=native_-mtune=native_-O_-fwrapv_-fPIC_-fPIE_-gdwarf-4_-Wall2024062620240625

Compiler output


hash.c: hash.c:104:12: warning: comparison of array 'ctx->chaining' equal to a null pointer is always false [-Wtautological-pointer-compare]
hash.c:   if (ctx->chaining == NULL || ctx->buffer == NULL)
hash.c:       ~~~~~^~~~~~~~    ~~~~
hash.c: hash.c:104:37: warning: comparison of array 'ctx->buffer' equal to a null pointer is always false [-Wtautological-pointer-compare]
hash.c:   if (ctx->chaining == NULL || ctx->buffer == NULL)
hash.c:                                ~~~~~^~~~~~    ~~~~
hash.c: In file included from hash.c:13:
hash.c: ./groestl-asm-aes.h:851:8: error: invalid operand for instruction
hash.c:   asm ("movaps xmm8,  [rdi+0*16]");
hash.c:        ^
hash.c: <inline asm>:1:16: note: instantiated into assembly here
hash.c:         movaps xmm8,  [rdi+0*16]
hash.c:                       ^~~~~~~~~~
hash.c: In file included from hash.c:13:
hash.c: ./groestl-asm-aes.h:852:8: error: invalid operand for instruction
hash.c:   asm ("movaps xmm9,  [rdi+1*16]");
hash.c:        ^
hash.c: <inline asm>:1:16: note: instantiated into assembly here
hash.c:         movaps xmm9,  [rdi+1*16]
hash.c:                       ^~~~~~~~~~
hash.c: In file included from hash.c:13:
hash.c: ./groestl-asm-aes.h:853:8: error: invalid operand for instruction
hash.c:   asm ("movaps xmm10, [rdi+2*16]");
hash.c:        ^
hash.c: <inline asm>:1:16: note: instantiated into assembly here
hash.c: ...

Number of similar (implementation,compiler) pairs: 5, namely:
ImplementationCompiler
T:aesniclang -march=native -O2 -fwrapv -Qunused-arguments -fPIC -fPIE -gdwarf-4 -Wall (Debian_Clang_11.0.1)
T:aesniclang -march=native -O3 -fwrapv -Qunused-arguments -fPIC -fPIE -gdwarf-4 -Wall (Debian_Clang_11.0.1)
T:aesniclang -march=native -O -fwrapv -Qunused-arguments -fPIC -fPIE -gdwarf-4 -Wall (Debian_Clang_11.0.1)
T:aesniclang -march=native -Os -fwrapv -Qunused-arguments -fPIC -fPIE -gdwarf-4 -Wall (Debian_Clang_11.0.1)
T:aesniclang -mcpu=native -O3 -fwrapv -Qunused-arguments -fPIC -fPIE -gdwarf-4 -Wall (Debian_Clang_11.0.1)

Compiler output


try.c: /usr/bin/ld: libcrypto_hash_groestl512.a(hash.o): relocation R_X86_64_32S against symbol `TRANSP_MASK' can not be used when making a PIE object; recompile with -fPIE
try.c: collect2: error: ld returned 1 exit status

Number of similar (implementation,compiler) pairs: 8, namely:
ImplementationCompiler
T:aesnigcc -march=native -mtune=native -O2 -fwrapv -fPIC -fPIE -gdwarf-4 -Wall (10.2.1_20210110)
T:aesnigcc -march=native -mtune=native -O3 -fwrapv -fPIC -fPIE -gdwarf-4 -Wall (10.2.1_20210110)
T:aesnigcc -march=native -mtune=native -O -fwrapv -fPIC -fPIE -gdwarf-4 -Wall (10.2.1_20210110)
T:aesnigcc -march=native -mtune=native -Os -fwrapv -fPIC -fPIE -gdwarf-4 -Wall (10.2.1_20210110)
T:avxgcc -march=native -mtune=native -O2 -fwrapv -fPIC -fPIE -gdwarf-4 -Wall (10.2.1_20210110)
T:avxgcc -march=native -mtune=native -O3 -fwrapv -fPIC -fPIE -gdwarf-4 -Wall (10.2.1_20210110)
T:avxgcc -march=native -mtune=native -O -fwrapv -fPIC -fPIE -gdwarf-4 -Wall (10.2.1_20210110)
T:avxgcc -march=native -mtune=native -Os -fwrapv -fPIC -fPIE -gdwarf-4 -Wall (10.2.1_20210110)

Compiler output


hash.c: hash.c:104:12: warning: comparison of array 'ctx->chaining' equal to a null pointer is always false [-Wtautological-pointer-compare]
hash.c:   if (ctx->chaining == NULL || ctx->buffer == NULL)
hash.c:       ~~~~~^~~~~~~~    ~~~~
hash.c: hash.c:104:37: warning: comparison of array 'ctx->buffer' equal to a null pointer is always false [-Wtautological-pointer-compare]
hash.c:   if (ctx->chaining == NULL || ctx->buffer == NULL)
hash.c:                                ~~~~~^~~~~~    ~~~~
hash.c: 2 warnings generated.

Number of similar (implementation,compiler) pairs: 8, namely:
ImplementationCompiler
T:aesni-intrclang -march=native -O2 -fwrapv -Qunused-arguments -fPIC -fPIE -gdwarf-4 -Wall (Debian_Clang_11.0.1)
T:aesni-intrclang -march=native -O3 -fwrapv -Qunused-arguments -fPIC -fPIE -gdwarf-4 -Wall (Debian_Clang_11.0.1)
T:aesni-intrclang -march=native -O -fwrapv -Qunused-arguments -fPIC -fPIE -gdwarf-4 -Wall (Debian_Clang_11.0.1)
T:aesni-intrclang -march=native -Os -fwrapv -Qunused-arguments -fPIC -fPIE -gdwarf-4 -Wall (Debian_Clang_11.0.1)
T:vperm-intrclang -march=native -O2 -fwrapv -Qunused-arguments -fPIC -fPIE -gdwarf-4 -Wall (Debian_Clang_11.0.1)
T:vperm-intrclang -march=native -O3 -fwrapv -Qunused-arguments -fPIC -fPIE -gdwarf-4 -Wall (Debian_Clang_11.0.1)
T:vperm-intrclang -march=native -O -fwrapv -Qunused-arguments -fPIC -fPIE -gdwarf-4 -Wall (Debian_Clang_11.0.1)
T:vperm-intrclang -march=native -Os -fwrapv -Qunused-arguments -fPIC -fPIE -gdwarf-4 -Wall (Debian_Clang_11.0.1)

Compiler output


hash.c: In file included from hash.c:28:
hash.c: ./groestl-intr-aes.h:786:3: error: always_inline function '_mm_shuffle_epi8' requires target feature 'ssse3', but would be inlined into function 'INIT' that is compiled without support for 'ssse3'
hash.c:   Matrix_Transpose(xmm8, xmm9, xmm10, xmm11, xmm12, xmm13, xmm14, xmm15, xmm0, xmm1, xmm2, xmm3, xmm4, xmm5, xmm6, xmm7);
hash.c:   ^
hash.c: ./groestl-intr-aes.h:631:8: note: expanded from macro 'Matrix_Transpose'
hash.c:   i6 = _mm_shuffle_epi8(i6, t0);\
hash.c:        ^
hash.c: ./groestl-intr-aes.h:786:3: error: always_inline function '_mm_shuffle_epi8' requires target feature 'ssse3', but would be inlined into function 'INIT' that is compiled without support for 'ssse3'
hash.c: ./groestl-intr-aes.h:632:8: note: expanded from macro 'Matrix_Transpose'
hash.c:   i0 = _mm_shuffle_epi8(i0, t0);\
hash.c:        ^
hash.c: ./groestl-intr-aes.h:786:3: error: always_inline function '_mm_shuffle_epi8' requires target feature 'ssse3', but would be inlined into function 'INIT' that is compiled without support for 'ssse3'
hash.c: ./groestl-intr-aes.h:633:8: note: expanded from macro 'Matrix_Transpose'
hash.c:   i1 = _mm_shuffle_epi8(i1, t0);\
hash.c:        ^
hash.c: ./groestl-intr-aes.h:786:3: error: always_inline function '_mm_shuffle_epi8' requires target feature 'ssse3', but would be inlined into function 'INIT' that is compiled without support for 'ssse3'
hash.c: ./groestl-intr-aes.h:634:8: note: expanded from macro 'Matrix_Transpose'
hash.c:   i2 = _mm_shuffle_epi8(i2, t0);\
hash.c:        ^
hash.c: ./groestl-intr-aes.h:786:3: error: always_inline function '_mm_shuffle_epi8' requires target feature 'ssse3', but would be inlined into function 'INIT' that is compiled without support for 'ssse3'
hash.c: ./groestl-intr-aes.h:635:8: note: expanded from macro 'Matrix_Transpose'
hash.c:   i3 = _mm_shuffle_epi8(i3, t0);\
hash.c:        ^
hash.c: ./groestl-intr-aes.h:786:3: error: always_inline function '_mm_shuffle_epi8' requires target feature 'ssse3', but would be inlined into function 'INIT' that is compiled without support for 'ssse3'
hash.c: ./groestl-intr-aes.h:637:8: note: expanded from macro 'Matrix_Transpose'
hash.c: ...

Number of similar (implementation,compiler) pairs: 1, namely:
ImplementationCompiler
T:aesni-intrclang -mcpu=native -O3 -fwrapv -Qunused-arguments -fPIC -fPIE -gdwarf-4 -Wall (Debian_Clang_11.0.1)

Compiler output


hash.c: hash.c:104:12: warning: comparison of array 'ctx->chaining' equal to a null pointer is always false [-Wtautological-pointer-compare]
hash.c:   if (ctx->chaining == NULL || ctx->buffer == NULL)
hash.c:       ~~~~~^~~~~~~~    ~~~~
hash.c: hash.c:104:37: warning: comparison of array 'ctx->buffer' equal to a null pointer is always false [-Wtautological-pointer-compare]
hash.c:   if (ctx->chaining == NULL || ctx->buffer == NULL)
hash.c:                                ~~~~~^~~~~~    ~~~~
hash.c: In file included from hash.c:16:
hash.c: ./groestl-asm-avx.h:925:8: error: invalid operand for instruction
hash.c:   asm ("vmovaps xmm8,  [rdi+0*16]");
hash.c:        ^
hash.c: <inline asm>:1:17: note: instantiated into assembly here
hash.c:         vmovaps xmm8,  [rdi+0*16]
hash.c:                        ^~~~~~~~~~
hash.c: In file included from hash.c:16:
hash.c: ./groestl-asm-avx.h:926:8: error: invalid operand for instruction
hash.c:   asm ("vmovaps xmm9,  [rdi+1*16]");
hash.c:        ^
hash.c: <inline asm>:1:17: note: instantiated into assembly here
hash.c:         vmovaps xmm9,  [rdi+1*16]
hash.c:                        ^~~~~~~~~~
hash.c: In file included from hash.c:16:
hash.c: ./groestl-asm-avx.h:927:8: error: invalid operand for instruction
hash.c:   asm ("vmovaps xmm10, [rdi+2*16]");
hash.c:        ^
hash.c: <inline asm>:1:17: note: instantiated into assembly here
hash.c: ...

Number of similar (implementation,compiler) pairs: 5, namely:
ImplementationCompiler
T:avxclang -march=native -O2 -fwrapv -Qunused-arguments -fPIC -fPIE -gdwarf-4 -Wall (Debian_Clang_11.0.1)
T:avxclang -march=native -O3 -fwrapv -Qunused-arguments -fPIC -fPIE -gdwarf-4 -Wall (Debian_Clang_11.0.1)
T:avxclang -march=native -O -fwrapv -Qunused-arguments -fPIC -fPIE -gdwarf-4 -Wall (Debian_Clang_11.0.1)
T:avxclang -march=native -Os -fwrapv -Qunused-arguments -fPIC -fPIE -gdwarf-4 -Wall (Debian_Clang_11.0.1)
T:avxclang -mcpu=native -O3 -fwrapv -Qunused-arguments -fPIC -fPIE -gdwarf-4 -Wall (Debian_Clang_11.0.1)

Compiler output


hash.c: hash.c:104:12: warning: comparison of array 'ctx->chaining' equal to a null pointer is always false [-Wtautological-pointer-compare]
hash.c:   if (ctx->chaining == NULL || ctx->buffer == NULL)
hash.c:       ~~~~~^~~~~~~~    ~~~~
hash.c: hash.c:104:37: warning: comparison of array 'ctx->buffer' equal to a null pointer is always false [-Wtautological-pointer-compare]
hash.c:   if (ctx->chaining == NULL || ctx->buffer == NULL)
hash.c:                                ~~~~~^~~~~~    ~~~~
hash.c: hash.c:97:3: warning: variable 'ymm0' is uninitialized when used here [-Wuninitialized]
hash.c:   SET_CONSTANTS();
hash.c:   ^~~~~~~~~~~~~~~
hash.c: ./groestl-intr-avx.h:496:32: note: expanded from macro 'SET_CONSTANTS'
hash.c:   ymm0 = insert_m128i_in_m256d(ymm0, xmm0, 0);\
hash.c:                                ^~~~
hash.c: ./groestl-intr-avx.h:36:111: note: expanded from macro 'insert_m128i_in_m256d'
hash.c: #define insert_m128i_in_m256d(ymm, xmm, pos) (_mm256_castsi256_pd(_mm256_insertf128_si256(_mm256_castpd_si256(ymm), xmm, pos)))
hash.c:                                                                                                               ^~~
hash.c: /usr/lib/llvm-11/lib/clang/11.0.1/include/avxintrin.h:4671:63: note: expanded from macro '_mm256_insertf128_si256'
hash.c:   (__m256i)__builtin_ia32_vinsertf128_si256((__v8si)(__m256i)(V1), \
hash.c:                                                               ^~
hash.c: hash.c:97:3: note: variable 'ymm0' is declared here
hash.c: ./groestl-intr-avx.h:493:3: note: expanded from macro 'SET_CONSTANTS'
hash.c:   __m256d ymm0;\
hash.c:   ^
hash.c: 3 warnings generated.

Number of similar (implementation,compiler) pairs: 4, namely:
ImplementationCompiler
T:avx-intrclang -march=native -O2 -fwrapv -Qunused-arguments -fPIC -fPIE -gdwarf-4 -Wall (Debian_Clang_11.0.1)
T:avx-intrclang -march=native -O3 -fwrapv -Qunused-arguments -fPIC -fPIE -gdwarf-4 -Wall (Debian_Clang_11.0.1)
T:avx-intrclang -march=native -O -fwrapv -Qunused-arguments -fPIC -fPIE -gdwarf-4 -Wall (Debian_Clang_11.0.1)
T:avx-intrclang -march=native -Os -fwrapv -Qunused-arguments -fPIC -fPIE -gdwarf-4 -Wall (Debian_Clang_11.0.1)

Compiler output


hash.c: In file included from hash.c:31:
hash.c: ./groestl-intr-avx.h:851:3: error: always_inline function '_mm_shuffle_epi8' requires target feature 'ssse3', but would be inlined into function 'INIT' that is compiled without support for 'ssse3'
hash.c:   Matrix_Transpose(xmm8, xmm9, xmm10, xmm11, xmm12, xmm13, xmm14, xmm15, xmm0, xmm1, xmm2, xmm3, xmm4, xmm5, xmm6, xmm7);
hash.c:   ^
hash.c: ./groestl-intr-avx.h:725:8: note: expanded from macro 'Matrix_Transpose'
hash.c:   i6 = _mm_shuffle_epi8(i6, t0);\
hash.c:        ^
hash.c: ./groestl-intr-avx.h:851:3: error: always_inline function '_mm_shuffle_epi8' requires target feature 'ssse3', but would be inlined into function 'INIT' that is compiled without support for 'ssse3'
hash.c: ./groestl-intr-avx.h:726:8: note: expanded from macro 'Matrix_Transpose'
hash.c:   i0 = _mm_shuffle_epi8(i0, t0);\
hash.c:        ^
hash.c: ./groestl-intr-avx.h:851:3: error: always_inline function '_mm_shuffle_epi8' requires target feature 'ssse3', but would be inlined into function 'INIT' that is compiled without support for 'ssse3'
hash.c: ./groestl-intr-avx.h:727:8: note: expanded from macro 'Matrix_Transpose'
hash.c:   i1 = _mm_shuffle_epi8(i1, t0);\
hash.c:        ^
hash.c: ./groestl-intr-avx.h:851:3: error: always_inline function '_mm_shuffle_epi8' requires target feature 'ssse3', but would be inlined into function 'INIT' that is compiled without support for 'ssse3'
hash.c: ./groestl-intr-avx.h:728:8: note: expanded from macro 'Matrix_Transpose'
hash.c:   i2 = _mm_shuffle_epi8(i2, t0);\
hash.c:        ^
hash.c: ./groestl-intr-avx.h:851:3: error: always_inline function '_mm_shuffle_epi8' requires target feature 'ssse3', but would be inlined into function 'INIT' that is compiled without support for 'ssse3'
hash.c: ./groestl-intr-avx.h:729:8: note: expanded from macro 'Matrix_Transpose'
hash.c:   i3 = _mm_shuffle_epi8(i3, t0);\
hash.c:        ^
hash.c: ./groestl-intr-avx.h:851:3: error: always_inline function '_mm_shuffle_epi8' requires target feature 'ssse3', but would be inlined into function 'INIT' that is compiled without support for 'ssse3'
hash.c: ./groestl-intr-avx.h:730:8: note: expanded from macro 'Matrix_Transpose'
hash.c: ...

Number of similar (implementation,compiler) pairs: 1, namely:
ImplementationCompiler
T:avx-intrclang -mcpu=native -O3 -fwrapv -Qunused-arguments -fPIC -fPIE -gdwarf-4 -Wall (Debian_Clang_11.0.1)

Compiler output


hash.c: In file included from hash.c:31:
hash.c: hash.c: In function 'Init':
hash.c: groestl-intr-avx.h:36:47: warning: 'ymm0' is used uninitialized in this function [-Wuninitialized]
hash.c:    36 | #define insert_m128i_in_m256d(ymm, xmm, pos) (_mm256_castsi256_pd(_mm256_insertf128_si256(_mm256_castpd_si256(ymm), xmm, pos)))
hash.c:       |                                               ^~~~~~~~~~~~~~~~~~~
hash.c: In file included from hash.c:31:
hash.c: groestl-intr-avx.h:493:11: note: 'ymm0' was declared here
hash.c:   493 |   __m256d ymm0;\
hash.c:       |           ^~~~
hash.c: hash.c:97:3: note: in expansion of macro 'SET_CONSTANTS'
hash.c:    97 |   SET_CONSTANTS();
hash.c:       |   ^~~~~~~~~~~~~

Number of similar (implementation,compiler) pairs: 4, namely:
ImplementationCompiler
T:avx-intrgcc -march=native -mtune=native -O2 -fwrapv -fPIC -fPIE -gdwarf-4 -Wall (10.2.1_20210110)
T:avx-intrgcc -march=native -mtune=native -O3 -fwrapv -fPIC -fPIE -gdwarf-4 -Wall (10.2.1_20210110)
T:avx-intrgcc -march=native -mtune=native -O -fwrapv -fPIC -fPIE -gdwarf-4 -Wall (10.2.1_20210110)
T:avx-intrgcc -march=native -mtune=native -Os -fwrapv -fPIC -fPIE -gdwarf-4 -Wall (10.2.1_20210110)

Compiler output


try.c: /usr/bin/ld: libcrypto_hash_groestl512.a(hash.o): in function `Transform':
try.c: .../supercop-data/alder/amd64/try/c/clang_-march=native_-O_-fwrapv_-Qunused-arguments_-fPIC_-fPIE_-gdwarf-4_-Wall/timingleaks/crypto_hash/groestl512/core2duo/work/hash.c:39: undefined reference to `Q1024ASM'
try.c: /usr/bin/ld: .../supercop-data/alder/amd64/try/c/clang_-march=native_-O_-fwrapv_-Qunused-arguments_-fPIC_-fPIE_-gdwarf-4_-Wall/timingleaks/crypto_hash/groestl512/core2duo/work/hash.c:40: undefined reference to `P1024ASM'
try.c: /usr/bin/ld: libcrypto_hash_groestl512.a(hash.o): in function `OutputTransformation':
try.c: .../supercop-data/alder/amd64/try/c/clang_-march=native_-O_-fwrapv_-Qunused-arguments_-fPIC_-fPIE_-gdwarf-4_-Wall/timingleaks/crypto_hash/groestl512/core2duo/work/hash.c:59: undefined reference to `P1024ASM'
try.c: clang: error: linker command failed with exit code 1 (use -v to see invocation)

Number of similar (implementation,compiler) pairs: 1, namely:
ImplementationCompiler
T:core2duoclang -march=native -O -fwrapv -Qunused-arguments -fPIC -fPIE -gdwarf-4 -Wall (Debian_Clang_11.0.1)

Compiler output


try.c: /usr/bin/ld: libcrypto_hash_groestl512.a(hash.o): in function `Transform':
try.c: .../supercop-data/alder/amd64/try/c/gcc_-march=native_-mtune=native_-O2_-fwrapv_-fPIC_-fPIE_-gdwarf-4_-Wall/timingleaks/crypto_hash/groestl512/core2duo/work/hash.c:39: undefined reference to `Q1024ASM'
try.c: /usr/bin/ld: .../supercop-data/alder/amd64/try/c/gcc_-march=native_-mtune=native_-O2_-fwrapv_-fPIC_-fPIE_-gdwarf-4_-Wall/timingleaks/crypto_hash/groestl512/core2duo/work/hash.c:40: undefined reference to `P1024ASM'
try.c: /usr/bin/ld: libcrypto_hash_groestl512.a(hash.o): in function `OutputTransformation':
try.c: .../supercop-data/alder/amd64/try/c/gcc_-march=native_-mtune=native_-O2_-fwrapv_-fPIC_-fPIE_-gdwarf-4_-Wall/timingleaks/crypto_hash/groestl512/core2duo/work/hash.c:59: undefined reference to `P1024ASM'
try.c: collect2: error: ld returned 1 exit status

Number of similar (implementation,compiler) pairs: 1, namely:
ImplementationCompiler
T:core2duogcc -march=native -mtune=native -O2 -fwrapv -fPIC -fPIE -gdwarf-4 -Wall (10.2.1_20210110)

Compiler output


try.c: /usr/bin/ld: libcrypto_hash_groestl512.a(hash.o): in function `Transform':
try.c: .../supercop-data/alder/amd64/try/c/gcc_-march=native_-mtune=native_-O3_-fwrapv_-fPIC_-fPIE_-gdwarf-4_-Wall/timingleaks/crypto_hash/groestl512/core2duo/work/hash.c:39: undefined reference to `Q1024ASM'
try.c: /usr/bin/ld: .../supercop-data/alder/amd64/try/c/gcc_-march=native_-mtune=native_-O3_-fwrapv_-fPIC_-fPIE_-gdwarf-4_-Wall/timingleaks/crypto_hash/groestl512/core2duo/work/hash.c:40: undefined reference to `P1024ASM'
try.c: /usr/bin/ld: .../supercop-data/alder/amd64/try/c/gcc_-march=native_-mtune=native_-O3_-fwrapv_-fPIC_-fPIE_-gdwarf-4_-Wall/timingleaks/crypto_hash/groestl512/core2duo/work/hash.c:39: undefined reference to `Q1024ASM'
try.c: /usr/bin/ld: .../supercop-data/alder/amd64/try/c/gcc_-march=native_-mtune=native_-O3_-fwrapv_-fPIC_-fPIE_-gdwarf-4_-Wall/timingleaks/crypto_hash/groestl512/core2duo/work/hash.c:40: undefined reference to `P1024ASM'
try.c: /usr/bin/ld: libcrypto_hash_groestl512.a(hash.o): in function `OutputTransformation':
try.c: .../supercop-data/alder/amd64/try/c/gcc_-march=native_-mtune=native_-O3_-fwrapv_-fPIC_-fPIE_-gdwarf-4_-Wall/timingleaks/crypto_hash/groestl512/core2duo/work/hash.c:59: undefined reference to `P1024ASM'
try.c: /usr/bin/ld: .../supercop-data/alder/amd64/try/c/gcc_-march=native_-mtune=native_-O3_-fwrapv_-fPIC_-fPIE_-gdwarf-4_-Wall/timingleaks/crypto_hash/groestl512/core2duo/work/hash.c:59: undefined reference to `P1024ASM'
try.c: collect2: error: ld returned 1 exit status

Number of similar (implementation,compiler) pairs: 1, namely:
ImplementationCompiler
T:core2duogcc -march=native -mtune=native -O3 -fwrapv -fPIC -fPIE -gdwarf-4 -Wall (10.2.1_20210110)

Compiler output


try.c: /usr/bin/ld: libcrypto_hash_groestl512.a(hash.o): in function `Transform':
try.c: .../supercop-data/alder/amd64/try/c/gcc_-march=native_-mtune=native_-O_-fwrapv_-fPIC_-fPIE_-gdwarf-4_-Wall/timingleaks/crypto_hash/groestl512/core2duo/work/hash.c:39: undefined reference to `Q1024ASM'
try.c: /usr/bin/ld: .../supercop-data/alder/amd64/try/c/gcc_-march=native_-mtune=native_-O_-fwrapv_-fPIC_-fPIE_-gdwarf-4_-Wall/timingleaks/crypto_hash/groestl512/core2duo/work/hash.c:40: undefined reference to `P1024ASM'
try.c: /usr/bin/ld: libcrypto_hash_groestl512.a(hash.o): in function `OutputTransformation':
try.c: .../supercop-data/alder/amd64/try/c/gcc_-march=native_-mtune=native_-O_-fwrapv_-fPIC_-fPIE_-gdwarf-4_-Wall/timingleaks/crypto_hash/groestl512/core2duo/work/hash.c:59: undefined reference to `P1024ASM'
try.c: collect2: error: ld returned 1 exit status

Number of similar (implementation,compiler) pairs: 1, namely:
ImplementationCompiler
T:core2duogcc -march=native -mtune=native -O -fwrapv -fPIC -fPIE -gdwarf-4 -Wall (10.2.1_20210110)

Compiler output


try.c: /usr/bin/ld: libcrypto_hash_groestl512.a(hash.o): in function `Transform':
try.c: .../supercop-data/alder/amd64/try/c/gcc_-march=native_-mtune=native_-Os_-fwrapv_-fPIC_-fPIE_-gdwarf-4_-Wall/timingleaks/crypto_hash/groestl512/core2duo/work/hash.c:39: undefined reference to `Q1024ASM'
try.c: /usr/bin/ld: .../supercop-data/alder/amd64/try/c/gcc_-march=native_-mtune=native_-Os_-fwrapv_-fPIC_-fPIE_-gdwarf-4_-Wall/timingleaks/crypto_hash/groestl512/core2duo/work/hash.c:40: undefined reference to `P1024ASM'
try.c: /usr/bin/ld: libcrypto_hash_groestl512.a(hash.o): in function `OutputTransformation':
try.c: .../supercop-data/alder/amd64/try/c/gcc_-march=native_-mtune=native_-Os_-fwrapv_-fPIC_-fPIE_-gdwarf-4_-Wall/timingleaks/crypto_hash/groestl512/core2duo/work/hash.c:59: undefined reference to `P1024ASM'
try.c: collect2: error: ld returned 1 exit status

Number of similar (implementation,compiler) pairs: 1, namely:
ImplementationCompiler
T:core2duogcc -march=native -mtune=native -Os -fwrapv -fPIC -fPIE -gdwarf-4 -Wall (10.2.1_20210110)

Compiler output


hash.c: hash.c:563:8: warning: unused variable 'mmm' [-Wunused-variable]
hash.c:   u64 *mmm = (u64*)tmp;
hash.c:        ^
hash.c: 1 warning generated.

Number of similar (implementation,compiler) pairs: 5, namely:
ImplementationCompiler
T:mmxclang -march=native -O2 -fwrapv -Qunused-arguments -fPIC -fPIE -gdwarf-4 -Wall (Debian_Clang_11.0.1)
T:mmxclang -march=native -O3 -fwrapv -Qunused-arguments -fPIC -fPIE -gdwarf-4 -Wall (Debian_Clang_11.0.1)
T:mmxclang -march=native -O -fwrapv -Qunused-arguments -fPIC -fPIE -gdwarf-4 -Wall (Debian_Clang_11.0.1)
T:mmxclang -march=native -Os -fwrapv -Qunused-arguments -fPIC -fPIE -gdwarf-4 -Wall (Debian_Clang_11.0.1)
T:mmxclang -mcpu=native -O3 -fwrapv -Qunused-arguments -fPIC -fPIE -gdwarf-4 -Wall (Debian_Clang_11.0.1)

Compiler output


hash.c: hash.c: In function 'Transform1024':
hash.c: hash.c:563:8: warning: unused variable 'mmm' [-Wunused-variable]
hash.c:   563 |   u64 *mmm = (u64*)tmp;
hash.c:       |        ^~~

Number of similar (implementation,compiler) pairs: 4, namely:
ImplementationCompiler
T:mmxgcc -march=native -mtune=native -O2 -fwrapv -fPIC -fPIE -gdwarf-4 -Wall (10.2.1_20210110)
T:mmxgcc -march=native -mtune=native -O3 -fwrapv -fPIC -fPIE -gdwarf-4 -Wall (10.2.1_20210110)
T:mmxgcc -march=native -mtune=native -O -fwrapv -fPIC -fPIE -gdwarf-4 -Wall (10.2.1_20210110)
T:mmxgcc -march=native -mtune=native -Os -fwrapv -fPIC -fPIE -gdwarf-4 -Wall (10.2.1_20210110)

Compiler output


hash.c: hash.c:182:9: warning: unknown pragma ignored [-Wunknown-pragmas]
hash.c: #pragma vector aligned
hash.c:         ^
hash.c: hash.c:191:3: warning: non-constant static local variable in inline function may be different in different files [-Wstatic-local-in-inline]
hash.c:   static u64 y[COLS1024] __attribute__((aligned(16)));
hash.c:   ^
hash.c: hash.c:190:1: note: use 'static' to give inline function 'F1024' internal linkage
hash.c: inline void F1024(u64 *h, const u64 *m) {
hash.c: ^
hash.c: static
hash.c: hash.c:192:3: warning: non-constant static local variable in inline function may be different in different files [-Wstatic-local-in-inline]
hash.c:   static u64 z[COLS1024] __attribute__((aligned(16)));
hash.c:   ^
hash.c: hash.c:190:1: note: use 'static' to give inline function 'F1024' internal linkage
hash.c: inline void F1024(u64 *h, const u64 *m) {
hash.c: ^
hash.c: static
hash.c: hash.c:193:3: warning: non-constant static local variable in inline function may be different in different files [-Wstatic-local-in-inline]
hash.c:   static u64 outQ[COLS1024] __attribute__((aligned(16)));
hash.c:   ^
hash.c: hash.c:190:1: note: use 'static' to give inline function 'F1024' internal linkage
hash.c: inline void F1024(u64 *h, const u64 *m) {
hash.c: ^
hash.c: static
hash.c: hash.c:194:3: warning: non-constant static local variable in inline function may be different in different files [-Wstatic-local-in-inline]
hash.c: ...
try.c: /usr/bin/ld: libcrypto_hash_groestl512.a(hash.o): in function `Transform':
try.c: .../supercop-data/alder/amd64/try/c/clang_-march=native_-O2_-fwrapv_-Qunused-arguments_-fPIC_-fPIE_-gdwarf-4_-Wall/timingleaks/crypto_hash/groestl512/opt64/work/hash.c:237: undefined reference to `F512'
try.c: /usr/bin/ld: .../supercop-data/alder/amd64/try/c/clang_-march=native_-O2_-fwrapv_-Qunused-arguments_-fPIC_-fPIE_-gdwarf-4_-Wall/timingleaks/crypto_hash/groestl512/opt64/work/hash.c:246: undefined reference to `F1024'
try.c: /usr/bin/ld: .../supercop-data/alder/amd64/try/c/clang_-march=native_-O2_-fwrapv_-Qunused-arguments_-fPIC_-fPIE_-gdwarf-4_-Wall/timingleaks/crypto_hash/groestl512/opt64/work/hash.c:237: undefined reference to `F512'
try.c: /usr/bin/ld: .../supercop-data/alder/amd64/try/c/clang_-march=native_-O2_-fwrapv_-Qunused-arguments_-fPIC_-fPIE_-gdwarf-4_-Wall/timingleaks/crypto_hash/groestl512/opt64/work/hash.c:246: undefined reference to `F1024'
try.c: /usr/bin/ld: .../supercop-data/alder/amd64/try/c/clang_-march=native_-O2_-fwrapv_-Qunused-arguments_-fPIC_-fPIE_-gdwarf-4_-Wall/timingleaks/crypto_hash/groestl512/opt64/work/hash.c:237: undefined reference to `F512'
try.c: /usr/bin/ld: .../supercop-data/alder/amd64/try/c/clang_-march=native_-O2_-fwrapv_-Qunused-arguments_-fPIC_-fPIE_-gdwarf-4_-Wall/timingleaks/crypto_hash/groestl512/opt64/work/hash.c:246: undefined reference to `F1024'
try.c: /usr/bin/ld: .../supercop-data/alder/amd64/try/c/clang_-march=native_-O2_-fwrapv_-Qunused-arguments_-fPIC_-fPIE_-gdwarf-4_-Wall/timingleaks/crypto_hash/groestl512/opt64/work/hash.c:237: undefined reference to `F512'
try.c: /usr/bin/ld: .../supercop-data/alder/amd64/try/c/clang_-march=native_-O2_-fwrapv_-Qunused-arguments_-fPIC_-fPIE_-gdwarf-4_-Wall/timingleaks/crypto_hash/groestl512/opt64/work/hash.c:246: undefined reference to `F1024'
try.c: /usr/bin/ld: .../supercop-data/alder/amd64/try/c/clang_-march=native_-O2_-fwrapv_-Qunused-arguments_-fPIC_-fPIE_-gdwarf-4_-Wall/timingleaks/crypto_hash/groestl512/opt64/work/hash.c:237: undefined reference to `F512'
try.c: /usr/bin/ld: .../supercop-data/alder/amd64/try/c/clang_-march=native_-O2_-fwrapv_-Qunused-arguments_-fPIC_-fPIE_-gdwarf-4_-Wall/timingleaks/crypto_hash/groestl512/opt64/work/hash.c:246: undefined reference to `F1024'
try.c: clang: error: linker command failed with exit code 1 (use -v to see invocation)

Number of similar (implementation,compiler) pairs: 1, namely:
ImplementationCompiler
T:opt64clang -march=native -O2 -fwrapv -Qunused-arguments -fPIC -fPIE -gdwarf-4 -Wall (Debian_Clang_11.0.1)

Compiler output


hash.c: hash.c:182:9: warning: unknown pragma ignored [-Wunknown-pragmas]
hash.c: #pragma vector aligned
hash.c:         ^
hash.c: hash.c:191:3: warning: non-constant static local variable in inline function may be different in different files [-Wstatic-local-in-inline]
hash.c:   static u64 y[COLS1024] __attribute__((aligned(16)));
hash.c:   ^
hash.c: hash.c:190:1: note: use 'static' to give inline function 'F1024' internal linkage
hash.c: inline void F1024(u64 *h, const u64 *m) {
hash.c: ^
hash.c: static
hash.c: hash.c:192:3: warning: non-constant static local variable in inline function may be different in different files [-Wstatic-local-in-inline]
hash.c:   static u64 z[COLS1024] __attribute__((aligned(16)));
hash.c:   ^
hash.c: hash.c:190:1: note: use 'static' to give inline function 'F1024' internal linkage
hash.c: inline void F1024(u64 *h, const u64 *m) {
hash.c: ^
hash.c: static
hash.c: hash.c:193:3: warning: non-constant static local variable in inline function may be different in different files [-Wstatic-local-in-inline]
hash.c:   static u64 outQ[COLS1024] __attribute__((aligned(16)));
hash.c:   ^
hash.c: hash.c:190:1: note: use 'static' to give inline function 'F1024' internal linkage
hash.c: inline void F1024(u64 *h, const u64 *m) {
hash.c: ^
hash.c: static
hash.c: hash.c:194:3: warning: non-constant static local variable in inline function may be different in different files [-Wstatic-local-in-inline]
hash.c: ...
try.c: /usr/bin/ld: libcrypto_hash_groestl512.a(hash.o): in function `Transform':
try.c: .../supercop-data/alder/amd64/try/c/clang_-march=native_-O3_-fwrapv_-Qunused-arguments_-fPIC_-fPIE_-gdwarf-4_-Wall/timingleaks/crypto_hash/groestl512/opt64/work/hash.c:237: undefined reference to `F512'
try.c: /usr/bin/ld: .../supercop-data/alder/amd64/try/c/clang_-march=native_-O3_-fwrapv_-Qunused-arguments_-fPIC_-fPIE_-gdwarf-4_-Wall/timingleaks/crypto_hash/groestl512/opt64/work/hash.c:246: undefined reference to `F1024'
try.c: /usr/bin/ld: .../supercop-data/alder/amd64/try/c/clang_-march=native_-O3_-fwrapv_-Qunused-arguments_-fPIC_-fPIE_-gdwarf-4_-Wall/timingleaks/crypto_hash/groestl512/opt64/work/hash.c:237: undefined reference to `F512'
try.c: /usr/bin/ld: .../supercop-data/alder/amd64/try/c/clang_-march=native_-O3_-fwrapv_-Qunused-arguments_-fPIC_-fPIE_-gdwarf-4_-Wall/timingleaks/crypto_hash/groestl512/opt64/work/hash.c:246: undefined reference to `F1024'
try.c: /usr/bin/ld: .../supercop-data/alder/amd64/try/c/clang_-march=native_-O3_-fwrapv_-Qunused-arguments_-fPIC_-fPIE_-gdwarf-4_-Wall/timingleaks/crypto_hash/groestl512/opt64/work/hash.c:237: undefined reference to `F512'
try.c: /usr/bin/ld: .../supercop-data/alder/amd64/try/c/clang_-march=native_-O3_-fwrapv_-Qunused-arguments_-fPIC_-fPIE_-gdwarf-4_-Wall/timingleaks/crypto_hash/groestl512/opt64/work/hash.c:246: undefined reference to `F1024'
try.c: /usr/bin/ld: .../supercop-data/alder/amd64/try/c/clang_-march=native_-O3_-fwrapv_-Qunused-arguments_-fPIC_-fPIE_-gdwarf-4_-Wall/timingleaks/crypto_hash/groestl512/opt64/work/hash.c:237: undefined reference to `F512'
try.c: /usr/bin/ld: .../supercop-data/alder/amd64/try/c/clang_-march=native_-O3_-fwrapv_-Qunused-arguments_-fPIC_-fPIE_-gdwarf-4_-Wall/timingleaks/crypto_hash/groestl512/opt64/work/hash.c:246: undefined reference to `F1024'
try.c: /usr/bin/ld: .../supercop-data/alder/amd64/try/c/clang_-march=native_-O3_-fwrapv_-Qunused-arguments_-fPIC_-fPIE_-gdwarf-4_-Wall/timingleaks/crypto_hash/groestl512/opt64/work/hash.c:237: undefined reference to `F512'
try.c: /usr/bin/ld: .../supercop-data/alder/amd64/try/c/clang_-march=native_-O3_-fwrapv_-Qunused-arguments_-fPIC_-fPIE_-gdwarf-4_-Wall/timingleaks/crypto_hash/groestl512/opt64/work/hash.c:246: undefined reference to `F1024'
try.c: clang: error: linker command failed with exit code 1 (use -v to see invocation)

Number of similar (implementation,compiler) pairs: 1, namely:
ImplementationCompiler
T:opt64clang -march=native -O3 -fwrapv -Qunused-arguments -fPIC -fPIE -gdwarf-4 -Wall (Debian_Clang_11.0.1)

Compiler output


hash.c: hash.c:182:9: warning: unknown pragma ignored [-Wunknown-pragmas]
hash.c: #pragma vector aligned
hash.c:         ^
hash.c: hash.c:191:3: warning: non-constant static local variable in inline function may be different in different files [-Wstatic-local-in-inline]
hash.c:   static u64 y[COLS1024] __attribute__((aligned(16)));
hash.c:   ^
hash.c: hash.c:190:1: note: use 'static' to give inline function 'F1024' internal linkage
hash.c: inline void F1024(u64 *h, const u64 *m) {
hash.c: ^
hash.c: static
hash.c: hash.c:192:3: warning: non-constant static local variable in inline function may be different in different files [-Wstatic-local-in-inline]
hash.c:   static u64 z[COLS1024] __attribute__((aligned(16)));
hash.c:   ^
hash.c: hash.c:190:1: note: use 'static' to give inline function 'F1024' internal linkage
hash.c: inline void F1024(u64 *h, const u64 *m) {
hash.c: ^
hash.c: static
hash.c: hash.c:193:3: warning: non-constant static local variable in inline function may be different in different files [-Wstatic-local-in-inline]
hash.c:   static u64 outQ[COLS1024] __attribute__((aligned(16)));
hash.c:   ^
hash.c: hash.c:190:1: note: use 'static' to give inline function 'F1024' internal linkage
hash.c: inline void F1024(u64 *h, const u64 *m) {
hash.c: ^
hash.c: static
hash.c: hash.c:194:3: warning: non-constant static local variable in inline function may be different in different files [-Wstatic-local-in-inline]
hash.c: ...
try.c: /usr/bin/ld: libcrypto_hash_groestl512.a(hash.o): in function `Transform':
try.c: .../supercop-data/alder/amd64/try/c/clang_-march=native_-O_-fwrapv_-Qunused-arguments_-fPIC_-fPIE_-gdwarf-4_-Wall/timingleaks/crypto_hash/groestl512/opt64/work/hash.c:237: undefined reference to `F512'
try.c: /usr/bin/ld: .../supercop-data/alder/amd64/try/c/clang_-march=native_-O_-fwrapv_-Qunused-arguments_-fPIC_-fPIE_-gdwarf-4_-Wall/timingleaks/crypto_hash/groestl512/opt64/work/hash.c:246: undefined reference to `F1024'
try.c: clang: error: linker command failed with exit code 1 (use -v to see invocation)

Number of similar (implementation,compiler) pairs: 1, namely:
ImplementationCompiler
T:opt64clang -march=native -O -fwrapv -Qunused-arguments -fPIC -fPIE -gdwarf-4 -Wall (Debian_Clang_11.0.1)

Compiler output


hash.c: hash.c:182:9: warning: unknown pragma ignored [-Wunknown-pragmas]
hash.c: #pragma vector aligned
hash.c:         ^
hash.c: hash.c:191:3: warning: non-constant static local variable in inline function may be different in different files [-Wstatic-local-in-inline]
hash.c:   static u64 y[COLS1024] __attribute__((aligned(16)));
hash.c:   ^
hash.c: hash.c:190:1: note: use 'static' to give inline function 'F1024' internal linkage
hash.c: inline void F1024(u64 *h, const u64 *m) {
hash.c: ^
hash.c: static
hash.c: hash.c:192:3: warning: non-constant static local variable in inline function may be different in different files [-Wstatic-local-in-inline]
hash.c:   static u64 z[COLS1024] __attribute__((aligned(16)));
hash.c:   ^
hash.c: hash.c:190:1: note: use 'static' to give inline function 'F1024' internal linkage
hash.c: inline void F1024(u64 *h, const u64 *m) {
hash.c: ^
hash.c: static
hash.c: hash.c:193:3: warning: non-constant static local variable in inline function may be different in different files [-Wstatic-local-in-inline]
hash.c:   static u64 outQ[COLS1024] __attribute__((aligned(16)));
hash.c:   ^
hash.c: hash.c:190:1: note: use 'static' to give inline function 'F1024' internal linkage
hash.c: inline void F1024(u64 *h, const u64 *m) {
hash.c: ^
hash.c: static
hash.c: hash.c:194:3: warning: non-constant static local variable in inline function may be different in different files [-Wstatic-local-in-inline]
hash.c: ...
try.c: /usr/bin/ld: libcrypto_hash_groestl512.a(hash.o): in function `Transform':
try.c: .../supercop-data/alder/amd64/try/c/clang_-march=native_-Os_-fwrapv_-Qunused-arguments_-fPIC_-fPIE_-gdwarf-4_-Wall/timingleaks/crypto_hash/groestl512/opt64/work/hash.c:237: undefined reference to `F512'
try.c: /usr/bin/ld: .../supercop-data/alder/amd64/try/c/clang_-march=native_-Os_-fwrapv_-Qunused-arguments_-fPIC_-fPIE_-gdwarf-4_-Wall/timingleaks/crypto_hash/groestl512/opt64/work/hash.c:246: undefined reference to `F1024'
try.c: clang: error: linker command failed with exit code 1 (use -v to see invocation)

Number of similar (implementation,compiler) pairs: 1, namely:
ImplementationCompiler
T:opt64clang -march=native -Os -fwrapv -Qunused-arguments -fPIC -fPIE -gdwarf-4 -Wall (Debian_Clang_11.0.1)

Compiler output


hash.c: hash.c:182:9: warning: unknown pragma ignored [-Wunknown-pragmas]
hash.c: #pragma vector aligned
hash.c:         ^
hash.c: hash.c:191:3: warning: non-constant static local variable in inline function may be different in different files [-Wstatic-local-in-inline]
hash.c:   static u64 y[COLS1024] __attribute__((aligned(16)));
hash.c:   ^
hash.c: hash.c:190:1: note: use 'static' to give inline function 'F1024' internal linkage
hash.c: inline void F1024(u64 *h, const u64 *m) {
hash.c: ^
hash.c: static
hash.c: hash.c:192:3: warning: non-constant static local variable in inline function may be different in different files [-Wstatic-local-in-inline]
hash.c:   static u64 z[COLS1024] __attribute__((aligned(16)));
hash.c:   ^
hash.c: hash.c:190:1: note: use 'static' to give inline function 'F1024' internal linkage
hash.c: inline void F1024(u64 *h, const u64 *m) {
hash.c: ^
hash.c: static
hash.c: hash.c:193:3: warning: non-constant static local variable in inline function may be different in different files [-Wstatic-local-in-inline]
hash.c:   static u64 outQ[COLS1024] __attribute__((aligned(16)));
hash.c:   ^
hash.c: hash.c:190:1: note: use 'static' to give inline function 'F1024' internal linkage
hash.c: inline void F1024(u64 *h, const u64 *m) {
hash.c: ^
hash.c: static
hash.c: hash.c:194:3: warning: non-constant static local variable in inline function may be different in different files [-Wstatic-local-in-inline]
hash.c: ...
try.c: /usr/bin/ld: libcrypto_hash_groestl512.a(hash.o): in function `Transform':
try.c: .../supercop-data/alder/amd64/try/c/clang_-mcpu=native_-O3_-fwrapv_-Qunused-arguments_-fPIC_-fPIE_-gdwarf-4_-Wall/timingleaks/crypto_hash/groestl512/opt64/work/hash.c:237: undefined reference to `F512'
try.c: /usr/bin/ld: .../supercop-data/alder/amd64/try/c/clang_-mcpu=native_-O3_-fwrapv_-Qunused-arguments_-fPIC_-fPIE_-gdwarf-4_-Wall/timingleaks/crypto_hash/groestl512/opt64/work/hash.c:246: undefined reference to `F1024'
try.c: /usr/bin/ld: .../supercop-data/alder/amd64/try/c/clang_-mcpu=native_-O3_-fwrapv_-Qunused-arguments_-fPIC_-fPIE_-gdwarf-4_-Wall/timingleaks/crypto_hash/groestl512/opt64/work/hash.c:237: undefined reference to `F512'
try.c: /usr/bin/ld: .../supercop-data/alder/amd64/try/c/clang_-mcpu=native_-O3_-fwrapv_-Qunused-arguments_-fPIC_-fPIE_-gdwarf-4_-Wall/timingleaks/crypto_hash/groestl512/opt64/work/hash.c:246: undefined reference to `F1024'
try.c: /usr/bin/ld: .../supercop-data/alder/amd64/try/c/clang_-mcpu=native_-O3_-fwrapv_-Qunused-arguments_-fPIC_-fPIE_-gdwarf-4_-Wall/timingleaks/crypto_hash/groestl512/opt64/work/hash.c:237: undefined reference to `F512'
try.c: /usr/bin/ld: .../supercop-data/alder/amd64/try/c/clang_-mcpu=native_-O3_-fwrapv_-Qunused-arguments_-fPIC_-fPIE_-gdwarf-4_-Wall/timingleaks/crypto_hash/groestl512/opt64/work/hash.c:246: undefined reference to `F1024'
try.c: /usr/bin/ld: .../supercop-data/alder/amd64/try/c/clang_-mcpu=native_-O3_-fwrapv_-Qunused-arguments_-fPIC_-fPIE_-gdwarf-4_-Wall/timingleaks/crypto_hash/groestl512/opt64/work/hash.c:237: undefined reference to `F512'
try.c: /usr/bin/ld: .../supercop-data/alder/amd64/try/c/clang_-mcpu=native_-O3_-fwrapv_-Qunused-arguments_-fPIC_-fPIE_-gdwarf-4_-Wall/timingleaks/crypto_hash/groestl512/opt64/work/hash.c:246: undefined reference to `F1024'
try.c: /usr/bin/ld: .../supercop-data/alder/amd64/try/c/clang_-mcpu=native_-O3_-fwrapv_-Qunused-arguments_-fPIC_-fPIE_-gdwarf-4_-Wall/timingleaks/crypto_hash/groestl512/opt64/work/hash.c:237: undefined reference to `F512'
try.c: /usr/bin/ld: .../supercop-data/alder/amd64/try/c/clang_-mcpu=native_-O3_-fwrapv_-Qunused-arguments_-fPIC_-fPIE_-gdwarf-4_-Wall/timingleaks/crypto_hash/groestl512/opt64/work/hash.c:246: undefined reference to `F1024'
try.c: clang: error: linker command failed with exit code 1 (use -v to see invocation)

Number of similar (implementation,compiler) pairs: 1, namely:
ImplementationCompiler
T:opt64clang -mcpu=native -O3 -fwrapv -Qunused-arguments -fPIC -fPIE -gdwarf-4 -Wall (Debian_Clang_11.0.1)

Compiler output


hash.c: hash.c: In function 'F512':
hash.c: hash.c:182: warning: ignoring '#pragma vector aligned' [-Wunknown-pragmas]
hash.c:   182 | #pragma vector aligned
hash.c:       |
hash.c: hash.c: In function 'F1024':
hash.c: hash.c:219: warning: ignoring '#pragma vector aligned' [-Wunknown-pragmas]
hash.c:   219 | #pragma vector aligned
hash.c:       |
hash.c: hash.c: At top level:
hash.c: hash.c:194:14: warning: 'inP' is static but declared in inline function 'F1024' which is not static
hash.c:   194 |   static u64 inP[COLS1024] __attribute__((aligned(16)));
hash.c:       |              ^~~
hash.c: hash.c:193:14: warning: 'outQ' is static but declared in inline function 'F1024' which is not static
hash.c:   193 |   static u64 outQ[COLS1024] __attribute__((aligned(16)));
hash.c:       |              ^~~~
hash.c: hash.c:192:14: warning: 'z' is static but declared in inline function 'F1024' which is not static
hash.c:   192 |   static u64 z[COLS1024] __attribute__((aligned(16)));
hash.c:       |              ^
hash.c: hash.c:191:14: warning: 'y' is static but declared in inline function 'F1024' which is not static
hash.c:   191 |   static u64 y[COLS1024] __attribute__((aligned(16)));
hash.c:       |              ^
try.c: /usr/bin/ld: libcrypto_hash_groestl512.a(hash.o): in function `Transform':
try.c: .../supercop-data/alder/amd64/try/c/gcc_-march=native_-mtune=native_-O2_-fwrapv_-fPIC_-fPIE_-gdwarf-4_-Wall/timingleaks/crypto_hash/groestl512/opt64/work/hash.c:246: undefined reference to `F1024'
try.c: /usr/bin/ld: .../supercop-data/alder/amd64/try/c/gcc_-march=native_-mtune=native_-O2_-fwrapv_-fPIC_-fPIE_-gdwarf-4_-Wall/timingleaks/crypto_hash/groestl512/opt64/work/hash.c:237: undefined reference to `F512'
try.c: collect2: error: ld returned 1 exit status

Number of similar (implementation,compiler) pairs: 1, namely:
ImplementationCompiler
T:opt64gcc -march=native -mtune=native -O2 -fwrapv -fPIC -fPIE -gdwarf-4 -Wall (10.2.1_20210110)

Compiler output


hash.c: hash.c: In function 'F512':
hash.c: hash.c:182: warning: ignoring '#pragma vector aligned' [-Wunknown-pragmas]
hash.c:   182 | #pragma vector aligned
hash.c:       |
hash.c: hash.c: In function 'F1024':
hash.c: hash.c:219: warning: ignoring '#pragma vector aligned' [-Wunknown-pragmas]
hash.c:   219 | #pragma vector aligned
hash.c:       |
hash.c: hash.c: At top level:
hash.c: hash.c:194:14: warning: 'inP' is static but declared in inline function 'F1024' which is not static
hash.c:   194 |   static u64 inP[COLS1024] __attribute__((aligned(16)));
hash.c:       |              ^~~
hash.c: hash.c:193:14: warning: 'outQ' is static but declared in inline function 'F1024' which is not static
hash.c:   193 |   static u64 outQ[COLS1024] __attribute__((aligned(16)));
hash.c:       |              ^~~~
hash.c: hash.c:192:14: warning: 'z' is static but declared in inline function 'F1024' which is not static
hash.c:   192 |   static u64 z[COLS1024] __attribute__((aligned(16)));
hash.c:       |              ^
hash.c: hash.c:191:14: warning: 'y' is static but declared in inline function 'F1024' which is not static
hash.c:   191 |   static u64 y[COLS1024] __attribute__((aligned(16)));
hash.c:       |              ^
try.c: /usr/bin/ld: libcrypto_hash_groestl512.a(hash.o): in function `Transform':
try.c: .../supercop-data/alder/amd64/try/c/gcc_-march=native_-mtune=native_-O3_-fwrapv_-fPIC_-fPIE_-gdwarf-4_-Wall/timingleaks/crypto_hash/groestl512/opt64/work/hash.c:246: undefined reference to `F1024'
try.c: /usr/bin/ld: .../supercop-data/alder/amd64/try/c/gcc_-march=native_-mtune=native_-O3_-fwrapv_-fPIC_-fPIE_-gdwarf-4_-Wall/timingleaks/crypto_hash/groestl512/opt64/work/hash.c:237: undefined reference to `F512'
try.c: /usr/bin/ld: .../supercop-data/alder/amd64/try/c/gcc_-march=native_-mtune=native_-O3_-fwrapv_-fPIC_-fPIE_-gdwarf-4_-Wall/timingleaks/crypto_hash/groestl512/opt64/work/hash.c:246: undefined reference to `F1024'
try.c: /usr/bin/ld: .../supercop-data/alder/amd64/try/c/gcc_-march=native_-mtune=native_-O3_-fwrapv_-fPIC_-fPIE_-gdwarf-4_-Wall/timingleaks/crypto_hash/groestl512/opt64/work/hash.c:237: undefined reference to `F512'
try.c: /usr/bin/ld: .../supercop-data/alder/amd64/try/c/gcc_-march=native_-mtune=native_-O3_-fwrapv_-fPIC_-fPIE_-gdwarf-4_-Wall/timingleaks/crypto_hash/groestl512/opt64/work/hash.c:246: undefined reference to `F1024'
try.c: /usr/bin/ld: .../supercop-data/alder/amd64/try/c/gcc_-march=native_-mtune=native_-O3_-fwrapv_-fPIC_-fPIE_-gdwarf-4_-Wall/timingleaks/crypto_hash/groestl512/opt64/work/hash.c:237: undefined reference to `F512'
try.c: /usr/bin/ld: .../supercop-data/alder/amd64/try/c/gcc_-march=native_-mtune=native_-O3_-fwrapv_-fPIC_-fPIE_-gdwarf-4_-Wall/timingleaks/crypto_hash/groestl512/opt64/work/hash.c:246: undefined reference to `F1024'
try.c: /usr/bin/ld: .../supercop-data/alder/amd64/try/c/gcc_-march=native_-mtune=native_-O3_-fwrapv_-fPIC_-fPIE_-gdwarf-4_-Wall/timingleaks/crypto_hash/groestl512/opt64/work/hash.c:246: undefined reference to `F1024'
try.c: /usr/bin/ld: .../supercop-data/alder/amd64/try/c/gcc_-march=native_-mtune=native_-O3_-fwrapv_-fPIC_-fPIE_-gdwarf-4_-Wall/timingleaks/crypto_hash/groestl512/opt64/work/hash.c:237: undefined reference to `F512'
try.c: /usr/bin/ld: .../supercop-data/alder/amd64/try/c/gcc_-march=native_-mtune=native_-O3_-fwrapv_-fPIC_-fPIE_-gdwarf-4_-Wall/timingleaks/crypto_hash/groestl512/opt64/work/hash.c:237: undefined reference to `F512'
try.c: collect2: error: ld returned 1 exit status

Number of similar (implementation,compiler) pairs: 1, namely:
ImplementationCompiler
T:opt64gcc -march=native -mtune=native -O3 -fwrapv -fPIC -fPIE -gdwarf-4 -Wall (10.2.1_20210110)

Compiler output


hash.c: hash.c: In function 'F512':
hash.c: hash.c:182: warning: ignoring '#pragma vector aligned' [-Wunknown-pragmas]
hash.c:   182 | #pragma vector aligned
hash.c:       |
hash.c: hash.c: In function 'F1024':
hash.c: hash.c:219: warning: ignoring '#pragma vector aligned' [-Wunknown-pragmas]
hash.c:   219 | #pragma vector aligned
hash.c:       |
hash.c: hash.c: At top level:
hash.c: hash.c:194:14: warning: 'inP' is static but declared in inline function 'F1024' which is not static
hash.c:   194 |   static u64 inP[COLS1024] __attribute__((aligned(16)));
hash.c:       |              ^~~
hash.c: hash.c:193:14: warning: 'outQ' is static but declared in inline function 'F1024' which is not static
hash.c:   193 |   static u64 outQ[COLS1024] __attribute__((aligned(16)));
hash.c:       |              ^~~~
hash.c: hash.c:192:14: warning: 'z' is static but declared in inline function 'F1024' which is not static
hash.c:   192 |   static u64 z[COLS1024] __attribute__((aligned(16)));
hash.c:       |              ^
hash.c: hash.c:191:14: warning: 'y' is static but declared in inline function 'F1024' which is not static
hash.c:   191 |   static u64 y[COLS1024] __attribute__((aligned(16)));
hash.c:       |              ^
try.c: /usr/bin/ld: libcrypto_hash_groestl512.a(hash.o): in function `Transform':
try.c: .../supercop-data/alder/amd64/try/c/gcc_-march=native_-mtune=native_-O_-fwrapv_-fPIC_-fPIE_-gdwarf-4_-Wall/timingleaks/crypto_hash/groestl512/opt64/work/hash.c:246: undefined reference to `F1024'
try.c: /usr/bin/ld: .../supercop-data/alder/amd64/try/c/gcc_-march=native_-mtune=native_-O_-fwrapv_-fPIC_-fPIE_-gdwarf-4_-Wall/timingleaks/crypto_hash/groestl512/opt64/work/hash.c:237: undefined reference to `F512'
try.c: collect2: error: ld returned 1 exit status

Number of similar (implementation,compiler) pairs: 1, namely:
ImplementationCompiler
T:opt64gcc -march=native -mtune=native -O -fwrapv -fPIC -fPIE -gdwarf-4 -Wall (10.2.1_20210110)

Compiler output


hash.c: hash.c: In function 'F512':
hash.c: hash.c:182: warning: ignoring '#pragma vector aligned' [-Wunknown-pragmas]
hash.c:   182 | #pragma vector aligned
hash.c:       |
hash.c: hash.c: In function 'F1024':
hash.c: hash.c:219: warning: ignoring '#pragma vector aligned' [-Wunknown-pragmas]
hash.c:   219 | #pragma vector aligned
hash.c:       |
hash.c: hash.c: At top level:
hash.c: hash.c:194:14: warning: 'inP' is static but declared in inline function 'F1024' which is not static
hash.c:   194 |   static u64 inP[COLS1024] __attribute__((aligned(16)));
hash.c:       |              ^~~
hash.c: hash.c:193:14: warning: 'outQ' is static but declared in inline function 'F1024' which is not static
hash.c:   193 |   static u64 outQ[COLS1024] __attribute__((aligned(16)));
hash.c:       |              ^~~~
hash.c: hash.c:192:14: warning: 'z' is static but declared in inline function 'F1024' which is not static
hash.c:   192 |   static u64 z[COLS1024] __attribute__((aligned(16)));
hash.c:       |              ^
hash.c: hash.c:191:14: warning: 'y' is static but declared in inline function 'F1024' which is not static
hash.c:   191 |   static u64 y[COLS1024] __attribute__((aligned(16)));
hash.c:       |              ^
try.c: /usr/bin/ld: libcrypto_hash_groestl512.a(hash.o): in function `Transform':
try.c: .../supercop-data/alder/amd64/try/c/gcc_-march=native_-mtune=native_-Os_-fwrapv_-fPIC_-fPIE_-gdwarf-4_-Wall/timingleaks/crypto_hash/groestl512/opt64/work/hash.c:237: undefined reference to `F512'
try.c: /usr/bin/ld: .../supercop-data/alder/amd64/try/c/gcc_-march=native_-mtune=native_-Os_-fwrapv_-fPIC_-fPIE_-gdwarf-4_-Wall/timingleaks/crypto_hash/groestl512/opt64/work/hash.c:246: undefined reference to `F1024'
try.c: collect2: error: ld returned 1 exit status

Number of similar (implementation,compiler) pairs: 1, namely:
ImplementationCompiler
T:opt64gcc -march=native -mtune=native -Os -fwrapv -fPIC -fPIE -gdwarf-4 -Wall (10.2.1_20210110)

Compiler output


try.c: /usr/bin/ld: libcrypto_hash_groestl512.a(hash.o): in function `Transform':
try.c: .../supercop-data/alder/amd64/try/c/clang_-march=native_-O_-fwrapv_-Qunused-arguments_-fPIC_-fPIE_-gdwarf-4_-Wall/timingleaks/crypto_hash/groestl512/opteron/work/hash.c:36: undefined reference to `Q1024ASM'
try.c: /usr/bin/ld: .../supercop-data/alder/amd64/try/c/clang_-march=native_-O_-fwrapv_-Qunused-arguments_-fPIC_-fPIE_-gdwarf-4_-Wall/timingleaks/crypto_hash/groestl512/opteron/work/hash.c:37: undefined reference to `P1024ASM'
try.c: /usr/bin/ld: libcrypto_hash_groestl512.a(hash.o): in function `OutputTransformation':
try.c: .../supercop-data/alder/amd64/try/c/clang_-march=native_-O_-fwrapv_-Qunused-arguments_-fPIC_-fPIE_-gdwarf-4_-Wall/timingleaks/crypto_hash/groestl512/opteron/work/hash.c:56: undefined reference to `P1024ASM'
try.c: clang: error: linker command failed with exit code 1 (use -v to see invocation)

Number of similar (implementation,compiler) pairs: 1, namely:
ImplementationCompiler
T:opteronclang -march=native -O -fwrapv -Qunused-arguments -fPIC -fPIE -gdwarf-4 -Wall (Debian_Clang_11.0.1)

Compiler output


try.c: /usr/bin/ld: libcrypto_hash_groestl512.a(hash.o): in function `Transform':
try.c: .../supercop-data/alder/amd64/try/c/gcc_-march=native_-mtune=native_-O2_-fwrapv_-fPIC_-fPIE_-gdwarf-4_-Wall/timingleaks/crypto_hash/groestl512/opteron/work/hash.c:36: undefined reference to `Q1024ASM'
try.c: /usr/bin/ld: .../supercop-data/alder/amd64/try/c/gcc_-march=native_-mtune=native_-O2_-fwrapv_-fPIC_-fPIE_-gdwarf-4_-Wall/timingleaks/crypto_hash/groestl512/opteron/work/hash.c:37: undefined reference to `P1024ASM'
try.c: /usr/bin/ld: libcrypto_hash_groestl512.a(hash.o): in function `OutputTransformation':
try.c: .../supercop-data/alder/amd64/try/c/gcc_-march=native_-mtune=native_-O2_-fwrapv_-fPIC_-fPIE_-gdwarf-4_-Wall/timingleaks/crypto_hash/groestl512/opteron/work/hash.c:56: undefined reference to `P1024ASM'
try.c: collect2: error: ld returned 1 exit status

Number of similar (implementation,compiler) pairs: 1, namely:
ImplementationCompiler
T:opterongcc -march=native -mtune=native -O2 -fwrapv -fPIC -fPIE -gdwarf-4 -Wall (10.2.1_20210110)

Compiler output


try.c: /usr/bin/ld: libcrypto_hash_groestl512.a(hash.o): in function `Transform':
try.c: .../supercop-data/alder/amd64/try/c/gcc_-march=native_-mtune=native_-O3_-fwrapv_-fPIC_-fPIE_-gdwarf-4_-Wall/timingleaks/crypto_hash/groestl512/opteron/work/hash.c:36: undefined reference to `Q1024ASM'
try.c: /usr/bin/ld: .../supercop-data/alder/amd64/try/c/gcc_-march=native_-mtune=native_-O3_-fwrapv_-fPIC_-fPIE_-gdwarf-4_-Wall/timingleaks/crypto_hash/groestl512/opteron/work/hash.c:37: undefined reference to `P1024ASM'
try.c: /usr/bin/ld: .../supercop-data/alder/amd64/try/c/gcc_-march=native_-mtune=native_-O3_-fwrapv_-fPIC_-fPIE_-gdwarf-4_-Wall/timingleaks/crypto_hash/groestl512/opteron/work/hash.c:36: undefined reference to `Q1024ASM'
try.c: /usr/bin/ld: .../supercop-data/alder/amd64/try/c/gcc_-march=native_-mtune=native_-O3_-fwrapv_-fPIC_-fPIE_-gdwarf-4_-Wall/timingleaks/crypto_hash/groestl512/opteron/work/hash.c:37: undefined reference to `P1024ASM'
try.c: /usr/bin/ld: libcrypto_hash_groestl512.a(hash.o): in function `OutputTransformation':
try.c: .../supercop-data/alder/amd64/try/c/gcc_-march=native_-mtune=native_-O3_-fwrapv_-fPIC_-fPIE_-gdwarf-4_-Wall/timingleaks/crypto_hash/groestl512/opteron/work/hash.c:56: undefined reference to `P1024ASM'
try.c: /usr/bin/ld: .../supercop-data/alder/amd64/try/c/gcc_-march=native_-mtune=native_-O3_-fwrapv_-fPIC_-fPIE_-gdwarf-4_-Wall/timingleaks/crypto_hash/groestl512/opteron/work/hash.c:56: undefined reference to `P1024ASM'
try.c: collect2: error: ld returned 1 exit status

Number of similar (implementation,compiler) pairs: 1, namely:
ImplementationCompiler
T:opterongcc -march=native -mtune=native -O3 -fwrapv -fPIC -fPIE -gdwarf-4 -Wall (10.2.1_20210110)

Compiler output


try.c: /usr/bin/ld: libcrypto_hash_groestl512.a(hash.o): in function `Transform':
try.c: .../supercop-data/alder/amd64/try/c/gcc_-march=native_-mtune=native_-O_-fwrapv_-fPIC_-fPIE_-gdwarf-4_-Wall/timingleaks/crypto_hash/groestl512/opteron/work/hash.c:36: undefined reference to `Q1024ASM'
try.c: /usr/bin/ld: .../supercop-data/alder/amd64/try/c/gcc_-march=native_-mtune=native_-O_-fwrapv_-fPIC_-fPIE_-gdwarf-4_-Wall/timingleaks/crypto_hash/groestl512/opteron/work/hash.c:37: undefined reference to `P1024ASM'
try.c: /usr/bin/ld: libcrypto_hash_groestl512.a(hash.o): in function `OutputTransformation':
try.c: .../supercop-data/alder/amd64/try/c/gcc_-march=native_-mtune=native_-O_-fwrapv_-fPIC_-fPIE_-gdwarf-4_-Wall/timingleaks/crypto_hash/groestl512/opteron/work/hash.c:56: undefined reference to `P1024ASM'
try.c: collect2: error: ld returned 1 exit status

Number of similar (implementation,compiler) pairs: 1, namely:
ImplementationCompiler
T:opterongcc -march=native -mtune=native -O -fwrapv -fPIC -fPIE -gdwarf-4 -Wall (10.2.1_20210110)

Compiler output


try.c: /usr/bin/ld: libcrypto_hash_groestl512.a(hash.o): in function `Transform':
try.c: .../supercop-data/alder/amd64/try/c/gcc_-march=native_-mtune=native_-Os_-fwrapv_-fPIC_-fPIE_-gdwarf-4_-Wall/timingleaks/crypto_hash/groestl512/opteron/work/hash.c:36: undefined reference to `Q1024ASM'
try.c: /usr/bin/ld: .../supercop-data/alder/amd64/try/c/gcc_-march=native_-mtune=native_-Os_-fwrapv_-fPIC_-fPIE_-gdwarf-4_-Wall/timingleaks/crypto_hash/groestl512/opteron/work/hash.c:37: undefined reference to `P1024ASM'
try.c: /usr/bin/ld: libcrypto_hash_groestl512.a(hash.o): in function `OutputTransformation':
try.c: .../supercop-data/alder/amd64/try/c/gcc_-march=native_-mtune=native_-Os_-fwrapv_-fPIC_-fPIE_-gdwarf-4_-Wall/timingleaks/crypto_hash/groestl512/opteron/work/hash.c:56: undefined reference to `P1024ASM'
try.c: collect2: error: ld returned 1 exit status

Number of similar (implementation,compiler) pairs: 1, namely:
ImplementationCompiler
T:opterongcc -march=native -mtune=native -Os -fwrapv -fPIC -fPIE -gdwarf-4 -Wall (10.2.1_20210110)

Compiler output


groestl.c: groestl.c: In function 'groestl_small_close':
groestl.c: groestl.c:2812:17: warning: variable 'buf' set but not used [-Wunused-but-set-variable]
groestl.c:  2812 |  unsigned char *buf;
groestl.c:       |                 ^~~
groestl.c: groestl.c: In function 'groestl_big_close':
groestl.c: groestl.c:2948:17: warning: variable 'buf' set but not used [-Wunused-but-set-variable]
groestl.c:  2948 |  unsigned char *buf;
groestl.c:       |                 ^~~

Number of similar (implementation,compiler) pairs: 8, namely:
ImplementationCompiler
T:sphlibgcc -march=native -mtune=native -O2 -fwrapv -fPIC -fPIE -gdwarf-4 -Wall (10.2.1_20210110)
T:sphlibgcc -march=native -mtune=native -O3 -fwrapv -fPIC -fPIE -gdwarf-4 -Wall (10.2.1_20210110)
T:sphlibgcc -march=native -mtune=native -O -fwrapv -fPIC -fPIE -gdwarf-4 -Wall (10.2.1_20210110)
T:sphlibgcc -march=native -mtune=native -Os -fwrapv -fPIC -fPIE -gdwarf-4 -Wall (10.2.1_20210110)
T:sphlib-smallgcc -march=native -mtune=native -O2 -fwrapv -fPIC -fPIE -gdwarf-4 -Wall (10.2.1_20210110)
T:sphlib-smallgcc -march=native -mtune=native -O3 -fwrapv -fPIC -fPIE -gdwarf-4 -Wall (10.2.1_20210110)
T:sphlib-smallgcc -march=native -mtune=native -O -fwrapv -fPIC -fPIE -gdwarf-4 -Wall (10.2.1_20210110)
T:sphlib-smallgcc -march=native -mtune=native -Os -fwrapv -fPIC -fPIE -gdwarf-4 -Wall (10.2.1_20210110)

Compiler output


groestl.c: groestl.c: In function 'groestl_small_close':
groestl.c: groestl.c:2742:18: warning: variable 'buf' set but not used [-Wunused-but-set-variable]
groestl.c:  2742 |   unsigned char *buf;
groestl.c:       |                  ^~~
groestl.c: groestl.c: In function 'groestl_big_close':
groestl.c: groestl.c:2878:18: warning: variable 'buf' set but not used [-Wunused-but-set-variable]
groestl.c:  2878 |   unsigned char *buf;
groestl.c:       |                  ^~~

Number of similar (implementation,compiler) pairs: 4, namely:
ImplementationCompiler
T:sphlib-adaptedgcc -march=native -mtune=native -O2 -fwrapv -fPIC -fPIE -gdwarf-4 -Wall (10.2.1_20210110)
T:sphlib-adaptedgcc -march=native -mtune=native -O3 -fwrapv -fPIC -fPIE -gdwarf-4 -Wall (10.2.1_20210110)
T:sphlib-adaptedgcc -march=native -mtune=native -O -fwrapv -fPIC -fPIE -gdwarf-4 -Wall (10.2.1_20210110)
T:sphlib-adaptedgcc -march=native -mtune=native -Os -fwrapv -fPIC -fPIE -gdwarf-4 -Wall (10.2.1_20210110)

Compiler output


hash.c: hash.c:104:12: warning: comparison of array 'ctx->chaining' equal to a null pointer is always false [-Wtautological-pointer-compare]
hash.c:   if (ctx->chaining == NULL || ctx->buffer == NULL)
hash.c:       ~~~~~^~~~~~~~    ~~~~
hash.c: hash.c:104:37: warning: comparison of array 'ctx->buffer' equal to a null pointer is always false [-Wtautological-pointer-compare]
hash.c:   if (ctx->chaining == NULL || ctx->buffer == NULL)
hash.c:                                ~~~~~^~~~~~    ~~~~
hash.c: In file included from hash.c:19:
hash.c: ./groestl-asm-vperm.h:1196:3: error: invalid operand for instruction
hash.c:   VPERM_Transform_RoundConst();
hash.c:   ^
hash.c: ./groestl-asm-vperm.h:1173:3: note: expanded from macro 'VPERM_Transform_RoundConst'
hash.c:   VPERM_Transform_RoundConst_CNT2(0, 1);\
hash.c:   ^
hash.c: ./groestl-asm-vperm.h:1158:8: note: expanded from macro 'VPERM_Transform_RoundConst_CNT2'
hash.c:   asm ("movaps xmm0, [ROUND_CONST_P+"tostr(i)"*16]");\
hash.c:        ^
hash.c: <inline asm>:1:15: note: instantiated into assembly here
hash.c:         movaps xmm0, [ROUND_CONST_P+0*16]
hash.c:                      ^~~~~~~~~~~~~~~~~~~~
hash.c: In file included from hash.c:19:
hash.c: ./groestl-asm-vperm.h:1196:3: error: invalid operand for instruction
hash.c:   VPERM_Transform_RoundConst();
hash.c:   ^
hash.c: ./groestl-asm-vperm.h:1173:3: note: expanded from macro 'VPERM_Transform_RoundConst'
hash.c:   VPERM_Transform_RoundConst_CNT2(0, 1);\
hash.c: ...

Number of similar (implementation,compiler) pairs: 5, namely:
ImplementationCompiler
T:vpermclang -march=native -O2 -fwrapv -Qunused-arguments -fPIC -fPIE -gdwarf-4 -Wall (Debian_Clang_11.0.1)
T:vpermclang -march=native -O3 -fwrapv -Qunused-arguments -fPIC -fPIE -gdwarf-4 -Wall (Debian_Clang_11.0.1)
T:vpermclang -march=native -O -fwrapv -Qunused-arguments -fPIC -fPIE -gdwarf-4 -Wall (Debian_Clang_11.0.1)
T:vpermclang -march=native -Os -fwrapv -Qunused-arguments -fPIC -fPIE -gdwarf-4 -Wall (Debian_Clang_11.0.1)
T:vpermclang -mcpu=native -O3 -fwrapv -Qunused-arguments -fPIC -fPIE -gdwarf-4 -Wall (Debian_Clang_11.0.1)

Compiler output


try.c: /usr/bin/ld: libcrypto_hash_groestl512.a(hash.o): relocation R_X86_64_32S against symbol `ROUND_CONST_P' can not be used when making a PIE object; recompile with -fPIE
try.c: collect2: error: ld returned 1 exit status

Number of similar (implementation,compiler) pairs: 4, namely:
ImplementationCompiler
T:vpermgcc -march=native -mtune=native -O2 -fwrapv -fPIC -fPIE -gdwarf-4 -Wall (10.2.1_20210110)
T:vpermgcc -march=native -mtune=native -O3 -fwrapv -fPIC -fPIE -gdwarf-4 -Wall (10.2.1_20210110)
T:vpermgcc -march=native -mtune=native -O -fwrapv -fPIC -fPIE -gdwarf-4 -Wall (10.2.1_20210110)
T:vpermgcc -march=native -mtune=native -Os -fwrapv -fPIC -fPIE -gdwarf-4 -Wall (10.2.1_20210110)

Compiler output


hash.c: In file included from hash.c:34:
hash.c: ./groestl-intr-vperm.h:1102:3: error: always_inline function '_mm_shuffle_epi8' requires target feature 'ssse3', but would be inlined into function 'INIT' that is compiled without support for 'ssse3'
hash.c:   VPERM_Transform_RoundConst();
hash.c:   ^
hash.c: ./groestl-intr-vperm.h:1081:3: note: expanded from macro 'VPERM_Transform_RoundConst'
hash.c:   VPERM_Transform_RoundConst_CNT2(0, 1);\
hash.c:   ^
hash.c: ./groestl-intr-vperm.h:1070:3: note: expanded from macro 'VPERM_Transform_RoundConst_CNT2'
hash.c:   VPERM_Transform_State(xmm0, xmm1, xmm2, xmm3, VPERM_IPT, xmm4, xmm5, xmm6, xmm7, xmm8, xmm9, xmm10);\
hash.c:   ^
hash.c: ./groestl-intr-vperm.h:133:3: note: expanded from macro 'VPERM_Transform_State'
hash.c:   VPERM_Transform_No_Const(a0, a1, t0, t1, t2, t3, c0, c1, c2);\
hash.c:   ^
hash.c: ./groestl-intr-vperm.h:88:8: note: expanded from macro 'VPERM_Transform_No_Const'
hash.c:   t2 = _mm_shuffle_epi8(t2, a0);\
hash.c:        ^
hash.c: ./groestl-intr-vperm.h:1102:3: error: always_inline function '_mm_shuffle_epi8' requires target feature 'ssse3', but would be inlined into function 'INIT' that is compiled without support for 'ssse3'
hash.c: ./groestl-intr-vperm.h:1081:3: note: expanded from macro 'VPERM_Transform_RoundConst'
hash.c:   VPERM_Transform_RoundConst_CNT2(0, 1);\
hash.c:   ^
hash.c: ./groestl-intr-vperm.h:1070:3: note: expanded from macro 'VPERM_Transform_RoundConst_CNT2'
hash.c:   VPERM_Transform_State(xmm0, xmm1, xmm2, xmm3, VPERM_IPT, xmm4, xmm5, xmm6, xmm7, xmm8, xmm9, xmm10);\
hash.c:   ^
hash.c: ./groestl-intr-vperm.h:133:3: note: expanded from macro 'VPERM_Transform_State'
hash.c:   VPERM_Transform_No_Const(a0, a1, t0, t1, t2, t3, c0, c1, c2);\
hash.c: ...

Number of similar (implementation,compiler) pairs: 1, namely:
ImplementationCompiler
T:vperm-intrclang -mcpu=native -O3 -fwrapv -Qunused-arguments -fPIC -fPIE -gdwarf-4 -Wall (Debian_Clang_11.0.1)