Implementation notes: aarch64, pmnod145, crypto_kem/titaniumccastd

Computer: pmnod145
Architecture: aarch64
CPU ID: 431f0af1
SUPERCOP version: 20191017
Operation: crypto_kem
Primitive: titaniumccastd

Test failure

Implementation: crypto_kem/titaniumccastd/opt
Compiler: armclang -march=armv8a+crypto -mcpu=thunderx2t99 -mtune=thunderx2t99 -O2 -fPIC -fPIE
error 111
crypto_kem_dec does not match k

Number of similar (compiler,implementation) pairs: 10, namely:
CompilerImplementations
armclang -march=armv8a+crypto -mcpu=thunderx2t99 -mtune=thunderx2t99 -O2 -fPIC -fPIE opt ref
armclang -march=armv8a+crypto -mcpu=thunderx2t99 -mtune=thunderx2t99 -O3 -fPIC -fPIE opt ref
gcc -march=native -mtune=native -O2 -fomit-frame-pointer -fwrapv -fPIC -fPIE opt ref
gcc -march=native -mtune=native -O3 -fomit-frame-pointer -fwrapv -fPIC -fPIE opt ref
gcc -march=native -mtune=native -O -fomit-frame-pointer -fwrapv -fPIC -fPIE opt ref

Compiler output

Implementation: crypto_kem/titaniumccastd/avx2
Compiler: armclang -march=armv8a+crypto -mcpu=thunderx2t99 -mtune=thunderx2t99 -O2 -fPIC -fPIE
encrypt.c: In file included from encrypt.c:18:
encrypt.c: In file included from /dibona_home_nfs/rdolbeau/opt/arm/arm-hpc-compiler-19.3_Generic-AArch64_RHEL-7_aarch64-linux/lib/clang/7.1.0/include/x86intrin.h:29:
encrypt.c: In file included from /dibona_home_nfs/rdolbeau/opt/arm/arm-hpc-compiler-19.3_Generic-AArch64_RHEL-7_aarch64-linux/lib/clang/7.1.0/include/immintrin.h:28:
encrypt.c: /dibona_home_nfs/rdolbeau/opt/arm/arm-hpc-compiler-19.3_Generic-AArch64_RHEL-7_aarch64-linux/lib/clang/7.1.0/include/mmintrin.h:64:12: error: invalid conversion between vector type '__m64' (vector of 1 'long long' value) and integer type 'int' of different size
encrypt.c: return (__m64)__builtin_ia32_vec_init_v2si(__i, 0);
encrypt.c: ^~~~~~~~~~~~~~~~~~~~~~~~~~~~~~~~~~~~~~~~~~~
encrypt.c: /dibona_home_nfs/rdolbeau/opt/arm/arm-hpc-compiler-19.3_Generic-AArch64_RHEL-7_aarch64-linux/lib/clang/7.1.0/include/mmintrin.h:143:12: error: invalid conversion between vector type '__m64' (vector of 1 'long long' value) and integer type 'int' of different size
encrypt.c: return (__m64)__builtin_ia32_packsswb((__v4hi)__m1, (__v4hi)__m2);
encrypt.c: ^~~~~~~~~~~~~~~~~~~~~~~~~~~~~~~~~~~~~~~~~~~~~~~~~~~~~~~~~~
encrypt.c: /dibona_home_nfs/rdolbeau/opt/arm/arm-hpc-compiler-19.3_Generic-AArch64_RHEL-7_aarch64-linux/lib/clang/7.1.0/include/mmintrin.h:173:12: error: invalid conversion between vector type '__m64' (vector of 1 'long long' value) and integer type 'int' of different size
encrypt.c: return (__m64)__builtin_ia32_packssdw((__v2si)__m1, (__v2si)__m2);
encrypt.c: ^~~~~~~~~~~~~~~~~~~~~~~~~~~~~~~~~~~~~~~~~~~~~~~~~~~~~~~~~~
encrypt.c: /dibona_home_nfs/rdolbeau/opt/arm/arm-hpc-compiler-19.3_Generic-AArch64_RHEL-7_aarch64-linux/lib/clang/7.1.0/include/mmintrin.h:203:12: error: invalid conversion between vector type '__m64' (vector of 1 'long long' value) and integer type 'int' of different size
encrypt.c: return (__m64)__builtin_ia32_packuswb((__v4hi)__m1, (__v4hi)__m2);
encrypt.c: ^~~~~~~~~~~~~~~~~~~~~~~~~~~~~~~~~~~~~~~~~~~~~~~~~~~~~~~~~~
encrypt.c: /dibona_home_nfs/rdolbeau/opt/arm/arm-hpc-compiler-19.3_Generic-AArch64_RHEL-7_aarch64-linux/lib/clang/7.1.0/include/mmintrin.h:230:12: error: invalid conversion between vector type '__m64' (vector of 1 'long long' value) and integer type 'int' of different size
encrypt.c: return (__m64)__builtin_ia32_punpckhbw((__v8qi)__m1, (__v8qi)__m2);
encrypt.c: ^~~~~~~~~~~~~~~~~~~~~~~~~~~~~~~~~~~~~~~~~~~~~~~~~~~~~~~~~~~
encrypt.c: /dibona_home_nfs/rdolbeau/opt/arm/arm-hpc-compiler-19.3_Generic-AArch64_RHEL-7_aarch64-linux/lib/clang/7.1.0/include/mmintrin.h:253:12: error: invalid conversion between vector type '__m64' (vector of 1 'long long' value) and integer type 'int' of different size
encrypt.c: return (__m64)__builtin_ia32_punpckhwd((__v4hi)__m1, (__v4hi)__m2);
encrypt.c: ^~~~~~~~~~~~~~~~~~~~~~~~~~~~~~~~~~~~~~~~~~~~~~~~~~~~~~~~~~~
encrypt.c: /dibona_home_nfs/rdolbeau/opt/arm/arm-hpc-compiler-19.3_Generic-AArch64_RHEL-7_aarch64-linux/lib/clang/7.1.0/include/mmintrin.h:274:12: error: invalid conversion between vector type '__m64' (vector of 1 'long long' value) and integer type 'int' of different size
encrypt.c: return (__m64)__builtin_ia32_punpckhdq((__v2si)__m1, (__v2si)__m2);
encrypt.c: ^~~~~~~~~~~~~~~~~~~~~~~~~~~~~~~~~~~~~~~~~~~~~~~~~~~~~~~~~~~
encrypt.c: /dibona_home_nfs/rdolbeau/opt/arm/arm-hpc-compiler-19.3_Generic-AArch64_RHEL-7_aarch64-linux/lib/clang/7.1.0/include/mmintrin.h:301:12: error: invalid conversion between vector type '__m64' (vector of 1 'long long' value) and integer type 'int' of different size
encrypt.c: ...

Number of similar (compiler,implementation) pairs: 2, namely:
CompilerImplementations
armclang -march=armv8a+crypto -mcpu=thunderx2t99 -mtune=thunderx2t99 -O2 -fPIC -fPIE avx2
armclang -march=armv8a+crypto -mcpu=thunderx2t99 -mtune=thunderx2t99 -O3 -fPIC -fPIE avx2

Compiler output

Implementation: crypto_kem/titaniumccastd/opt
Compiler: armclang -march=armv8a+crypto -mcpu=thunderx2t99 -mtune=thunderx2t99 -O2 -fPIC -fPIE
pack.c: pack.c:63:6: warning: assigning to 'unsigned char *' from 'const unsigned char *' discards qualifiers [-Wincompatible-pointer-types-discards-qualifiers]
pack.c: bb = b + (i / 8) * Q_BITS;
pack.c: ^ ~~~~~~~~~~~~~~~~~~~~
pack.c: 1 warning generated.

Number of similar (compiler,implementation) pairs: 4, namely:
CompilerImplementations
armclang -march=armv8a+crypto -mcpu=thunderx2t99 -mtune=thunderx2t99 -O2 -fPIC -fPIE opt ref
armclang -march=armv8a+crypto -mcpu=thunderx2t99 -mtune=thunderx2t99 -O3 -fPIC -fPIE opt ref

Compiler output

Implementation: crypto_kem/titaniumccastd/avx2
Compiler: gcc -march=native -mtune=native -O2 -fomit-frame-pointer -fwrapv -fPIC -fPIE
encrypt.c: encrypt.c:18:10: fatal error: x86intrin.h: No such file or directory
encrypt.c: 18 | #include <x86intrin.h>
encrypt.c: | ^~~~~~~~~~~~~
encrypt.c: compilation terminated.

Number of similar (compiler,implementation) pairs: 4, namely:
CompilerImplementations
gcc -march=native -mtune=native -O2 -fomit-frame-pointer -fwrapv -fPIC -fPIE avx2
gcc -march=native -mtune=native -O3 -fomit-frame-pointer -fwrapv -fPIC -fPIE avx2
gcc -march=native -mtune=native -O -fomit-frame-pointer -fwrapv -fPIC -fPIE avx2
gcc -march=native -mtune=native -Os -fomit-frame-pointer -fwrapv -fPIC -fPIE avx2

Compiler output

Implementation: crypto_kem/titaniumccastd/opt
Compiler: gcc -march=native -mtune=native -O2 -fomit-frame-pointer -fwrapv -fPIC -fPIE
pack.c: pack.c: In function 'poly_decode':
pack.c: pack.c:63:6: warning: assignment discards 'const' qualifier from pointer target type [-Wdiscarded-qualifiers]
pack.c: 63 | bb = b + (i / 8) * Q_BITS;
pack.c: | ^

Number of similar (compiler,implementation) pairs: 6, namely:
CompilerImplementations
gcc -march=native -mtune=native -O2 -fomit-frame-pointer -fwrapv -fPIC -fPIE opt ref
gcc -march=native -mtune=native -O3 -fomit-frame-pointer -fwrapv -fPIC -fPIE opt ref
gcc -march=native -mtune=native -O -fomit-frame-pointer -fwrapv -fPIC -fPIE opt ref

Compiler output

Implementation: crypto_kem/titaniumccastd/opt
Compiler: gcc -march=native -mtune=native -Os -fomit-frame-pointer -fwrapv -fPIC -fPIE
pack.c: pack.c: In function 'poly_decode':
pack.c: pack.c:63:6: warning: assignment discards 'const' qualifier from pointer target type [-Wdiscarded-qualifiers]
pack.c: 63 | bb = b + (i / 8) * Q_BITS;
pack.c: | ^
try.c: /dibona_home_nfs/rdolbeau/gcc-9.2.0-full+isl/lib/gcc/aarch64-unknown-linux-gnu/9.2.0/../../../../aarch64-unknown-linux-gnu/bin/ld: crypto_kem_titaniumccastd.a(encrypt.o): in function `crypto_encrypt_keypair':
try.c: encrypt.c:(.text+0x...): undefined reference to `barrett_4q2'
try.c: /dibona_home_nfs/rdolbeau/gcc-9.2.0-full+isl/lib/gcc/aarch64-unknown-linux-gnu/9.2.0/../../../../aarch64-unknown-linux-gnu/bin/ld: encrypt.c:(.text+0x...): undefined reference to `barrett_4q'
try.c: /dibona_home_nfs/rdolbeau/gcc-9.2.0-full+isl/lib/gcc/aarch64-unknown-linux-gnu/9.2.0/../../../../aarch64-unknown-linux-gnu/bin/ld: crypto_kem_titaniumccastd.a(encrypt.o): in function `crypto_encrypt':
try.c: encrypt.c:(.text+0x...): undefined reference to `barrett_4q2'
try.c: /dibona_home_nfs/rdolbeau/gcc-9.2.0-full+isl/lib/gcc/aarch64-unknown-linux-gnu/9.2.0/../../../../aarch64-unknown-linux-gnu/bin/ld: encrypt.c:(.text+0x...): undefined reference to `barrett_4q2'
try.c: /dibona_home_nfs/rdolbeau/gcc-9.2.0-full+isl/lib/gcc/aarch64-unknown-linux-gnu/9.2.0/../../../../aarch64-unknown-linux-gnu/bin/ld: crypto_kem_titaniumccastd.a(encrypt.o): in function `crypto_encrypt_open':
try.c: encrypt.c:(.text+0x...): undefined reference to `barrett_4q2'
try.c: /dibona_home_nfs/rdolbeau/gcc-9.2.0-full+isl/lib/gcc/aarch64-unknown-linux-gnu/9.2.0/../../../../aarch64-unknown-linux-gnu/bin/ld: crypto_kem_titaniumccastd.a(fastrandombytes.o): in function `fastrandombytes':
try.c: fastrandombytes.c:(.text+0x...): undefined reference to `load_32'
try.c: /dibona_home_nfs/rdolbeau/gcc-9.2.0-full+isl/lib/gcc/aarch64-unknown-linux-gnu/9.2.0/../../../../aarch64-unknown-linux-gnu/bin/ld: fastrandombytes.c:(.text+0x...): undefined reference to `store_32'
try.c: /dibona_home_nfs/rdolbeau/gcc-9.2.0-full+isl/lib/gcc/aarch64-unknown-linux-gnu/9.2.0/../../../../aarch64-unknown-linux-gnu/bin/ld: crypto_kem_titaniumccastd.a(ntt.o): in function `ntt_2':
try.c: ntt.c:(.text+0x...): undefined reference to `barrett_4q'
try.c: /dibona_home_nfs/rdolbeau/gcc-9.2.0-full+isl/lib/gcc/aarch64-unknown-linux-gnu/9.2.0/../../../../aarch64-unknown-linux-gnu/bin/ld: ntt.c:(.text+0x...): undefined reference to `barrett_4q'
try.c: /dibona_home_nfs/rdolbeau/gcc-9.2.0-full+isl/lib/gcc/aarch64-unknown-linux-gnu/9.2.0/../../../../aarch64-unknown-linux-gnu/bin/ld: ntt.c:(.text+0x...): undefined reference to `barrett_4q'
try.c: /dibona_home_nfs/rdolbeau/gcc-9.2.0-full+isl/lib/gcc/aarch64-unknown-linux-gnu/9.2.0/../../../../aarch64-unknown-linux-gnu/bin/ld: ntt.c:(.text+0x...): undefined reference to `barrett_4q'
try.c: /dibona_home_nfs/rdolbeau/gcc-9.2.0-full+isl/lib/gcc/aarch64-unknown-linux-gnu/9.2.0/../../../../aarch64-unknown-linux-gnu/bin/ld: ntt.c:(.text+0x...): undefined reference to `barrett_4q'
try.c: /dibona_home_nfs/rdolbeau/gcc-9.2.0-full+isl/lib/gcc/aarch64-unknown-linux-gnu/9.2.0/../../../../aarch64-unknown-linux-gnu/bin/ld: ntt.c:(.text+0x...): undefined reference to `barrett_4q2'
try.c: /dibona_home_nfs/rdolbeau/gcc-9.2.0-full+isl/lib/gcc/aarch64-unknown-linux-gnu/9.2.0/../../../../aarch64-unknown-linux-gnu/bin/ld: ntt.c:(.text+0x...): undefined reference to `barrett_4q'
try.c: /dibona_home_nfs/rdolbeau/gcc-9.2.0-full+isl/lib/gcc/aarch64-unknown-linux-gnu/9.2.0/../../../../aarch64-unknown-linux-gnu/bin/ld: ntt.c:(.text+0x...): undefined reference to `barrett_4q'
try.c: /dibona_home_nfs/rdolbeau/gcc-9.2.0-full+isl/lib/gcc/aarch64-unknown-linux-gnu/9.2.0/../../../../aarch64-unknown-linux-gnu/bin/ld: ntt.c:(.text+0x...): undefined reference to `barrett_4q'
try.c: /dibona_home_nfs/rdolbeau/gcc-9.2.0-full+isl/lib/gcc/aarch64-unknown-linux-gnu/9.2.0/../../../../aarch64-unknown-linux-gnu/bin/ld: ntt.c:(.text+0x...): undefined reference to `barrett_4q2'
try.c: /dibona_home_nfs/rdolbeau/gcc-9.2.0-full+isl/lib/gcc/aarch64-unknown-linux-gnu/9.2.0/../../../../aarch64-unknown-linux-gnu/bin/ld: crypto_kem_titaniumccastd.a(ntt.o): in function `ntt_core':
try.c: ntt.c:(.text+0x...): undefined reference to `barrett_2q2'
try.c: /dibona_home_nfs/rdolbeau/gcc-9.2.0-full+isl/lib/gcc/aarch64-unknown-linux-gnu/9.2.0/../../../../aarch64-unknown-linux-gnu/bin/ld: crypto_kem_titaniumccastd.a(ntt.o): in function `intt_core':
try.c: ...

Number of similar (compiler,implementation) pairs: 1, namely:
CompilerImplementations
gcc -march=native -mtune=native -Os -fomit-frame-pointer -fwrapv -fPIC -fPIE opt

Compiler output

Implementation: crypto_kem/titaniumccastd/ref
Compiler: gcc -march=native -mtune=native -Os -fomit-frame-pointer -fwrapv -fPIC -fPIE
pack.c: pack.c: In function 'poly_decode':
pack.c: pack.c:63:6: warning: assignment discards 'const' qualifier from pointer target type [-Wdiscarded-qualifiers]
pack.c: 63 | bb = b + (i / 8) * Q_BITS;
pack.c: | ^
try.c: /dibona_home_nfs/rdolbeau/gcc-9.2.0-full+isl/lib/gcc/aarch64-unknown-linux-gnu/9.2.0/../../../../aarch64-unknown-linux-gnu/bin/ld: crypto_kem_titaniumccastd.a(fastrandombytes.o): in function `fastrandombytes':
try.c: fastrandombytes.c:(.text+0x...): undefined reference to `load_32'
try.c: /dibona_home_nfs/rdolbeau/gcc-9.2.0-full+isl/lib/gcc/aarch64-unknown-linux-gnu/9.2.0/../../../../aarch64-unknown-linux-gnu/bin/ld: fastrandombytes.c:(.text+0x...): undefined reference to `store_32'
try.c: /dibona_home_nfs/rdolbeau/gcc-9.2.0-full+isl/lib/gcc/aarch64-unknown-linux-gnu/9.2.0/../../../../aarch64-unknown-linux-gnu/bin/ld: crypto_kem_titaniumccastd.a(sampler.o): in function `sampler_zq':
try.c: sampler.c:(.text+0x...): undefined reference to `load_24'
try.c: collect2: error: ld returned 1 exit status

Number of similar (compiler,implementation) pairs: 1, namely:
CompilerImplementations
gcc -march=native -mtune=native -Os -fomit-frame-pointer -fwrapv -fPIC -fPIE ref