Implementation notes: aarch64, pmnod145, crypto_kem/lotus128

Computer: pmnod145
Architecture: aarch64
CPU ID: 431f0af1
SUPERCOP version: 20191017
Operation: crypto_kem
Primitive: lotus128
TimeObject sizeTest sizeImplementationCompilerBenchmark dateSUPERCOP version
116667531989 0 861168 904 1584optgcc_-march=native_-mtune=native_-O3_-fomit-frame-pointer_-fwrapv_-fPIC_-fPIE2019101820191017
124197525853 0 854904 904 1584refgcc_-march=native_-mtune=native_-O3_-fomit-frame-pointer_-fwrapv_-fPIC_-fPIE2019101820191017
301450063280 0 895281 928 1568optarmclang_-march=armv8a+crypto_-mcpu=thunderx2t99_-mtune=thunderx2t99_-O2_-fPIC_-fPIE2019101820191017
310797558536 0 891257 928 1584optarmclang_-march=armv8a+crypto_-mcpu=thunderx2t99_-mtune=thunderx2t99_-O3_-fPIC_-fPIE2019101820191017
328515030232 0 862185 928 1568refarmclang_-march=armv8a+crypto_-mcpu=thunderx2t99_-mtune=thunderx2t99_-O2_-fPIC_-fPIE2019101820191017
346182529916 0 862585 928 1584refarmclang_-march=armv8a+crypto_-mcpu=thunderx2t99_-mtune=thunderx2t99_-O3_-fPIC_-fPIE2019101820191017
673102511957 0 840000 904 1568optgcc_-march=native_-mtune=native_-O2_-fomit-frame-pointer_-fwrapv_-fPIC_-fPIE2019101820191017
69723759877 0 836948 888 1568optgcc_-march=native_-mtune=native_-Os_-fomit-frame-pointer_-fwrapv_-fPIC_-fPIE2019101820191017
70154509109 0 837032 904 1568refgcc_-march=native_-mtune=native_-O2_-fomit-frame-pointer_-fwrapv_-fPIC_-fPIE2019101820191017
701912510493 0 838440 904 1568optgcc_-march=native_-mtune=native_-O_-fomit-frame-pointer_-fwrapv_-fPIC_-fPIE2019101820191017
79469757841 0 834828 888 1568refgcc_-march=native_-mtune=native_-Os_-fomit-frame-pointer_-fwrapv_-fPIC_-fPIE2019101820191017
83920508377 0 836240 904 1568refgcc_-march=native_-mtune=native_-O_-fomit-frame-pointer_-fwrapv_-fPIC_-fPIE2019101820191017

Compiler output

Implementation: crypto_kem/lotus128/avx2
Compiler: armclang -march=armv8a+crypto -mcpu=thunderx2t99 -mtune=thunderx2t99 -O2 -fPIC -fPIE
lwe-arithmetics_avx2.c: In file included from lwe-arithmetics_avx2.c:10:
lwe-arithmetics_avx2.c: In file included from /dibona_home_nfs/rdolbeau/opt/arm/arm-hpc-compiler-19.3_Generic-AArch64_RHEL-7_aarch64-linux/lib/clang/7.1.0/include/immintrin.h:28:
lwe-arithmetics_avx2.c: /dibona_home_nfs/rdolbeau/opt/arm/arm-hpc-compiler-19.3_Generic-AArch64_RHEL-7_aarch64-linux/lib/clang/7.1.0/include/mmintrin.h:64:12: error: invalid conversion between vector type '__m64' (vector of 1 'long long' value) and integer type 'int' of different size
lwe-arithmetics_avx2.c: return (__m64)__builtin_ia32_vec_init_v2si(__i, 0);
lwe-arithmetics_avx2.c: ^~~~~~~~~~~~~~~~~~~~~~~~~~~~~~~~~~~~~~~~~~~
lwe-arithmetics_avx2.c: /dibona_home_nfs/rdolbeau/opt/arm/arm-hpc-compiler-19.3_Generic-AArch64_RHEL-7_aarch64-linux/lib/clang/7.1.0/include/mmintrin.h:143:12: error: invalid conversion between vector type '__m64' (vector of 1 'long long' value) and integer type 'int' of different size
lwe-arithmetics_avx2.c: return (__m64)__builtin_ia32_packsswb((__v4hi)__m1, (__v4hi)__m2);
lwe-arithmetics_avx2.c: ^~~~~~~~~~~~~~~~~~~~~~~~~~~~~~~~~~~~~~~~~~~~~~~~~~~~~~~~~~
lwe-arithmetics_avx2.c: /dibona_home_nfs/rdolbeau/opt/arm/arm-hpc-compiler-19.3_Generic-AArch64_RHEL-7_aarch64-linux/lib/clang/7.1.0/include/mmintrin.h:173:12: error: invalid conversion between vector type '__m64' (vector of 1 'long long' value) and integer type 'int' of different size
lwe-arithmetics_avx2.c: return (__m64)__builtin_ia32_packssdw((__v2si)__m1, (__v2si)__m2);
lwe-arithmetics_avx2.c: ^~~~~~~~~~~~~~~~~~~~~~~~~~~~~~~~~~~~~~~~~~~~~~~~~~~~~~~~~~
lwe-arithmetics_avx2.c: /dibona_home_nfs/rdolbeau/opt/arm/arm-hpc-compiler-19.3_Generic-AArch64_RHEL-7_aarch64-linux/lib/clang/7.1.0/include/mmintrin.h:203:12: error: invalid conversion between vector type '__m64' (vector of 1 'long long' value) and integer type 'int' of different size
lwe-arithmetics_avx2.c: return (__m64)__builtin_ia32_packuswb((__v4hi)__m1, (__v4hi)__m2);
lwe-arithmetics_avx2.c: ^~~~~~~~~~~~~~~~~~~~~~~~~~~~~~~~~~~~~~~~~~~~~~~~~~~~~~~~~~
lwe-arithmetics_avx2.c: /dibona_home_nfs/rdolbeau/opt/arm/arm-hpc-compiler-19.3_Generic-AArch64_RHEL-7_aarch64-linux/lib/clang/7.1.0/include/mmintrin.h:230:12: error: invalid conversion between vector type '__m64' (vector of 1 'long long' value) and integer type 'int' of different size
lwe-arithmetics_avx2.c: return (__m64)__builtin_ia32_punpckhbw((__v8qi)__m1, (__v8qi)__m2);
lwe-arithmetics_avx2.c: ^~~~~~~~~~~~~~~~~~~~~~~~~~~~~~~~~~~~~~~~~~~~~~~~~~~~~~~~~~~
lwe-arithmetics_avx2.c: /dibona_home_nfs/rdolbeau/opt/arm/arm-hpc-compiler-19.3_Generic-AArch64_RHEL-7_aarch64-linux/lib/clang/7.1.0/include/mmintrin.h:253:12: error: invalid conversion between vector type '__m64' (vector of 1 'long long' value) and integer type 'int' of different size
lwe-arithmetics_avx2.c: return (__m64)__builtin_ia32_punpckhwd((__v4hi)__m1, (__v4hi)__m2);
lwe-arithmetics_avx2.c: ^~~~~~~~~~~~~~~~~~~~~~~~~~~~~~~~~~~~~~~~~~~~~~~~~~~~~~~~~~~
lwe-arithmetics_avx2.c: /dibona_home_nfs/rdolbeau/opt/arm/arm-hpc-compiler-19.3_Generic-AArch64_RHEL-7_aarch64-linux/lib/clang/7.1.0/include/mmintrin.h:274:12: error: invalid conversion between vector type '__m64' (vector of 1 'long long' value) and integer type 'int' of different size
lwe-arithmetics_avx2.c: return (__m64)__builtin_ia32_punpckhdq((__v2si)__m1, (__v2si)__m2);
lwe-arithmetics_avx2.c: ^~~~~~~~~~~~~~~~~~~~~~~~~~~~~~~~~~~~~~~~~~~~~~~~~~~~~~~~~~~
lwe-arithmetics_avx2.c: /dibona_home_nfs/rdolbeau/opt/arm/arm-hpc-compiler-19.3_Generic-AArch64_RHEL-7_aarch64-linux/lib/clang/7.1.0/include/mmintrin.h:301:12: error: invalid conversion between vector type '__m64' (vector of 1 'long long' value) and integer type 'int' of different size
lwe-arithmetics_avx2.c: return (__m64)__builtin_ia32_punpcklbw((__v8qi)__m1, (__v8qi)__m2);
lwe-arithmetics_avx2.c: ...

Number of similar (compiler,implementation) pairs: 2, namely:
CompilerImplementations
armclang -march=armv8a+crypto -mcpu=thunderx2t99 -mtune=thunderx2t99 -O2 -fPIC -fPIE avx2
armclang -march=armv8a+crypto -mcpu=thunderx2t99 -mtune=thunderx2t99 -O3 -fPIC -fPIE avx2

Compiler output

Implementation: crypto_kem/lotus128/avx2
Compiler: gcc -march=native -mtune=native -O2 -fomit-frame-pointer -fwrapv -fPIC -fPIE
lwe-arithmetics_avx2.c: lwe-arithmetics_avx2.c:10:10: fatal error: immintrin.h: No such file or directory
lwe-arithmetics_avx2.c: 10 | #include <immintrin.h>
lwe-arithmetics_avx2.c: | ^~~~~~~~~~~~~
lwe-arithmetics_avx2.c: compilation terminated.

Number of similar (compiler,implementation) pairs: 4, namely:
CompilerImplementations
gcc -march=native -mtune=native -O2 -fomit-frame-pointer -fwrapv -fPIC -fPIE avx2
gcc -march=native -mtune=native -O3 -fomit-frame-pointer -fwrapv -fPIC -fPIE avx2
gcc -march=native -mtune=native -O -fomit-frame-pointer -fwrapv -fPIC -fPIE avx2
gcc -march=native -mtune=native -Os -fomit-frame-pointer -fwrapv -fPIC -fPIE avx2