Implementation notes: aarch64, pi4b, crypto_sign/mqqsig256

Computer: pi4b
Architecture: aarch64
CPU ID: 410fd083
SUPERCOP version: 20221019
Operation: crypto_sign
Primitive: mqqsig256

Compiler output

Implementation: T:ref
Security model: timingleaks
Compiler: clang -mcpu=native -O3 -fomit-frame-pointer -fwrapv -Qunused-arguments -fPIC -fPIE
try.c: /usr/bin/ld: libcrypto_sign_mqqsig256.a(keygen.o):(.bss+0x280): multiple definition of `lookup_table_private_key'; /tmp/try-small-553d36.o:(.bss+0x2a0): first defined here
try.c: /usr/bin/ld: libcrypto_sign_mqqsig256.a(keygen.o):(.bss+0x0): multiple definition of `mqq_a'; /tmp/try-small-553d36.o:(.bss+0x20): first defined here
try.c: /usr/bin/ld: libcrypto_sign_mqqsig256.a(keygen.o):(.bss+0x60): multiple definition of `cc1'; /tmp/try-small-553d36.o:(.bss+0x80): first defined here
try.c: /usr/bin/ld: libcrypto_sign_mqqsig256.a(keygen.o):(.bss+0x70): multiple definition of `cc2'; /tmp/try-small-553d36.o:(.bss+0x90): first defined here
try.c: /usr/bin/ld: libcrypto_sign_mqqsig256.a(keygen.o):(.bss+0x80): multiple definition of `mqq_sigma1'; /tmp/try-small-553d36.o:(.bss+0xa0): first defined here
try.c: /usr/bin/ld: libcrypto_sign_mqqsig256.a(keygen.o):(.bss+0x180): multiple definition of `mqq_sigmaK'; /tmp/try-small-553d36.o:(.bss+0x1a0): first defined here
try.c: /usr/bin/ld: libcrypto_sign_mqqsig256.a(mqq-sign.o):(.bss+0x0): multiple definition of `cc1'; /tmp/try-small-553d36.o:(.bss+0x80): first defined here
try.c: /usr/bin/ld: libcrypto_sign_mqqsig256.a(mqq-sign.o):(.bss+0x10): multiple definition of `cc2'; /tmp/try-small-553d36.o:(.bss+0x90): first defined here
try.c: /usr/bin/ld: libcrypto_sign_mqqsig256.a(mqq-sign.o):(.bss+0x20): multiple definition of `mqq_a'; /tmp/try-small-553d36.o:(.bss+0x20): first defined here
try.c: /usr/bin/ld: libcrypto_sign_mqqsig256.a(mqq-sign.o):(.bss+0x80): multiple definition of `mqq_sigma1'; /tmp/try-small-553d36.o:(.bss+0xa0): first defined here
try.c: /usr/bin/ld: libcrypto_sign_mqqsig256.a(mqq-sign.o):(.bss+0x180): multiple definition of `mqq_sigmaK'; /tmp/try-small-553d36.o:(.bss+0x1a0): first defined here
try.c: /usr/bin/ld: libcrypto_sign_mqqsig256.a(mqq-sign.o):(.bss+0x280): multiple definition of `lookup_table_private_key'; /tmp/try-small-553d36.o:(.bss+0x2a0): first defined here
try.c: /usr/bin/ld: libcrypto_sign_mqqsig256.a(mqq-verify.o):(.bss+0x0): multiple definition of `mqq_a'; /tmp/try-small-553d36.o:(.bss+0x20): first defined here
try.c: /usr/bin/ld: libcrypto_sign_mqqsig256.a(mqq-verify.o):(.bss+0x60): multiple definition of `cc1'; /tmp/try-small-553d36.o:(.bss+0x80): first defined here
try.c: /usr/bin/ld: libcrypto_sign_mqqsig256.a(mqq-verify.o):(.bss+0x70): multiple definition of `cc2'; /tmp/try-small-553d36.o:(.bss+0x90): first defined here
try.c: /usr/bin/ld: libcrypto_sign_mqqsig256.a(mqq-verify.o):(.bss+0x80): multiple definition of `mqq_sigma1'; /tmp/try-small-553d36.o:(.bss+0xa0): first defined here
try.c: /usr/bin/ld: libcrypto_sign_mqqsig256.a(mqq-verify.o):(.bss+0x180): multiple definition of `mqq_sigmaK'; /tmp/try-small-553d36.o:(.bss+0x1a0): first defined here
try.c: /usr/bin/ld: libcrypto_sign_mqqsig256.a(mqq-verify.o):(.bss+0x280): multiple definition of `lookup_table_private_key'; /tmp/try-small-553d36.o:(.bss+0x2a0): first defined here
try.c: clang: error: linker command failed with exit code 1 (use -v to see invocation)

Number of similar (compiler,implementation) pairs: 1, namely:
CompilerImplementations
clang -mcpu=native -O3 -fomit-frame-pointer -fwrapv -Qunused-arguments -fPIC -fPIE T:ref

Compiler output

Implementation: T:ref
Security model: timingleaks
Compiler: gcc -march=native -mtune=native -O2 -fomit-frame-pointer -fwrapv -fPIC -fPIE
try.c: /usr/bin/ld: libcrypto_sign_mqqsig256.a(keygen.o):(.bss+0x0): multiple definition of `lookup_table_private_key'; /tmp/cc6Gq9Nh.o:(.bss+0x70): first defined here
try.c: /usr/bin/ld: libcrypto_sign_mqqsig256.a(keygen.o):(.bss+0x20000): multiple definition of `mqq_sigmaK'; /tmp/cc6Gq9Nh.o:(.bss+0x20070): first defined here
try.c: /usr/bin/ld: libcrypto_sign_mqqsig256.a(keygen.o):(.bss+0x20100): multiple definition of `mqq_sigma1'; /tmp/cc6Gq9Nh.o:(.bss+0x20170): first defined here
try.c: /usr/bin/ld: libcrypto_sign_mqqsig256.a(keygen.o):(.bss+0x20200): multiple definition of `cc2'; /tmp/cc6Gq9Nh.o:(.bss+0x20270): first defined here
try.c: /usr/bin/ld: libcrypto_sign_mqqsig256.a(keygen.o):(.bss+0x20210): multiple definition of `cc1'; /tmp/cc6Gq9Nh.o:(.bss+0x20280): first defined here
try.c: /usr/bin/ld: libcrypto_sign_mqqsig256.a(keygen.o):(.bss+0x20220): multiple definition of `mqq_a'; /tmp/cc6Gq9Nh.o:(.bss+0x20290): first defined here
try.c: /usr/bin/ld: libcrypto_sign_mqqsig256.a(mqq-sign.o):(.bss+0x280): multiple definition of `lookup_table_private_key'; /tmp/cc6Gq9Nh.o:(.bss+0x70): first defined here
try.c: /usr/bin/ld: libcrypto_sign_mqqsig256.a(mqq-sign.o):(.bss+0x0): multiple definition of `mqq_sigmaK'; /tmp/cc6Gq9Nh.o:(.bss+0x20070): first defined here
try.c: /usr/bin/ld: libcrypto_sign_mqqsig256.a(mqq-sign.o):(.bss+0x100): multiple definition of `mqq_sigma1'; /tmp/cc6Gq9Nh.o:(.bss+0x20170): first defined here
try.c: /usr/bin/ld: libcrypto_sign_mqqsig256.a(mqq-sign.o):(.bss+0x270): multiple definition of `cc2'; /tmp/cc6Gq9Nh.o:(.bss+0x20270): first defined here
try.c: /usr/bin/ld: libcrypto_sign_mqqsig256.a(mqq-sign.o):(.bss+0x260): multiple definition of `cc1'; /tmp/cc6Gq9Nh.o:(.bss+0x20280): first defined here
try.c: /usr/bin/ld: libcrypto_sign_mqqsig256.a(mqq-sign.o):(.bss+0x200): multiple definition of `mqq_a'; /tmp/cc6Gq9Nh.o:(.bss+0x20290): first defined here
try.c: /usr/bin/ld: libcrypto_sign_mqqsig256.a(mqq-verify.o):(.bss+0x0): multiple definition of `lookup_table_private_key'; /tmp/cc6Gq9Nh.o:(.bss+0x70): first defined here
try.c: /usr/bin/ld: libcrypto_sign_mqqsig256.a(mqq-verify.o):(.bss+0x20000): multiple definition of `mqq_sigmaK'; /tmp/cc6Gq9Nh.o:(.bss+0x20070): first defined here
try.c: /usr/bin/ld: libcrypto_sign_mqqsig256.a(mqq-verify.o):(.bss+0x20100): multiple definition of `mqq_sigma1'; /tmp/cc6Gq9Nh.o:(.bss+0x20170): first defined here
try.c: /usr/bin/ld: libcrypto_sign_mqqsig256.a(mqq-verify.o):(.bss+0x20200): multiple definition of `cc2'; /tmp/cc6Gq9Nh.o:(.bss+0x20270): first defined here
try.c: /usr/bin/ld: libcrypto_sign_mqqsig256.a(mqq-verify.o):(.bss+0x20210): multiple definition of `cc1'; /tmp/cc6Gq9Nh.o:(.bss+0x20280): first defined here
try.c: /usr/bin/ld: libcrypto_sign_mqqsig256.a(mqq-verify.o):(.bss+0x20220): multiple definition of `mqq_a'; /tmp/cc6Gq9Nh.o:(.bss+0x20290): first defined here
try.c: collect2: error: ld returned 1 exit status

Number of similar (compiler,implementation) pairs: 1, namely:
CompilerImplementations
gcc -march=native -mtune=native -O2 -fomit-frame-pointer -fwrapv -fPIC -fPIE T:ref

Compiler output

Implementation: T:ref
Security model: timingleaks
Compiler: gcc -march=native -mtune=native -O3 -fomit-frame-pointer -fwrapv -fPIC -fPIE
try.c: /usr/bin/ld: libcrypto_sign_mqqsig256.a(keygen.o):(.bss+0x0): multiple definition of `lookup_table_private_key'; /tmp/cc9tcI3Z.o:(.bss+0x70): first defined here
try.c: /usr/bin/ld: libcrypto_sign_mqqsig256.a(keygen.o):(.bss+0x20000): multiple definition of `mqq_sigmaK'; /tmp/cc9tcI3Z.o:(.bss+0x20070): first defined here
try.c: /usr/bin/ld: libcrypto_sign_mqqsig256.a(keygen.o):(.bss+0x20100): multiple definition of `mqq_sigma1'; /tmp/cc9tcI3Z.o:(.bss+0x20170): first defined here
try.c: /usr/bin/ld: libcrypto_sign_mqqsig256.a(keygen.o):(.bss+0x20200): multiple definition of `cc2'; /tmp/cc9tcI3Z.o:(.bss+0x20270): first defined here
try.c: /usr/bin/ld: libcrypto_sign_mqqsig256.a(keygen.o):(.bss+0x20210): multiple definition of `cc1'; /tmp/cc9tcI3Z.o:(.bss+0x20280): first defined here
try.c: /usr/bin/ld: libcrypto_sign_mqqsig256.a(keygen.o):(.bss+0x20220): multiple definition of `mqq_a'; /tmp/cc9tcI3Z.o:(.bss+0x20290): first defined here
try.c: /usr/bin/ld: libcrypto_sign_mqqsig256.a(mqq-sign.o):(.bss+0x280): multiple definition of `lookup_table_private_key'; /tmp/cc9tcI3Z.o:(.bss+0x70): first defined here
try.c: /usr/bin/ld: libcrypto_sign_mqqsig256.a(mqq-sign.o):(.bss+0x0): multiple definition of `mqq_sigmaK'; /tmp/cc9tcI3Z.o:(.bss+0x20070): first defined here
try.c: /usr/bin/ld: libcrypto_sign_mqqsig256.a(mqq-sign.o):(.bss+0x100): multiple definition of `mqq_sigma1'; /tmp/cc9tcI3Z.o:(.bss+0x20170): first defined here
try.c: /usr/bin/ld: libcrypto_sign_mqqsig256.a(mqq-sign.o):(.bss+0x270): multiple definition of `cc2'; /tmp/cc9tcI3Z.o:(.bss+0x20270): first defined here
try.c: /usr/bin/ld: libcrypto_sign_mqqsig256.a(mqq-sign.o):(.bss+0x260): multiple definition of `cc1'; /tmp/cc9tcI3Z.o:(.bss+0x20280): first defined here
try.c: /usr/bin/ld: libcrypto_sign_mqqsig256.a(mqq-sign.o):(.bss+0x200): multiple definition of `mqq_a'; /tmp/cc9tcI3Z.o:(.bss+0x20290): first defined here
try.c: /usr/bin/ld: libcrypto_sign_mqqsig256.a(mqq-verify.o):(.bss+0x0): multiple definition of `lookup_table_private_key'; /tmp/cc9tcI3Z.o:(.bss+0x70): first defined here
try.c: /usr/bin/ld: libcrypto_sign_mqqsig256.a(mqq-verify.o):(.bss+0x20000): multiple definition of `mqq_sigmaK'; /tmp/cc9tcI3Z.o:(.bss+0x20070): first defined here
try.c: /usr/bin/ld: libcrypto_sign_mqqsig256.a(mqq-verify.o):(.bss+0x20100): multiple definition of `mqq_sigma1'; /tmp/cc9tcI3Z.o:(.bss+0x20170): first defined here
try.c: /usr/bin/ld: libcrypto_sign_mqqsig256.a(mqq-verify.o):(.bss+0x20200): multiple definition of `cc2'; /tmp/cc9tcI3Z.o:(.bss+0x20270): first defined here
try.c: /usr/bin/ld: libcrypto_sign_mqqsig256.a(mqq-verify.o):(.bss+0x20210): multiple definition of `cc1'; /tmp/cc9tcI3Z.o:(.bss+0x20280): first defined here
try.c: /usr/bin/ld: libcrypto_sign_mqqsig256.a(mqq-verify.o):(.bss+0x20220): multiple definition of `mqq_a'; /tmp/cc9tcI3Z.o:(.bss+0x20290): first defined here
try.c: collect2: error: ld returned 1 exit status

Number of similar (compiler,implementation) pairs: 1, namely:
CompilerImplementations
gcc -march=native -mtune=native -O3 -fomit-frame-pointer -fwrapv -fPIC -fPIE T:ref

Compiler output

Implementation: T:ref
Security model: timingleaks
Compiler: gcc -march=native -mtune=native -O -fomit-frame-pointer -fwrapv -fPIC -fPIE
try.c: /usr/bin/ld: libcrypto_sign_mqqsig256.a(keygen.o):(.bss+0x0): multiple definition of `lookup_table_private_key'; /tmp/cciT7ra1.o:(.bss+0x70): first defined here
try.c: /usr/bin/ld: libcrypto_sign_mqqsig256.a(keygen.o):(.bss+0x20000): multiple definition of `mqq_sigmaK'; /tmp/cciT7ra1.o:(.bss+0x20070): first defined here
try.c: /usr/bin/ld: libcrypto_sign_mqqsig256.a(keygen.o):(.bss+0x20100): multiple definition of `mqq_sigma1'; /tmp/cciT7ra1.o:(.bss+0x20170): first defined here
try.c: /usr/bin/ld: libcrypto_sign_mqqsig256.a(keygen.o):(.bss+0x20200): multiple definition of `cc2'; /tmp/cciT7ra1.o:(.bss+0x20270): first defined here
try.c: /usr/bin/ld: libcrypto_sign_mqqsig256.a(keygen.o):(.bss+0x20210): multiple definition of `cc1'; /tmp/cciT7ra1.o:(.bss+0x20280): first defined here
try.c: /usr/bin/ld: libcrypto_sign_mqqsig256.a(keygen.o):(.bss+0x20220): multiple definition of `mqq_a'; /tmp/cciT7ra1.o:(.bss+0x20290): first defined here
try.c: /usr/bin/ld: libcrypto_sign_mqqsig256.a(mqq-sign.o):(.bss+0x280): multiple definition of `lookup_table_private_key'; /tmp/cciT7ra1.o:(.bss+0x70): first defined here
try.c: /usr/bin/ld: libcrypto_sign_mqqsig256.a(mqq-sign.o):(.bss+0x0): multiple definition of `mqq_sigmaK'; /tmp/cciT7ra1.o:(.bss+0x20070): first defined here
try.c: /usr/bin/ld: libcrypto_sign_mqqsig256.a(mqq-sign.o):(.bss+0x100): multiple definition of `mqq_sigma1'; /tmp/cciT7ra1.o:(.bss+0x20170): first defined here
try.c: /usr/bin/ld: libcrypto_sign_mqqsig256.a(mqq-sign.o):(.bss+0x270): multiple definition of `cc2'; /tmp/cciT7ra1.o:(.bss+0x20270): first defined here
try.c: /usr/bin/ld: libcrypto_sign_mqqsig256.a(mqq-sign.o):(.bss+0x260): multiple definition of `cc1'; /tmp/cciT7ra1.o:(.bss+0x20280): first defined here
try.c: /usr/bin/ld: libcrypto_sign_mqqsig256.a(mqq-sign.o):(.bss+0x200): multiple definition of `mqq_a'; /tmp/cciT7ra1.o:(.bss+0x20290): first defined here
try.c: /usr/bin/ld: libcrypto_sign_mqqsig256.a(mqq-verify.o):(.bss+0x0): multiple definition of `lookup_table_private_key'; /tmp/cciT7ra1.o:(.bss+0x70): first defined here
try.c: /usr/bin/ld: libcrypto_sign_mqqsig256.a(mqq-verify.o):(.bss+0x20000): multiple definition of `mqq_sigmaK'; /tmp/cciT7ra1.o:(.bss+0x20070): first defined here
try.c: /usr/bin/ld: libcrypto_sign_mqqsig256.a(mqq-verify.o):(.bss+0x20100): multiple definition of `mqq_sigma1'; /tmp/cciT7ra1.o:(.bss+0x20170): first defined here
try.c: /usr/bin/ld: libcrypto_sign_mqqsig256.a(mqq-verify.o):(.bss+0x20200): multiple definition of `cc2'; /tmp/cciT7ra1.o:(.bss+0x20270): first defined here
try.c: /usr/bin/ld: libcrypto_sign_mqqsig256.a(mqq-verify.o):(.bss+0x20210): multiple definition of `cc1'; /tmp/cciT7ra1.o:(.bss+0x20280): first defined here
try.c: /usr/bin/ld: libcrypto_sign_mqqsig256.a(mqq-verify.o):(.bss+0x20220): multiple definition of `mqq_a'; /tmp/cciT7ra1.o:(.bss+0x20290): first defined here
try.c: collect2: error: ld returned 1 exit status

Number of similar (compiler,implementation) pairs: 1, namely:
CompilerImplementations
gcc -march=native -mtune=native -O -fomit-frame-pointer -fwrapv -fPIC -fPIE T:ref

Compiler output

Implementation: T:ref
Security model: timingleaks
Compiler: gcc -march=native -mtune=native -Os -fomit-frame-pointer -fwrapv -fPIC -fPIE
try.c: /usr/bin/ld: libcrypto_sign_mqqsig256.a(keygen.o):(.bss+0x0): multiple definition of `lookup_table_private_key'; /tmp/ccxfl3ac.o:(.bss+0x70): first defined here
try.c: /usr/bin/ld: libcrypto_sign_mqqsig256.a(keygen.o):(.bss+0x20000): multiple definition of `mqq_sigmaK'; /tmp/ccxfl3ac.o:(.bss+0x20070): first defined here
try.c: /usr/bin/ld: libcrypto_sign_mqqsig256.a(keygen.o):(.bss+0x20100): multiple definition of `mqq_sigma1'; /tmp/ccxfl3ac.o:(.bss+0x20170): first defined here
try.c: /usr/bin/ld: libcrypto_sign_mqqsig256.a(keygen.o):(.bss+0x20200): multiple definition of `cc2'; /tmp/ccxfl3ac.o:(.bss+0x20270): first defined here
try.c: /usr/bin/ld: libcrypto_sign_mqqsig256.a(keygen.o):(.bss+0x20210): multiple definition of `cc1'; /tmp/ccxfl3ac.o:(.bss+0x20280): first defined here
try.c: /usr/bin/ld: libcrypto_sign_mqqsig256.a(keygen.o):(.bss+0x20220): multiple definition of `mqq_a'; /tmp/ccxfl3ac.o:(.bss+0x20290): first defined here
try.c: /usr/bin/ld: libcrypto_sign_mqqsig256.a(mqq-sign.o):(.bss+0x280): multiple definition of `lookup_table_private_key'; /tmp/ccxfl3ac.o:(.bss+0x70): first defined here
try.c: /usr/bin/ld: libcrypto_sign_mqqsig256.a(mqq-sign.o):(.bss+0x0): multiple definition of `mqq_sigmaK'; /tmp/ccxfl3ac.o:(.bss+0x20070): first defined here
try.c: /usr/bin/ld: libcrypto_sign_mqqsig256.a(mqq-sign.o):(.bss+0x100): multiple definition of `mqq_sigma1'; /tmp/ccxfl3ac.o:(.bss+0x20170): first defined here
try.c: /usr/bin/ld: libcrypto_sign_mqqsig256.a(mqq-sign.o):(.bss+0x270): multiple definition of `cc2'; /tmp/ccxfl3ac.o:(.bss+0x20270): first defined here
try.c: /usr/bin/ld: libcrypto_sign_mqqsig256.a(mqq-sign.o):(.bss+0x260): multiple definition of `cc1'; /tmp/ccxfl3ac.o:(.bss+0x20280): first defined here
try.c: /usr/bin/ld: libcrypto_sign_mqqsig256.a(mqq-sign.o):(.bss+0x200): multiple definition of `mqq_a'; /tmp/ccxfl3ac.o:(.bss+0x20290): first defined here
try.c: /usr/bin/ld: libcrypto_sign_mqqsig256.a(mqq-verify.o):(.bss+0x0): multiple definition of `lookup_table_private_key'; /tmp/ccxfl3ac.o:(.bss+0x70): first defined here
try.c: /usr/bin/ld: libcrypto_sign_mqqsig256.a(mqq-verify.o):(.bss+0x20000): multiple definition of `mqq_sigmaK'; /tmp/ccxfl3ac.o:(.bss+0x20070): first defined here
try.c: /usr/bin/ld: libcrypto_sign_mqqsig256.a(mqq-verify.o):(.bss+0x20100): multiple definition of `mqq_sigma1'; /tmp/ccxfl3ac.o:(.bss+0x20170): first defined here
try.c: /usr/bin/ld: libcrypto_sign_mqqsig256.a(mqq-verify.o):(.bss+0x20200): multiple definition of `cc2'; /tmp/ccxfl3ac.o:(.bss+0x20270): first defined here
try.c: /usr/bin/ld: libcrypto_sign_mqqsig256.a(mqq-verify.o):(.bss+0x20210): multiple definition of `cc1'; /tmp/ccxfl3ac.o:(.bss+0x20280): first defined here
try.c: /usr/bin/ld: libcrypto_sign_mqqsig256.a(mqq-verify.o):(.bss+0x20220): multiple definition of `mqq_a'; /tmp/ccxfl3ac.o:(.bss+0x20290): first defined here
try.c: collect2: error: ld returned 1 exit status

Number of similar (compiler,implementation) pairs: 1, namely:
CompilerImplementations
gcc -march=native -mtune=native -Os -fomit-frame-pointer -fwrapv -fPIC -fPIE T:ref