Implementation notes: aarch64, pi4b, crypto_sign/mqqsig192

Computer: pi4b
Architecture: aarch64
CPU ID: 410fd083
SUPERCOP version: 20221019
Operation: crypto_sign
Primitive: mqqsig192

Compiler output

Implementation: T:ref
Security model: timingleaks
Compiler: clang -mcpu=native -O3 -fomit-frame-pointer -fwrapv -Qunused-arguments -fPIC -fPIE
try.c: /usr/bin/ld: libcrypto_sign_mqqsig192.a(keygen.o):(.bss+0x200): multiple definition of `lookup_table_private_key'; /tmp/try-small-5383a5.o:(.bss+0x220): first defined here
try.c: /usr/bin/ld: libcrypto_sign_mqqsig192.a(keygen.o):(.bss+0x0): multiple definition of `mqq_a'; /tmp/try-small-5383a5.o:(.bss+0x20): first defined here
try.c: /usr/bin/ld: libcrypto_sign_mqqsig192.a(keygen.o):(.bss+0x60): multiple definition of `cc1'; /tmp/try-small-5383a5.o:(.bss+0x80): first defined here
try.c: /usr/bin/ld: libcrypto_sign_mqqsig192.a(keygen.o):(.bss+0x70): multiple definition of `cc2'; /tmp/try-small-5383a5.o:(.bss+0x90): first defined here
try.c: /usr/bin/ld: libcrypto_sign_mqqsig192.a(keygen.o):(.bss+0x80): multiple definition of `mqq_sigma1'; /tmp/try-small-5383a5.o:(.bss+0xa0): first defined here
try.c: /usr/bin/ld: libcrypto_sign_mqqsig192.a(keygen.o):(.bss+0x140): multiple definition of `mqq_sigmaK'; /tmp/try-small-5383a5.o:(.bss+0x160): first defined here
try.c: /usr/bin/ld: libcrypto_sign_mqqsig192.a(mqq-sign.o):(.bss+0x0): multiple definition of `cc1'; /tmp/try-small-5383a5.o:(.bss+0x80): first defined here
try.c: /usr/bin/ld: libcrypto_sign_mqqsig192.a(mqq-sign.o):(.bss+0x10): multiple definition of `cc2'; /tmp/try-small-5383a5.o:(.bss+0x90): first defined here
try.c: /usr/bin/ld: libcrypto_sign_mqqsig192.a(mqq-sign.o):(.bss+0x20): multiple definition of `mqq_a'; /tmp/try-small-5383a5.o:(.bss+0x20): first defined here
try.c: /usr/bin/ld: libcrypto_sign_mqqsig192.a(mqq-sign.o):(.bss+0x80): multiple definition of `mqq_sigma1'; /tmp/try-small-5383a5.o:(.bss+0xa0): first defined here
try.c: /usr/bin/ld: libcrypto_sign_mqqsig192.a(mqq-sign.o):(.bss+0x140): multiple definition of `mqq_sigmaK'; /tmp/try-small-5383a5.o:(.bss+0x160): first defined here
try.c: /usr/bin/ld: libcrypto_sign_mqqsig192.a(mqq-sign.o):(.bss+0x200): multiple definition of `lookup_table_private_key'; /tmp/try-small-5383a5.o:(.bss+0x220): first defined here
try.c: /usr/bin/ld: libcrypto_sign_mqqsig192.a(mqq-verify.o):(.bss+0x0): multiple definition of `mqq_a'; /tmp/try-small-5383a5.o:(.bss+0x20): first defined here
try.c: /usr/bin/ld: libcrypto_sign_mqqsig192.a(mqq-verify.o):(.bss+0x60): multiple definition of `cc1'; /tmp/try-small-5383a5.o:(.bss+0x80): first defined here
try.c: /usr/bin/ld: libcrypto_sign_mqqsig192.a(mqq-verify.o):(.bss+0x70): multiple definition of `cc2'; /tmp/try-small-5383a5.o:(.bss+0x90): first defined here
try.c: /usr/bin/ld: libcrypto_sign_mqqsig192.a(mqq-verify.o):(.bss+0x80): multiple definition of `mqq_sigma1'; /tmp/try-small-5383a5.o:(.bss+0xa0): first defined here
try.c: /usr/bin/ld: libcrypto_sign_mqqsig192.a(mqq-verify.o):(.bss+0x140): multiple definition of `mqq_sigmaK'; /tmp/try-small-5383a5.o:(.bss+0x160): first defined here
try.c: /usr/bin/ld: libcrypto_sign_mqqsig192.a(mqq-verify.o):(.bss+0x200): multiple definition of `lookup_table_private_key'; /tmp/try-small-5383a5.o:(.bss+0x220): first defined here
try.c: clang: error: linker command failed with exit code 1 (use -v to see invocation)

Number of similar (compiler,implementation) pairs: 1, namely:
CompilerImplementations
clang -mcpu=native -O3 -fomit-frame-pointer -fwrapv -Qunused-arguments -fPIC -fPIE T:ref

Compiler output

Implementation: T:ref
Security model: timingleaks
Compiler: gcc -march=native -mtune=native -O2 -fomit-frame-pointer -fwrapv -fPIC -fPIE
try.c: /usr/bin/ld: libcrypto_sign_mqqsig192.a(keygen.o):(.bss+0x0): multiple definition of `lookup_table_private_key'; /tmp/cccRQSiw.o:(.bss+0x70): first defined here
try.c: /usr/bin/ld: libcrypto_sign_mqqsig192.a(keygen.o):(.bss+0x20000): multiple definition of `mqq_sigmaK'; /tmp/cccRQSiw.o:(.bss+0x20070): first defined here
try.c: /usr/bin/ld: libcrypto_sign_mqqsig192.a(keygen.o):(.bss+0x200c0): multiple definition of `mqq_sigma1'; /tmp/cccRQSiw.o:(.bss+0x20130): first defined here
try.c: /usr/bin/ld: libcrypto_sign_mqqsig192.a(keygen.o):(.bss+0x20180): multiple definition of `cc2'; /tmp/cccRQSiw.o:(.bss+0x201f0): first defined here
try.c: /usr/bin/ld: libcrypto_sign_mqqsig192.a(keygen.o):(.bss+0x20190): multiple definition of `cc1'; /tmp/cccRQSiw.o:(.bss+0x20200): first defined here
try.c: /usr/bin/ld: libcrypto_sign_mqqsig192.a(keygen.o):(.bss+0x201a0): multiple definition of `mqq_a'; /tmp/cccRQSiw.o:(.bss+0x20210): first defined here
try.c: /usr/bin/ld: libcrypto_sign_mqqsig192.a(mqq-sign.o):(.bss+0x200): multiple definition of `lookup_table_private_key'; /tmp/cccRQSiw.o:(.bss+0x70): first defined here
try.c: /usr/bin/ld: libcrypto_sign_mqqsig192.a(mqq-sign.o):(.bss+0x0): multiple definition of `mqq_sigmaK'; /tmp/cccRQSiw.o:(.bss+0x20070): first defined here
try.c: /usr/bin/ld: libcrypto_sign_mqqsig192.a(mqq-sign.o):(.bss+0xc0): multiple definition of `mqq_sigma1'; /tmp/cccRQSiw.o:(.bss+0x20130): first defined here
try.c: /usr/bin/ld: libcrypto_sign_mqqsig192.a(mqq-sign.o):(.bss+0x1f0): multiple definition of `cc2'; /tmp/cccRQSiw.o:(.bss+0x201f0): first defined here
try.c: /usr/bin/ld: libcrypto_sign_mqqsig192.a(mqq-sign.o):(.bss+0x1e0): multiple definition of `cc1'; /tmp/cccRQSiw.o:(.bss+0x20200): first defined here
try.c: /usr/bin/ld: libcrypto_sign_mqqsig192.a(mqq-sign.o):(.bss+0x180): multiple definition of `mqq_a'; /tmp/cccRQSiw.o:(.bss+0x20210): first defined here
try.c: /usr/bin/ld: libcrypto_sign_mqqsig192.a(mqq-verify.o):(.bss+0x0): multiple definition of `lookup_table_private_key'; /tmp/cccRQSiw.o:(.bss+0x70): first defined here
try.c: /usr/bin/ld: libcrypto_sign_mqqsig192.a(mqq-verify.o):(.bss+0x20000): multiple definition of `mqq_sigmaK'; /tmp/cccRQSiw.o:(.bss+0x20070): first defined here
try.c: /usr/bin/ld: libcrypto_sign_mqqsig192.a(mqq-verify.o):(.bss+0x200c0): multiple definition of `mqq_sigma1'; /tmp/cccRQSiw.o:(.bss+0x20130): first defined here
try.c: /usr/bin/ld: libcrypto_sign_mqqsig192.a(mqq-verify.o):(.bss+0x20180): multiple definition of `cc2'; /tmp/cccRQSiw.o:(.bss+0x201f0): first defined here
try.c: /usr/bin/ld: libcrypto_sign_mqqsig192.a(mqq-verify.o):(.bss+0x20190): multiple definition of `cc1'; /tmp/cccRQSiw.o:(.bss+0x20200): first defined here
try.c: /usr/bin/ld: libcrypto_sign_mqqsig192.a(mqq-verify.o):(.bss+0x201a0): multiple definition of `mqq_a'; /tmp/cccRQSiw.o:(.bss+0x20210): first defined here
try.c: collect2: error: ld returned 1 exit status

Number of similar (compiler,implementation) pairs: 1, namely:
CompilerImplementations
gcc -march=native -mtune=native -O2 -fomit-frame-pointer -fwrapv -fPIC -fPIE T:ref

Compiler output

Implementation: T:ref
Security model: timingleaks
Compiler: gcc -march=native -mtune=native -O3 -fomit-frame-pointer -fwrapv -fPIC -fPIE
try.c: /usr/bin/ld: libcrypto_sign_mqqsig192.a(keygen.o):(.bss+0x0): multiple definition of `lookup_table_private_key'; /tmp/ccn13U3A.o:(.bss+0x70): first defined here
try.c: /usr/bin/ld: libcrypto_sign_mqqsig192.a(keygen.o):(.bss+0x20000): multiple definition of `mqq_sigmaK'; /tmp/ccn13U3A.o:(.bss+0x20070): first defined here
try.c: /usr/bin/ld: libcrypto_sign_mqqsig192.a(keygen.o):(.bss+0x200c0): multiple definition of `mqq_sigma1'; /tmp/ccn13U3A.o:(.bss+0x20130): first defined here
try.c: /usr/bin/ld: libcrypto_sign_mqqsig192.a(keygen.o):(.bss+0x20180): multiple definition of `cc2'; /tmp/ccn13U3A.o:(.bss+0x201f0): first defined here
try.c: /usr/bin/ld: libcrypto_sign_mqqsig192.a(keygen.o):(.bss+0x20190): multiple definition of `cc1'; /tmp/ccn13U3A.o:(.bss+0x20200): first defined here
try.c: /usr/bin/ld: libcrypto_sign_mqqsig192.a(keygen.o):(.bss+0x201a0): multiple definition of `mqq_a'; /tmp/ccn13U3A.o:(.bss+0x20210): first defined here
try.c: /usr/bin/ld: libcrypto_sign_mqqsig192.a(mqq-sign.o):(.bss+0x200): multiple definition of `lookup_table_private_key'; /tmp/ccn13U3A.o:(.bss+0x70): first defined here
try.c: /usr/bin/ld: libcrypto_sign_mqqsig192.a(mqq-sign.o):(.bss+0x0): multiple definition of `mqq_sigmaK'; /tmp/ccn13U3A.o:(.bss+0x20070): first defined here
try.c: /usr/bin/ld: libcrypto_sign_mqqsig192.a(mqq-sign.o):(.bss+0xc0): multiple definition of `mqq_sigma1'; /tmp/ccn13U3A.o:(.bss+0x20130): first defined here
try.c: /usr/bin/ld: libcrypto_sign_mqqsig192.a(mqq-sign.o):(.bss+0x1f0): multiple definition of `cc2'; /tmp/ccn13U3A.o:(.bss+0x201f0): first defined here
try.c: /usr/bin/ld: libcrypto_sign_mqqsig192.a(mqq-sign.o):(.bss+0x1e0): multiple definition of `cc1'; /tmp/ccn13U3A.o:(.bss+0x20200): first defined here
try.c: /usr/bin/ld: libcrypto_sign_mqqsig192.a(mqq-sign.o):(.bss+0x180): multiple definition of `mqq_a'; /tmp/ccn13U3A.o:(.bss+0x20210): first defined here
try.c: /usr/bin/ld: libcrypto_sign_mqqsig192.a(mqq-verify.o):(.bss+0x0): multiple definition of `lookup_table_private_key'; /tmp/ccn13U3A.o:(.bss+0x70): first defined here
try.c: /usr/bin/ld: libcrypto_sign_mqqsig192.a(mqq-verify.o):(.bss+0x20000): multiple definition of `mqq_sigmaK'; /tmp/ccn13U3A.o:(.bss+0x20070): first defined here
try.c: /usr/bin/ld: libcrypto_sign_mqqsig192.a(mqq-verify.o):(.bss+0x200c0): multiple definition of `mqq_sigma1'; /tmp/ccn13U3A.o:(.bss+0x20130): first defined here
try.c: /usr/bin/ld: libcrypto_sign_mqqsig192.a(mqq-verify.o):(.bss+0x20180): multiple definition of `cc2'; /tmp/ccn13U3A.o:(.bss+0x201f0): first defined here
try.c: /usr/bin/ld: libcrypto_sign_mqqsig192.a(mqq-verify.o):(.bss+0x20190): multiple definition of `cc1'; /tmp/ccn13U3A.o:(.bss+0x20200): first defined here
try.c: /usr/bin/ld: libcrypto_sign_mqqsig192.a(mqq-verify.o):(.bss+0x201a0): multiple definition of `mqq_a'; /tmp/ccn13U3A.o:(.bss+0x20210): first defined here
try.c: collect2: error: ld returned 1 exit status

Number of similar (compiler,implementation) pairs: 1, namely:
CompilerImplementations
gcc -march=native -mtune=native -O3 -fomit-frame-pointer -fwrapv -fPIC -fPIE T:ref

Compiler output

Implementation: T:ref
Security model: timingleaks
Compiler: gcc -march=native -mtune=native -O -fomit-frame-pointer -fwrapv -fPIC -fPIE
try.c: /usr/bin/ld: libcrypto_sign_mqqsig192.a(keygen.o):(.bss+0x0): multiple definition of `lookup_table_private_key'; /tmp/cci9qUXc.o:(.bss+0x70): first defined here
try.c: /usr/bin/ld: libcrypto_sign_mqqsig192.a(keygen.o):(.bss+0x20000): multiple definition of `mqq_sigmaK'; /tmp/cci9qUXc.o:(.bss+0x20070): first defined here
try.c: /usr/bin/ld: libcrypto_sign_mqqsig192.a(keygen.o):(.bss+0x200c0): multiple definition of `mqq_sigma1'; /tmp/cci9qUXc.o:(.bss+0x20130): first defined here
try.c: /usr/bin/ld: libcrypto_sign_mqqsig192.a(keygen.o):(.bss+0x20180): multiple definition of `cc2'; /tmp/cci9qUXc.o:(.bss+0x201f0): first defined here
try.c: /usr/bin/ld: libcrypto_sign_mqqsig192.a(keygen.o):(.bss+0x20190): multiple definition of `cc1'; /tmp/cci9qUXc.o:(.bss+0x20200): first defined here
try.c: /usr/bin/ld: libcrypto_sign_mqqsig192.a(keygen.o):(.bss+0x201a0): multiple definition of `mqq_a'; /tmp/cci9qUXc.o:(.bss+0x20210): first defined here
try.c: /usr/bin/ld: libcrypto_sign_mqqsig192.a(mqq-sign.o):(.bss+0x200): multiple definition of `lookup_table_private_key'; /tmp/cci9qUXc.o:(.bss+0x70): first defined here
try.c: /usr/bin/ld: libcrypto_sign_mqqsig192.a(mqq-sign.o):(.bss+0x0): multiple definition of `mqq_sigmaK'; /tmp/cci9qUXc.o:(.bss+0x20070): first defined here
try.c: /usr/bin/ld: libcrypto_sign_mqqsig192.a(mqq-sign.o):(.bss+0xc0): multiple definition of `mqq_sigma1'; /tmp/cci9qUXc.o:(.bss+0x20130): first defined here
try.c: /usr/bin/ld: libcrypto_sign_mqqsig192.a(mqq-sign.o):(.bss+0x1f0): multiple definition of `cc2'; /tmp/cci9qUXc.o:(.bss+0x201f0): first defined here
try.c: /usr/bin/ld: libcrypto_sign_mqqsig192.a(mqq-sign.o):(.bss+0x1e0): multiple definition of `cc1'; /tmp/cci9qUXc.o:(.bss+0x20200): first defined here
try.c: /usr/bin/ld: libcrypto_sign_mqqsig192.a(mqq-sign.o):(.bss+0x180): multiple definition of `mqq_a'; /tmp/cci9qUXc.o:(.bss+0x20210): first defined here
try.c: /usr/bin/ld: libcrypto_sign_mqqsig192.a(mqq-verify.o):(.bss+0x0): multiple definition of `lookup_table_private_key'; /tmp/cci9qUXc.o:(.bss+0x70): first defined here
try.c: /usr/bin/ld: libcrypto_sign_mqqsig192.a(mqq-verify.o):(.bss+0x20000): multiple definition of `mqq_sigmaK'; /tmp/cci9qUXc.o:(.bss+0x20070): first defined here
try.c: /usr/bin/ld: libcrypto_sign_mqqsig192.a(mqq-verify.o):(.bss+0x200c0): multiple definition of `mqq_sigma1'; /tmp/cci9qUXc.o:(.bss+0x20130): first defined here
try.c: /usr/bin/ld: libcrypto_sign_mqqsig192.a(mqq-verify.o):(.bss+0x20180): multiple definition of `cc2'; /tmp/cci9qUXc.o:(.bss+0x201f0): first defined here
try.c: /usr/bin/ld: libcrypto_sign_mqqsig192.a(mqq-verify.o):(.bss+0x20190): multiple definition of `cc1'; /tmp/cci9qUXc.o:(.bss+0x20200): first defined here
try.c: /usr/bin/ld: libcrypto_sign_mqqsig192.a(mqq-verify.o):(.bss+0x201a0): multiple definition of `mqq_a'; /tmp/cci9qUXc.o:(.bss+0x20210): first defined here
try.c: collect2: error: ld returned 1 exit status

Number of similar (compiler,implementation) pairs: 1, namely:
CompilerImplementations
gcc -march=native -mtune=native -O -fomit-frame-pointer -fwrapv -fPIC -fPIE T:ref

Compiler output

Implementation: T:ref
Security model: timingleaks
Compiler: gcc -march=native -mtune=native -Os -fomit-frame-pointer -fwrapv -fPIC -fPIE
try.c: /usr/bin/ld: libcrypto_sign_mqqsig192.a(keygen.o):(.bss+0x0): multiple definition of `lookup_table_private_key'; /tmp/ccoKGOGi.o:(.bss+0x70): first defined here
try.c: /usr/bin/ld: libcrypto_sign_mqqsig192.a(keygen.o):(.bss+0x20000): multiple definition of `mqq_sigmaK'; /tmp/ccoKGOGi.o:(.bss+0x20070): first defined here
try.c: /usr/bin/ld: libcrypto_sign_mqqsig192.a(keygen.o):(.bss+0x200c0): multiple definition of `mqq_sigma1'; /tmp/ccoKGOGi.o:(.bss+0x20130): first defined here
try.c: /usr/bin/ld: libcrypto_sign_mqqsig192.a(keygen.o):(.bss+0x20180): multiple definition of `cc2'; /tmp/ccoKGOGi.o:(.bss+0x201f0): first defined here
try.c: /usr/bin/ld: libcrypto_sign_mqqsig192.a(keygen.o):(.bss+0x20190): multiple definition of `cc1'; /tmp/ccoKGOGi.o:(.bss+0x20200): first defined here
try.c: /usr/bin/ld: libcrypto_sign_mqqsig192.a(keygen.o):(.bss+0x201a0): multiple definition of `mqq_a'; /tmp/ccoKGOGi.o:(.bss+0x20210): first defined here
try.c: /usr/bin/ld: libcrypto_sign_mqqsig192.a(mqq-sign.o):(.bss+0x200): multiple definition of `lookup_table_private_key'; /tmp/ccoKGOGi.o:(.bss+0x70): first defined here
try.c: /usr/bin/ld: libcrypto_sign_mqqsig192.a(mqq-sign.o):(.bss+0x0): multiple definition of `mqq_sigmaK'; /tmp/ccoKGOGi.o:(.bss+0x20070): first defined here
try.c: /usr/bin/ld: libcrypto_sign_mqqsig192.a(mqq-sign.o):(.bss+0xc0): multiple definition of `mqq_sigma1'; /tmp/ccoKGOGi.o:(.bss+0x20130): first defined here
try.c: /usr/bin/ld: libcrypto_sign_mqqsig192.a(mqq-sign.o):(.bss+0x1f0): multiple definition of `cc2'; /tmp/ccoKGOGi.o:(.bss+0x201f0): first defined here
try.c: /usr/bin/ld: libcrypto_sign_mqqsig192.a(mqq-sign.o):(.bss+0x1e0): multiple definition of `cc1'; /tmp/ccoKGOGi.o:(.bss+0x20200): first defined here
try.c: /usr/bin/ld: libcrypto_sign_mqqsig192.a(mqq-sign.o):(.bss+0x180): multiple definition of `mqq_a'; /tmp/ccoKGOGi.o:(.bss+0x20210): first defined here
try.c: /usr/bin/ld: libcrypto_sign_mqqsig192.a(mqq-verify.o):(.bss+0x0): multiple definition of `lookup_table_private_key'; /tmp/ccoKGOGi.o:(.bss+0x70): first defined here
try.c: /usr/bin/ld: libcrypto_sign_mqqsig192.a(mqq-verify.o):(.bss+0x20000): multiple definition of `mqq_sigmaK'; /tmp/ccoKGOGi.o:(.bss+0x20070): first defined here
try.c: /usr/bin/ld: libcrypto_sign_mqqsig192.a(mqq-verify.o):(.bss+0x200c0): multiple definition of `mqq_sigma1'; /tmp/ccoKGOGi.o:(.bss+0x20130): first defined here
try.c: /usr/bin/ld: libcrypto_sign_mqqsig192.a(mqq-verify.o):(.bss+0x20180): multiple definition of `cc2'; /tmp/ccoKGOGi.o:(.bss+0x201f0): first defined here
try.c: /usr/bin/ld: libcrypto_sign_mqqsig192.a(mqq-verify.o):(.bss+0x20190): multiple definition of `cc1'; /tmp/ccoKGOGi.o:(.bss+0x20200): first defined here
try.c: /usr/bin/ld: libcrypto_sign_mqqsig192.a(mqq-verify.o):(.bss+0x201a0): multiple definition of `mqq_a'; /tmp/ccoKGOGi.o:(.bss+0x20210): first defined here
try.c: collect2: error: ld returned 1 exit status

Number of similar (compiler,implementation) pairs: 1, namely:
CompilerImplementations
gcc -march=native -mtune=native -Os -fomit-frame-pointer -fwrapv -fPIC -fPIE T:ref