Implementation notes: aarch64, pi4b, crypto_sign/mqqsig160

Computer: pi4b
Architecture: aarch64
CPU ID: 410fd083
SUPERCOP version: 20221019
Operation: crypto_sign
Primitive: mqqsig160

Compiler output

Implementation: T:sse
Security model: timingleaks
Compiler: clang -mcpu=native -O3 -fomit-frame-pointer -fwrapv -Qunused-arguments -fPIC -fPIE
try.c: /usr/bin/ld: libcrypto_sign_mqqsig160.a(keygen.o):(.bss+0x1c0): multiple definition of `lookup_table_private_key'; /tmp/try-small-53c210.o:(.bss+0x1e0): first defined here
try.c: /usr/bin/ld: libcrypto_sign_mqqsig160.a(keygen.o):(.bss+0x0): multiple definition of `mqq_a'; /tmp/try-small-53c210.o:(.bss+0x20): first defined here
try.c: /usr/bin/ld: libcrypto_sign_mqqsig160.a(keygen.o):(.bss+0x60): multiple definition of `cc1'; /tmp/try-small-53c210.o:(.bss+0x80): first defined here
try.c: /usr/bin/ld: libcrypto_sign_mqqsig160.a(keygen.o):(.bss+0x70): multiple definition of `cc2'; /tmp/try-small-53c210.o:(.bss+0x90): first defined here
try.c: /usr/bin/ld: libcrypto_sign_mqqsig160.a(keygen.o):(.bss+0x80): multiple definition of `mqq_sigma1'; /tmp/try-small-53c210.o:(.bss+0xa0): first defined here
try.c: /usr/bin/ld: libcrypto_sign_mqqsig160.a(keygen.o):(.bss+0x120): multiple definition of `mqq_sigmaK'; /tmp/try-small-53c210.o:(.bss+0x140): first defined here
try.c: /usr/bin/ld: libcrypto_sign_mqqsig160.a(mqq-sign.o):(.bss+0x0): multiple definition of `cc1'; /tmp/try-small-53c210.o:(.bss+0x80): first defined here
try.c: /usr/bin/ld: libcrypto_sign_mqqsig160.a(mqq-sign.o):(.bss+0x10): multiple definition of `cc2'; /tmp/try-small-53c210.o:(.bss+0x90): first defined here
try.c: /usr/bin/ld: libcrypto_sign_mqqsig160.a(mqq-sign.o):(.bss+0x20): multiple definition of `mqq_a'; /tmp/try-small-53c210.o:(.bss+0x20): first defined here
try.c: /usr/bin/ld: libcrypto_sign_mqqsig160.a(mqq-sign.o):(.bss+0x80): multiple definition of `mqq_sigma1'; /tmp/try-small-53c210.o:(.bss+0xa0): first defined here
try.c: /usr/bin/ld: libcrypto_sign_mqqsig160.a(mqq-sign.o):(.bss+0x120): multiple definition of `mqq_sigmaK'; /tmp/try-small-53c210.o:(.bss+0x140): first defined here
try.c: /usr/bin/ld: libcrypto_sign_mqqsig160.a(mqq-sign.o):(.bss+0x1c0): multiple definition of `lookup_table_private_key'; /tmp/try-small-53c210.o:(.bss+0x1e0): first defined here
try.c: /usr/bin/ld: libcrypto_sign_mqqsig160.a(mqq-verify.o):(.bss+0x0): multiple definition of `mqq_a'; /tmp/try-small-53c210.o:(.bss+0x20): first defined here
try.c: /usr/bin/ld: libcrypto_sign_mqqsig160.a(mqq-verify.o):(.bss+0x60): multiple definition of `cc1'; /tmp/try-small-53c210.o:(.bss+0x80): first defined here
try.c: /usr/bin/ld: libcrypto_sign_mqqsig160.a(mqq-verify.o):(.bss+0x70): multiple definition of `cc2'; /tmp/try-small-53c210.o:(.bss+0x90): first defined here
try.c: /usr/bin/ld: libcrypto_sign_mqqsig160.a(mqq-verify.o):(.bss+0x80): multiple definition of `mqq_sigma1'; /tmp/try-small-53c210.o:(.bss+0xa0): first defined here
try.c: /usr/bin/ld: libcrypto_sign_mqqsig160.a(mqq-verify.o):(.bss+0x120): multiple definition of `mqq_sigmaK'; /tmp/try-small-53c210.o:(.bss+0x140): first defined here
try.c: /usr/bin/ld: libcrypto_sign_mqqsig160.a(mqq-verify.o):(.bss+0x1c0): multiple definition of `lookup_table_private_key'; /tmp/try-small-53c210.o:(.bss+0x1e0): first defined here
try.c: clang: error: linker command failed with exit code 1 (use -v to see invocation)

Number of similar (compiler,implementation) pairs: 1, namely:
CompilerImplementations
clang -mcpu=native -O3 -fomit-frame-pointer -fwrapv -Qunused-arguments -fPIC -fPIE T:sse

Compiler output

Implementation: T:sse
Security model: timingleaks
Compiler: gcc -march=native -mtune=native -O2 -fomit-frame-pointer -fwrapv -fPIC -fPIE
try.c: /usr/bin/ld: libcrypto_sign_mqqsig160.a(keygen.o):(.bss+0x0): multiple definition of `lookup_table_private_key'; /tmp/ccCwgsQ9.o:(.bss+0x70): first defined here
try.c: /usr/bin/ld: libcrypto_sign_mqqsig160.a(keygen.o):(.bss+0x20000): multiple definition of `mqq_sigmaK'; /tmp/ccCwgsQ9.o:(.bss+0x20070): first defined here
try.c: /usr/bin/ld: libcrypto_sign_mqqsig160.a(keygen.o):(.bss+0x200a0): multiple definition of `mqq_sigma1'; /tmp/ccCwgsQ9.o:(.bss+0x20110): first defined here
try.c: /usr/bin/ld: libcrypto_sign_mqqsig160.a(keygen.o):(.bss+0x20140): multiple definition of `cc2'; /tmp/ccCwgsQ9.o:(.bss+0x201b0): first defined here
try.c: /usr/bin/ld: libcrypto_sign_mqqsig160.a(keygen.o):(.bss+0x20150): multiple definition of `cc1'; /tmp/ccCwgsQ9.o:(.bss+0x201c0): first defined here
try.c: /usr/bin/ld: libcrypto_sign_mqqsig160.a(keygen.o):(.bss+0x20160): multiple definition of `mqq_a'; /tmp/ccCwgsQ9.o:(.bss+0x201d0): first defined here
try.c: /usr/bin/ld: libcrypto_sign_mqqsig160.a(mqq-sign.o):(.bss+0x1c0): multiple definition of `lookup_table_private_key'; /tmp/ccCwgsQ9.o:(.bss+0x70): first defined here
try.c: /usr/bin/ld: libcrypto_sign_mqqsig160.a(mqq-sign.o):(.bss+0xa0): multiple definition of `mqq_sigmaK'; /tmp/ccCwgsQ9.o:(.bss+0x20070): first defined here
try.c: /usr/bin/ld: libcrypto_sign_mqqsig160.a(mqq-sign.o):(.bss+0x0): multiple definition of `mqq_sigma1'; /tmp/ccCwgsQ9.o:(.bss+0x20110): first defined here
try.c: /usr/bin/ld: libcrypto_sign_mqqsig160.a(mqq-sign.o):(.bss+0x1b0): multiple definition of `cc2'; /tmp/ccCwgsQ9.o:(.bss+0x201b0): first defined here
try.c: /usr/bin/ld: libcrypto_sign_mqqsig160.a(mqq-sign.o):(.bss+0x1a0): multiple definition of `cc1'; /tmp/ccCwgsQ9.o:(.bss+0x201c0): first defined here
try.c: /usr/bin/ld: libcrypto_sign_mqqsig160.a(mqq-sign.o):(.bss+0x140): multiple definition of `mqq_a'; /tmp/ccCwgsQ9.o:(.bss+0x201d0): first defined here
try.c: /usr/bin/ld: libcrypto_sign_mqqsig160.a(mqq-verify.o):(.bss+0x0): multiple definition of `lookup_table_private_key'; /tmp/ccCwgsQ9.o:(.bss+0x70): first defined here
try.c: /usr/bin/ld: libcrypto_sign_mqqsig160.a(mqq-verify.o):(.bss+0x20000): multiple definition of `mqq_sigmaK'; /tmp/ccCwgsQ9.o:(.bss+0x20070): first defined here
try.c: /usr/bin/ld: libcrypto_sign_mqqsig160.a(mqq-verify.o):(.bss+0x200a0): multiple definition of `mqq_sigma1'; /tmp/ccCwgsQ9.o:(.bss+0x20110): first defined here
try.c: /usr/bin/ld: libcrypto_sign_mqqsig160.a(mqq-verify.o):(.bss+0x20140): multiple definition of `cc2'; /tmp/ccCwgsQ9.o:(.bss+0x201b0): first defined here
try.c: /usr/bin/ld: libcrypto_sign_mqqsig160.a(mqq-verify.o):(.bss+0x20150): multiple definition of `cc1'; /tmp/ccCwgsQ9.o:(.bss+0x201c0): first defined here
try.c: /usr/bin/ld: libcrypto_sign_mqqsig160.a(mqq-verify.o):(.bss+0x20160): multiple definition of `mqq_a'; /tmp/ccCwgsQ9.o:(.bss+0x201d0): first defined here
try.c: collect2: error: ld returned 1 exit status

Number of similar (compiler,implementation) pairs: 1, namely:
CompilerImplementations
gcc -march=native -mtune=native -O2 -fomit-frame-pointer -fwrapv -fPIC -fPIE T:sse

Compiler output

Implementation: T:sse
Security model: timingleaks
Compiler: gcc -march=native -mtune=native -O3 -fomit-frame-pointer -fwrapv -fPIC -fPIE
try.c: /usr/bin/ld: libcrypto_sign_mqqsig160.a(keygen.o):(.bss+0x0): multiple definition of `lookup_table_private_key'; /tmp/cc5YBNJe.o:(.bss+0x70): first defined here
try.c: /usr/bin/ld: libcrypto_sign_mqqsig160.a(keygen.o):(.bss+0x20000): multiple definition of `mqq_sigmaK'; /tmp/cc5YBNJe.o:(.bss+0x20070): first defined here
try.c: /usr/bin/ld: libcrypto_sign_mqqsig160.a(keygen.o):(.bss+0x200a0): multiple definition of `mqq_sigma1'; /tmp/cc5YBNJe.o:(.bss+0x20110): first defined here
try.c: /usr/bin/ld: libcrypto_sign_mqqsig160.a(keygen.o):(.bss+0x20140): multiple definition of `cc2'; /tmp/cc5YBNJe.o:(.bss+0x201b0): first defined here
try.c: /usr/bin/ld: libcrypto_sign_mqqsig160.a(keygen.o):(.bss+0x20150): multiple definition of `cc1'; /tmp/cc5YBNJe.o:(.bss+0x201c0): first defined here
try.c: /usr/bin/ld: libcrypto_sign_mqqsig160.a(keygen.o):(.bss+0x20160): multiple definition of `mqq_a'; /tmp/cc5YBNJe.o:(.bss+0x201d0): first defined here
try.c: /usr/bin/ld: libcrypto_sign_mqqsig160.a(mqq-sign.o):(.bss+0x1c0): multiple definition of `lookup_table_private_key'; /tmp/cc5YBNJe.o:(.bss+0x70): first defined here
try.c: /usr/bin/ld: libcrypto_sign_mqqsig160.a(mqq-sign.o):(.bss+0xa0): multiple definition of `mqq_sigmaK'; /tmp/cc5YBNJe.o:(.bss+0x20070): first defined here
try.c: /usr/bin/ld: libcrypto_sign_mqqsig160.a(mqq-sign.o):(.bss+0x0): multiple definition of `mqq_sigma1'; /tmp/cc5YBNJe.o:(.bss+0x20110): first defined here
try.c: /usr/bin/ld: libcrypto_sign_mqqsig160.a(mqq-sign.o):(.bss+0x1b0): multiple definition of `cc2'; /tmp/cc5YBNJe.o:(.bss+0x201b0): first defined here
try.c: /usr/bin/ld: libcrypto_sign_mqqsig160.a(mqq-sign.o):(.bss+0x1a0): multiple definition of `cc1'; /tmp/cc5YBNJe.o:(.bss+0x201c0): first defined here
try.c: /usr/bin/ld: libcrypto_sign_mqqsig160.a(mqq-sign.o):(.bss+0x140): multiple definition of `mqq_a'; /tmp/cc5YBNJe.o:(.bss+0x201d0): first defined here
try.c: /usr/bin/ld: libcrypto_sign_mqqsig160.a(mqq-verify.o):(.bss+0x0): multiple definition of `lookup_table_private_key'; /tmp/cc5YBNJe.o:(.bss+0x70): first defined here
try.c: /usr/bin/ld: libcrypto_sign_mqqsig160.a(mqq-verify.o):(.bss+0x20000): multiple definition of `mqq_sigmaK'; /tmp/cc5YBNJe.o:(.bss+0x20070): first defined here
try.c: /usr/bin/ld: libcrypto_sign_mqqsig160.a(mqq-verify.o):(.bss+0x200a0): multiple definition of `mqq_sigma1'; /tmp/cc5YBNJe.o:(.bss+0x20110): first defined here
try.c: /usr/bin/ld: libcrypto_sign_mqqsig160.a(mqq-verify.o):(.bss+0x20140): multiple definition of `cc2'; /tmp/cc5YBNJe.o:(.bss+0x201b0): first defined here
try.c: /usr/bin/ld: libcrypto_sign_mqqsig160.a(mqq-verify.o):(.bss+0x20150): multiple definition of `cc1'; /tmp/cc5YBNJe.o:(.bss+0x201c0): first defined here
try.c: /usr/bin/ld: libcrypto_sign_mqqsig160.a(mqq-verify.o):(.bss+0x20160): multiple definition of `mqq_a'; /tmp/cc5YBNJe.o:(.bss+0x201d0): first defined here
try.c: collect2: error: ld returned 1 exit status

Number of similar (compiler,implementation) pairs: 1, namely:
CompilerImplementations
gcc -march=native -mtune=native -O3 -fomit-frame-pointer -fwrapv -fPIC -fPIE T:sse

Compiler output

Implementation: T:sse
Security model: timingleaks
Compiler: gcc -march=native -mtune=native -O -fomit-frame-pointer -fwrapv -fPIC -fPIE
try.c: /usr/bin/ld: libcrypto_sign_mqqsig160.a(keygen.o):(.bss+0x0): multiple definition of `lookup_table_private_key'; /tmp/cc3se4Cw.o:(.bss+0x70): first defined here
try.c: /usr/bin/ld: libcrypto_sign_mqqsig160.a(keygen.o):(.bss+0x20000): multiple definition of `mqq_sigmaK'; /tmp/cc3se4Cw.o:(.bss+0x20070): first defined here
try.c: /usr/bin/ld: libcrypto_sign_mqqsig160.a(keygen.o):(.bss+0x200a0): multiple definition of `mqq_sigma1'; /tmp/cc3se4Cw.o:(.bss+0x20110): first defined here
try.c: /usr/bin/ld: libcrypto_sign_mqqsig160.a(keygen.o):(.bss+0x20140): multiple definition of `cc2'; /tmp/cc3se4Cw.o:(.bss+0x201b0): first defined here
try.c: /usr/bin/ld: libcrypto_sign_mqqsig160.a(keygen.o):(.bss+0x20150): multiple definition of `cc1'; /tmp/cc3se4Cw.o:(.bss+0x201c0): first defined here
try.c: /usr/bin/ld: libcrypto_sign_mqqsig160.a(keygen.o):(.bss+0x20160): multiple definition of `mqq_a'; /tmp/cc3se4Cw.o:(.bss+0x201d0): first defined here
try.c: /usr/bin/ld: libcrypto_sign_mqqsig160.a(mqq-sign.o):(.bss+0x1c0): multiple definition of `lookup_table_private_key'; /tmp/cc3se4Cw.o:(.bss+0x70): first defined here
try.c: /usr/bin/ld: libcrypto_sign_mqqsig160.a(mqq-sign.o):(.bss+0x0): multiple definition of `mqq_sigmaK'; /tmp/cc3se4Cw.o:(.bss+0x20070): first defined here
try.c: /usr/bin/ld: libcrypto_sign_mqqsig160.a(mqq-sign.o):(.bss+0xa0): multiple definition of `mqq_sigma1'; /tmp/cc3se4Cw.o:(.bss+0x20110): first defined here
try.c: /usr/bin/ld: libcrypto_sign_mqqsig160.a(mqq-sign.o):(.bss+0x1b0): multiple definition of `cc2'; /tmp/cc3se4Cw.o:(.bss+0x201b0): first defined here
try.c: /usr/bin/ld: libcrypto_sign_mqqsig160.a(mqq-sign.o):(.bss+0x1a0): multiple definition of `cc1'; /tmp/cc3se4Cw.o:(.bss+0x201c0): first defined here
try.c: /usr/bin/ld: libcrypto_sign_mqqsig160.a(mqq-sign.o):(.bss+0x140): multiple definition of `mqq_a'; /tmp/cc3se4Cw.o:(.bss+0x201d0): first defined here
try.c: /usr/bin/ld: libcrypto_sign_mqqsig160.a(mqq-verify.o):(.bss+0x0): multiple definition of `lookup_table_private_key'; /tmp/cc3se4Cw.o:(.bss+0x70): first defined here
try.c: /usr/bin/ld: libcrypto_sign_mqqsig160.a(mqq-verify.o):(.bss+0x20000): multiple definition of `mqq_sigmaK'; /tmp/cc3se4Cw.o:(.bss+0x20070): first defined here
try.c: /usr/bin/ld: libcrypto_sign_mqqsig160.a(mqq-verify.o):(.bss+0x200a0): multiple definition of `mqq_sigma1'; /tmp/cc3se4Cw.o:(.bss+0x20110): first defined here
try.c: /usr/bin/ld: libcrypto_sign_mqqsig160.a(mqq-verify.o):(.bss+0x20140): multiple definition of `cc2'; /tmp/cc3se4Cw.o:(.bss+0x201b0): first defined here
try.c: /usr/bin/ld: libcrypto_sign_mqqsig160.a(mqq-verify.o):(.bss+0x20150): multiple definition of `cc1'; /tmp/cc3se4Cw.o:(.bss+0x201c0): first defined here
try.c: /usr/bin/ld: libcrypto_sign_mqqsig160.a(mqq-verify.o):(.bss+0x20160): multiple definition of `mqq_a'; /tmp/cc3se4Cw.o:(.bss+0x201d0): first defined here
try.c: collect2: error: ld returned 1 exit status

Number of similar (compiler,implementation) pairs: 1, namely:
CompilerImplementations
gcc -march=native -mtune=native -O -fomit-frame-pointer -fwrapv -fPIC -fPIE T:sse

Compiler output

Implementation: T:sse
Security model: timingleaks
Compiler: gcc -march=native -mtune=native -Os -fomit-frame-pointer -fwrapv -fPIC -fPIE
try.c: /usr/bin/ld: libcrypto_sign_mqqsig160.a(keygen.o):(.bss+0x0): multiple definition of `lookup_table_private_key'; /tmp/ccNshh11.o:(.bss+0x70): first defined here
try.c: /usr/bin/ld: libcrypto_sign_mqqsig160.a(keygen.o):(.bss+0x20000): multiple definition of `mqq_sigmaK'; /tmp/ccNshh11.o:(.bss+0x20070): first defined here
try.c: /usr/bin/ld: libcrypto_sign_mqqsig160.a(keygen.o):(.bss+0x200a0): multiple definition of `mqq_sigma1'; /tmp/ccNshh11.o:(.bss+0x20110): first defined here
try.c: /usr/bin/ld: libcrypto_sign_mqqsig160.a(keygen.o):(.bss+0x20140): multiple definition of `cc2'; /tmp/ccNshh11.o:(.bss+0x201b0): first defined here
try.c: /usr/bin/ld: libcrypto_sign_mqqsig160.a(keygen.o):(.bss+0x20150): multiple definition of `cc1'; /tmp/ccNshh11.o:(.bss+0x201c0): first defined here
try.c: /usr/bin/ld: libcrypto_sign_mqqsig160.a(keygen.o):(.bss+0x20160): multiple definition of `mqq_a'; /tmp/ccNshh11.o:(.bss+0x201d0): first defined here
try.c: /usr/bin/ld: libcrypto_sign_mqqsig160.a(mqq-sign.o):(.bss+0x1c0): multiple definition of `lookup_table_private_key'; /tmp/ccNshh11.o:(.bss+0x70): first defined here
try.c: /usr/bin/ld: libcrypto_sign_mqqsig160.a(mqq-sign.o):(.bss+0x0): multiple definition of `mqq_sigmaK'; /tmp/ccNshh11.o:(.bss+0x20070): first defined here
try.c: /usr/bin/ld: libcrypto_sign_mqqsig160.a(mqq-sign.o):(.bss+0xa0): multiple definition of `mqq_sigma1'; /tmp/ccNshh11.o:(.bss+0x20110): first defined here
try.c: /usr/bin/ld: libcrypto_sign_mqqsig160.a(mqq-sign.o):(.bss+0x1b0): multiple definition of `cc2'; /tmp/ccNshh11.o:(.bss+0x201b0): first defined here
try.c: /usr/bin/ld: libcrypto_sign_mqqsig160.a(mqq-sign.o):(.bss+0x1a0): multiple definition of `cc1'; /tmp/ccNshh11.o:(.bss+0x201c0): first defined here
try.c: /usr/bin/ld: libcrypto_sign_mqqsig160.a(mqq-sign.o):(.bss+0x140): multiple definition of `mqq_a'; /tmp/ccNshh11.o:(.bss+0x201d0): first defined here
try.c: /usr/bin/ld: libcrypto_sign_mqqsig160.a(mqq-verify.o):(.bss+0x0): multiple definition of `lookup_table_private_key'; /tmp/ccNshh11.o:(.bss+0x70): first defined here
try.c: /usr/bin/ld: libcrypto_sign_mqqsig160.a(mqq-verify.o):(.bss+0x20000): multiple definition of `mqq_sigmaK'; /tmp/ccNshh11.o:(.bss+0x20070): first defined here
try.c: /usr/bin/ld: libcrypto_sign_mqqsig160.a(mqq-verify.o):(.bss+0x200a0): multiple definition of `mqq_sigma1'; /tmp/ccNshh11.o:(.bss+0x20110): first defined here
try.c: /usr/bin/ld: libcrypto_sign_mqqsig160.a(mqq-verify.o):(.bss+0x20140): multiple definition of `cc2'; /tmp/ccNshh11.o:(.bss+0x201b0): first defined here
try.c: /usr/bin/ld: libcrypto_sign_mqqsig160.a(mqq-verify.o):(.bss+0x20150): multiple definition of `cc1'; /tmp/ccNshh11.o:(.bss+0x201c0): first defined here
try.c: /usr/bin/ld: libcrypto_sign_mqqsig160.a(mqq-verify.o):(.bss+0x20160): multiple definition of `mqq_a'; /tmp/ccNshh11.o:(.bss+0x201d0): first defined here
try.c: collect2: error: ld returned 1 exit status

Number of similar (compiler,implementation) pairs: 1, namely:
CompilerImplementations
gcc -march=native -mtune=native -Os -fomit-frame-pointer -fwrapv -fPIC -fPIE T:sse