Implementation notes: aarch64, pi4b, crypto_hash/k12

Computer: pi4b
Architecture: aarch64
CPU ID: 410fd083
SUPERCOP version: 20221019
Operation: crypto_hash
Primitive: k12
TimeObject sizeTest sizeImplementationCompilerBenchmark dateSUPERCOP version
820442908 0 051803 808 720T:kcp/optimized1600lcufullgcc_-march=native_-mtune=native_-Os_-fomit-frame-pointer_-fwrapv_-fPIC_-fPIE2022052920220506
868048692 0 059539 824 736T:kcp/optimized1600ufullgcc_-march=native_-mtune=native_-O3_-fomit-frame-pointer_-fwrapv_-fPIC_-fPIE2022052920220506
869221592 0 030499 808 720T:kcp/optimized1600lcu6gcc_-march=native_-mtune=native_-Os_-fomit-frame-pointer_-fwrapv_-fPIC_-fPIE2022052920220506
869447372 0 057283 824 728T:kcp/optimized1600lcufullgcc_-march=native_-mtune=native_-O2_-fomit-frame-pointer_-fwrapv_-fPIC_-fPIE2022052920220506
872049920 0 060779 824 736T:kcp/optimized1600lcufullgcc_-march=native_-mtune=native_-O3_-fomit-frame-pointer_-fwrapv_-fPIC_-fPIE2022052920220506
873247896 0 059458 840 728T:kcp/optimized1600ufullclang_-mcpu=native_-O3_-fomit-frame-pointer_-fwrapv_-Qunused-arguments_-fPIC_-fPIE2022100720221005
873847068 0 056979 824 728T:kcp/optimized1600ufullgcc_-march=native_-mtune=native_-O2_-fomit-frame-pointer_-fwrapv_-fPIC_-fPIE2022052920220506
875348076 0 056987 808 720T:kcp/optimized1600ufullgcc_-march=native_-mtune=native_-Os_-fomit-frame-pointer_-fwrapv_-fPIC_-fPIE2022052920220506
877350144 0 061698 840 728T:kcp/optimized1600lcufullclang_-mcpu=native_-O3_-fomit-frame-pointer_-fwrapv_-Qunused-arguments_-fPIC_-fPIE2022100720221005
881725156 0 036003 824 736T:kcp/optimized1600u6gcc_-march=native_-mtune=native_-O3_-fomit-frame-pointer_-fwrapv_-fPIC_-fPIE2022052920220506
884826464 0 037307 824 736T:kcp/optimized1600lcu6gcc_-march=native_-mtune=native_-O3_-fomit-frame-pointer_-fwrapv_-fPIC_-fPIE2022052920220506
889545948 0 055835 824 728T:kcp/optimized1600lcufullgcc_-march=native_-mtune=native_-O_-fomit-frame-pointer_-fwrapv_-fPIC_-fPIE2022052920220506
890045232 0 055123 824 728T:kcp/optimized1600ufullgcc_-march=native_-mtune=native_-O_-fomit-frame-pointer_-fwrapv_-fPIC_-fPIE2022052920220506
894922712 0 031611 808 720T:kcp/optimized1600u6gcc_-march=native_-mtune=native_-Os_-fomit-frame-pointer_-fwrapv_-fPIC_-fPIE2022052920220506
902325076 0 034971 824 728T:kcp/optimized1600lcu6gcc_-march=native_-mtune=native_-O2_-fomit-frame-pointer_-fwrapv_-fPIC_-fPIE2022052920220506
906524468 0 034371 824 728T:kcp/optimized1600u6gcc_-march=native_-mtune=native_-O2_-fomit-frame-pointer_-fwrapv_-fPIC_-fPIE2022052920220506
914724664 0 036210 840 728T:kcp/optimized1600u6clang_-mcpu=native_-O3_-fomit-frame-pointer_-fwrapv_-Qunused-arguments_-fPIC_-fPIE2022100720221005
917726912 0 038450 840 728T:kcp/optimized1600lcu6clang_-mcpu=native_-O3_-fomit-frame-pointer_-fwrapv_-Qunused-arguments_-fPIC_-fPIE2022100720221005
920623052 0 032931 824 728T:kcp/optimized1600u6gcc_-march=native_-mtune=native_-O_-fomit-frame-pointer_-fwrapv_-fPIC_-fPIE2022052920220506
927123624 0 033507 824 728T:kcp/optimized1600lcu6gcc_-march=native_-mtune=native_-O_-fomit-frame-pointer_-fwrapv_-fPIC_-fPIE2022052920220506
1137410140 0 021805 856 728T:kcp/reference1600clang_-mcpu=native_-O3_-fomit-frame-pointer_-fwrapv_-Qunused-arguments_-fPIC_-fPIE2022100720221005
1184810400 0 021946 840 728T:kcp/compact1600clang_-mcpu=native_-O3_-fomit-frame-pointer_-fwrapv_-Qunused-arguments_-fPIC_-fPIE2022100720221005
152459116 0 019748 816 736T:kcp/optimized1600ARMv8Agcc_-march=native_-mtune=native_-O3_-fomit-frame-pointer_-fwrapv_-fPIC_-fPIE2022052920220506
152658780 0 018652 816 728T:kcp/optimized1600ARMv8Agcc_-march=native_-mtune=native_-O2_-fomit-frame-pointer_-fwrapv_-fPIC_-fPIE2022052920220506
152737924 0 016668 800 720T:kcp/optimized1600ARMv8Agcc_-march=native_-mtune=native_-Os_-fomit-frame-pointer_-fwrapv_-fPIC_-fPIE2022052920220506
152828692 0 018483 808 728T:kcp/optimized1600ARMv8Agcc_-march=native_-mtune=native_-O_-fomit-frame-pointer_-fwrapv_-fPIC_-fPIE2022052920220506
202459000 0 019879 832 736T:kcp/reference1600gcc_-march=native_-mtune=native_-O3_-fomit-frame-pointer_-fwrapv_-fPIC_-fPIE2022052920220506
2220012770 0 023540 816 736T:kcp/compact1600gcc_-march=native_-mtune=native_-O3_-fomit-frame-pointer_-fwrapv_-fPIC_-fPIE2022052920220506
2519220724 0 032258 840 728T:kcp/inplace1600biclang_-mcpu=native_-O3_-fomit-frame-pointer_-fwrapv_-Qunused-arguments_-fPIC_-fPIE2022100720221005
2800416664 0 026555 824 728T:kcp/inplace1600bigcc_-march=native_-mtune=native_-O_-fomit-frame-pointer_-fwrapv_-fPIC_-fPIE2022052920220506
2848115788 0 024699 808 720T:kcp/inplace1600bigcc_-march=native_-mtune=native_-Os_-fomit-frame-pointer_-fwrapv_-fPIC_-fPIE2022052920220506
2870822892 0 033755 824 736T:kcp/inplace1600bigcc_-march=native_-mtune=native_-O3_-fomit-frame-pointer_-fwrapv_-fPIC_-fPIE2022052920220506
3159119460 0 029379 824 728T:kcp/inplace1600bigcc_-march=native_-mtune=native_-O2_-fomit-frame-pointer_-fwrapv_-fPIC_-fPIE2022052920220506
509027765 0 017588 816 728T:kcp/compact1600gcc_-march=native_-mtune=native_-O2_-fomit-frame-pointer_-fwrapv_-fPIC_-fPIE2022052920220506
580167853 0 017668 816 728T:kcp/compact1600gcc_-march=native_-mtune=native_-O_-fomit-frame-pointer_-fwrapv_-fPIC_-fPIE2022052920220506
636716656 0 015476 800 720T:kcp/compact1600gcc_-march=native_-mtune=native_-Os_-fomit-frame-pointer_-fwrapv_-fPIC_-fPIE2022052920220506
998678451 0 022479 832 728T:kcp/reference1600gcc_-march=native_-mtune=native_-O2_-fomit-frame-pointer_-fwrapv_-fPIC_-fPIE2022052920220506
1101477108 0 016044 816 720T:kcp/reference1600gcc_-march=native_-mtune=native_-Os_-fomit-frame-pointer_-fwrapv_-fPIC_-fPIE2022052920220506
1588048547 0 018463 832 728T:kcp/reference1600gcc_-march=native_-mtune=native_-O_-fomit-frame-pointer_-fwrapv_-fPIC_-fPIE2022052920220506
37226213693 0 025429 856 728T:kcp/reference1600-32bitsclang_-mcpu=native_-O3_-fomit-frame-pointer_-fwrapv_-Qunused-arguments_-fPIC_-fPIE2022100720221005
41616513803 0 024799 832 736T:kcp/reference1600-32bitsgcc_-march=native_-mtune=native_-O3_-fomit-frame-pointer_-fwrapv_-fPIC_-fPIE2022052920220506
58532711563 0 025663 832 728T:kcp/reference1600-32bitsgcc_-march=native_-mtune=native_-O2_-fomit-frame-pointer_-fwrapv_-fPIC_-fPIE2022052920220506
6012329492 0 018484 816 720T:kcp/reference1600-32bitsgcc_-march=native_-mtune=native_-Os_-fomit-frame-pointer_-fwrapv_-fPIC_-fPIE2022052920220506
65803811235 0 021142 824 728T:kcp/reference1600-32bitsgcc_-march=native_-mtune=native_-O_-fomit-frame-pointer_-fwrapv_-fPIC_-fPIE2022052920220506

Compiler output

Implementation: T:kcp/inplace1600ARMv6M
Security model: timingleaks
Compiler: clang -mcpu=native -O3 -fomit-frame-pointer -fwrapv -Qunused-arguments -fPIC -fPIE
keccak.s: keccak.s:1:1: error: unexpected token at start of statement
keccak.s: @
keccak.s: ^
keccak.s: keccak.s:2:1: error: unexpected token at start of statement
keccak.s: @ Implementation by the Keccak, Keyak and Ketje Teams, namely, Guido Bertoni,
keccak.s: ^
keccak.s: keccak.s:3:1: error: unexpected token at start of statement
keccak.s: @ Joan Daemen, Michaƫl Peeters, Gilles Van Assche and Ronny Van Keer, hereby
keccak.s: keccak.s:4:1: error: unexpected token at start of statement
keccak.s: @ denoted as "the implementer".
keccak.s: ^
keccak.s: keccak.s:5:1: error: unexpected token at start of statement
keccak.s: @
keccak.s: ^
keccak.s: keccak.s:6:1: error: unexpected token at start of statement
keccak.s: @ For more information, feedback or questions, please refer to our websites:
keccak.s: ^
keccak.s: keccak.s:7:1: error: unexpected token at start of statement
keccak.s: @ http://keccak.noekeon.org/
keccak.s: ^
keccak.s: keccak.s:8:1: error: unexpected token at start of statement
keccak.s: @ http://keyak.noekeon.org/
keccak.s: ^
keccak.s: keccak.s:9:1: error: unexpected token at start of statement
keccak.s: @ http://ketje.noekeon.org/
keccak.s: ...

Number of similar (compiler,implementation) pairs: 6, namely:
CompilerImplementations
clang -mcpu=native -O3 -fomit-frame-pointer -fwrapv -Qunused-arguments -fPIC -fPIE T:kcp/inplace1600ARMv6M T:kcp/inplace1600ARMv7A T:kcp/inplace1600ARMv7M T:kcp/optimized1600ARMv6Mu1 T:kcp/optimized1600ARMv6Mu2 T:kcp/optimized1600ARMv7A

Compiler output

Implementation: T:kcp/inplace1600ARMv6M
Security model: timingleaks
Compiler: gcc -march=native -mtune=native -O2 -fomit-frame-pointer -fwrapv -fPIC -fPIE
keccak.s: keccak.s: Assembler messages:
keccak.s: keccak.s:1: Error: junk at end of line, first unrecognized character is `@'
keccak.s: keccak.s:2: Error: junk at end of line, first unrecognized character is `@'
keccak.s: keccak.s:3: Error: junk at end of line, first unrecognized character is `@'
keccak.s: keccak.s:4: Error: junk at end of line, first unrecognized character is `@'
keccak.s: keccak.s:5: Error: junk at end of line, first unrecognized character is `@'
keccak.s: keccak.s:6: Error: junk at end of line, first unrecognized character is `@'
keccak.s: keccak.s:7: Error: junk at end of line, first unrecognized character is `@'
keccak.s: keccak.s:8: Error: junk at end of line, first unrecognized character is `@'
keccak.s: keccak.s:9: Error: junk at end of line, first unrecognized character is `@'
keccak.s: keccak.s:10: Error: junk at end of line, first unrecognized character is `@'
keccak.s: keccak.s:11: Error: junk at end of line, first unrecognized character is `@'
keccak.s: keccak.s:12: Error: junk at end of line, first unrecognized character is `@'
keccak.s: keccak.s:13: Error: junk at end of line, first unrecognized character is `@'
keccak.s: keccak.s:14: Error: junk at end of line, first unrecognized character is `@'
keccak.s: keccak.s:16: Error: junk at end of line, first unrecognized character is `@'
keccak.s: keccak.s:19: Error: unknown pseudo-op: `.thumb'
keccak.s: keccak.s:20: Error: unknown pseudo-op: `.syntax'
keccak.s: keccak.s:23: Error: junk at end of line, first unrecognized character is `@'
keccak.s: keccak.s:109: Error: junk at end of line, first unrecognized character is `@'
keccak.s: keccak.s:142: Error: junk at end of line, first unrecognized character is `@'
keccak.s: keccak.s:194: Error: junk at end of line, first unrecognized character is `@'
keccak.s: keccak.s:203: Error: junk at end of line, first unrecognized character is `@'
keccak.s: keccak.s:611: Error: junk at end of line, first unrecognized character is `@'
keccak.s: keccak.s:612: Error: junk at end of line, first unrecognized character is `@'
keccak.s: ...

Number of similar (compiler,implementation) pairs: 4, namely:
CompilerImplementations
gcc -march=native -mtune=native -O2 -fomit-frame-pointer -fwrapv -fPIC -fPIE T:kcp/inplace1600ARMv6M
gcc -march=native -mtune=native -O3 -fomit-frame-pointer -fwrapv -fPIC -fPIE T:kcp/inplace1600ARMv6M
gcc -march=native -mtune=native -O -fomit-frame-pointer -fwrapv -fPIC -fPIE T:kcp/inplace1600ARMv6M
gcc -march=native -mtune=native -Os -fomit-frame-pointer -fwrapv -fPIC -fPIE T:kcp/inplace1600ARMv6M

Compiler output

Implementation: T:kcp/inplace1600ARMv7A
Security model: timingleaks
Compiler: gcc -march=native -mtune=native -O2 -fomit-frame-pointer -fwrapv -fPIC -fPIE
keccak.s: keccak.s: Assembler messages:
keccak.s: keccak.s:1: Error: junk at end of line, first unrecognized character is `@'
keccak.s: keccak.s:2: Error: junk at end of line, first unrecognized character is `@'
keccak.s: keccak.s:3: Error: junk at end of line, first unrecognized character is `@'
keccak.s: keccak.s:4: Error: junk at end of line, first unrecognized character is `@'
keccak.s: keccak.s:5: Error: junk at end of line, first unrecognized character is `@'
keccak.s: keccak.s:6: Error: junk at end of line, first unrecognized character is `@'
keccak.s: keccak.s:7: Error: junk at end of line, first unrecognized character is `@'
keccak.s: keccak.s:8: Error: junk at end of line, first unrecognized character is `@'
keccak.s: keccak.s:9: Error: junk at end of line, first unrecognized character is `@'
keccak.s: keccak.s:10: Error: junk at end of line, first unrecognized character is `@'
keccak.s: keccak.s:11: Error: junk at end of line, first unrecognized character is `@'
keccak.s: keccak.s:12: Error: junk at end of line, first unrecognized character is `@'
keccak.s: keccak.s:13: Error: junk at end of line, first unrecognized character is `@'
keccak.s: keccak.s:14: Error: junk at end of line, first unrecognized character is `@'
keccak.s: keccak.s:16: Error: junk at end of line, first unrecognized character is `@'
keccak.s: keccak.s:18: Error: junk at end of line, first unrecognized character is `@'
keccak.s: keccak.s:21: Error: unknown pseudo-op: `.syntax'
keccak.s: keccak.s:22: Error: unknown pseudo-op: `.thumb'
keccak.s: keccak.s:25: Error: junk at end of line, first unrecognized character is `@'
keccak.s: keccak.s:78: Error: junk at end of line, first unrecognized character is `@'
keccak.s: keccak.s:127: Error: junk at end of line, first unrecognized character is `@'
keccak.s: keccak.s:179: Error: junk at end of line, first unrecognized character is `@'
keccak.s: keccak.s:471: Error: junk at end of line, first unrecognized character is `@'
keccak.s: keccak.s:472: Error: junk at end of line, first unrecognized character is `@'
keccak.s: ...

Number of similar (compiler,implementation) pairs: 4, namely:
CompilerImplementations
gcc -march=native -mtune=native -O2 -fomit-frame-pointer -fwrapv -fPIC -fPIE T:kcp/inplace1600ARMv7A
gcc -march=native -mtune=native -O3 -fomit-frame-pointer -fwrapv -fPIC -fPIE T:kcp/inplace1600ARMv7A
gcc -march=native -mtune=native -O -fomit-frame-pointer -fwrapv -fPIC -fPIE T:kcp/inplace1600ARMv7A
gcc -march=native -mtune=native -Os -fomit-frame-pointer -fwrapv -fPIC -fPIE T:kcp/inplace1600ARMv7A

Compiler output

Implementation: T:kcp/inplace1600ARMv7M
Security model: timingleaks
Compiler: gcc -march=native -mtune=native -O2 -fomit-frame-pointer -fwrapv -fPIC -fPIE
keccak.s: keccak.s: Assembler messages:
keccak.s: keccak.s:1: Error: junk at end of line, first unrecognized character is `@'
keccak.s: keccak.s:2: Error: junk at end of line, first unrecognized character is `@'
keccak.s: keccak.s:3: Error: junk at end of line, first unrecognized character is `@'
keccak.s: keccak.s:4: Error: junk at end of line, first unrecognized character is `@'
keccak.s: keccak.s:5: Error: junk at end of line, first unrecognized character is `@'
keccak.s: keccak.s:6: Error: junk at end of line, first unrecognized character is `@'
keccak.s: keccak.s:7: Error: junk at end of line, first unrecognized character is `@'
keccak.s: keccak.s:8: Error: junk at end of line, first unrecognized character is `@'
keccak.s: keccak.s:9: Error: junk at end of line, first unrecognized character is `@'
keccak.s: keccak.s:10: Error: junk at end of line, first unrecognized character is `@'
keccak.s: keccak.s:11: Error: junk at end of line, first unrecognized character is `@'
keccak.s: keccak.s:12: Error: junk at end of line, first unrecognized character is `@'
keccak.s: keccak.s:13: Error: junk at end of line, first unrecognized character is `@'
keccak.s: keccak.s:14: Error: junk at end of line, first unrecognized character is `@'
keccak.s: keccak.s:16: Error: junk at end of line, first unrecognized character is `@'
keccak.s: keccak.s:19: Error: unknown pseudo-op: `.thumb'
keccak.s: keccak.s:20: Error: unknown pseudo-op: `.syntax'
keccak.s: keccak.s:23: Error: junk at end of line, first unrecognized character is `@'
keccak.s: keccak.s:76: Error: junk at end of line, first unrecognized character is `@'
keccak.s: keccak.s:125: Error: junk at end of line, first unrecognized character is `@'
keccak.s: keccak.s:177: Error: junk at end of line, first unrecognized character is `@'
keccak.s: keccak.s:470: Error: junk at end of line, first unrecognized character is `@'
keccak.s: keccak.s:471: Error: junk at end of line, first unrecognized character is `@'
keccak.s: keccak.s:472: Error: junk at end of line, first unrecognized character is `@'
keccak.s: ...

Number of similar (compiler,implementation) pairs: 4, namely:
CompilerImplementations
gcc -march=native -mtune=native -O2 -fomit-frame-pointer -fwrapv -fPIC -fPIE T:kcp/inplace1600ARMv7M
gcc -march=native -mtune=native -O3 -fomit-frame-pointer -fwrapv -fPIC -fPIE T:kcp/inplace1600ARMv7M
gcc -march=native -mtune=native -O -fomit-frame-pointer -fwrapv -fPIC -fPIE T:kcp/inplace1600ARMv7M
gcc -march=native -mtune=native -Os -fomit-frame-pointer -fwrapv -fPIC -fPIE T:kcp/inplace1600ARMv7M

Compiler output

Implementation: T:kcp/optimized1600ARMv6Mu1
Security model: timingleaks
Compiler: gcc -march=native -mtune=native -O2 -fomit-frame-pointer -fwrapv -fPIC -fPIE
keccak.s: keccak.s: Assembler messages:
keccak.s: keccak.s:1: Error: junk at end of line, first unrecognized character is `@'
keccak.s: keccak.s:2: Error: junk at end of line, first unrecognized character is `@'
keccak.s: keccak.s:3: Error: junk at end of line, first unrecognized character is `@'
keccak.s: keccak.s:4: Error: junk at end of line, first unrecognized character is `@'
keccak.s: keccak.s:5: Error: junk at end of line, first unrecognized character is `@'
keccak.s: keccak.s:6: Error: junk at end of line, first unrecognized character is `@'
keccak.s: keccak.s:7: Error: junk at end of line, first unrecognized character is `@'
keccak.s: keccak.s:8: Error: junk at end of line, first unrecognized character is `@'
keccak.s: keccak.s:9: Error: junk at end of line, first unrecognized character is `@'
keccak.s: keccak.s:10: Error: junk at end of line, first unrecognized character is `@'
keccak.s: keccak.s:11: Error: junk at end of line, first unrecognized character is `@'
keccak.s: keccak.s:12: Error: junk at end of line, first unrecognized character is `@'
keccak.s: keccak.s:13: Error: junk at end of line, first unrecognized character is `@'
keccak.s: keccak.s:14: Error: junk at end of line, first unrecognized character is `@'
keccak.s: keccak.s:16: Error: junk at end of line, first unrecognized character is `@'
keccak.s: keccak.s:19: Error: unknown pseudo-op: `.thumb'
keccak.s: keccak.s:20: Error: unknown pseudo-op: `.syntax'
keccak.s: keccak.s:23: Error: junk at end of line, first unrecognized character is `@'
keccak.s: keccak.s:109: Error: junk at end of line, first unrecognized character is `@'
keccak.s: keccak.s:142: Error: junk at end of line, first unrecognized character is `@'
keccak.s: keccak.s:194: Error: junk at end of line, first unrecognized character is `@'
keccak.s: keccak.s:195: Error: junk at end of line, first unrecognized character is `@'
keccak.s: keccak.s:205: Error: junk at end of line, first unrecognized character is `@'
keccak.s: keccak.s:300: Error: junk at end of line, first unrecognized character is `@'
keccak.s: ...

Number of similar (compiler,implementation) pairs: 4, namely:
CompilerImplementations
gcc -march=native -mtune=native -O2 -fomit-frame-pointer -fwrapv -fPIC -fPIE T:kcp/optimized1600ARMv6Mu1
gcc -march=native -mtune=native -O3 -fomit-frame-pointer -fwrapv -fPIC -fPIE T:kcp/optimized1600ARMv6Mu1
gcc -march=native -mtune=native -O -fomit-frame-pointer -fwrapv -fPIC -fPIE T:kcp/optimized1600ARMv6Mu1
gcc -march=native -mtune=native -Os -fomit-frame-pointer -fwrapv -fPIC -fPIE T:kcp/optimized1600ARMv6Mu1

Compiler output

Implementation: T:kcp/optimized1600ARMv6Mu2
Security model: timingleaks
Compiler: gcc -march=native -mtune=native -O2 -fomit-frame-pointer -fwrapv -fPIC -fPIE
keccak.s: keccak.s: Assembler messages:
keccak.s: keccak.s:1: Error: junk at end of line, first unrecognized character is `@'
keccak.s: keccak.s:2: Error: junk at end of line, first unrecognized character is `@'
keccak.s: keccak.s:3: Error: junk at end of line, first unrecognized character is `@'
keccak.s: keccak.s:4: Error: junk at end of line, first unrecognized character is `@'
keccak.s: keccak.s:5: Error: junk at end of line, first unrecognized character is `@'
keccak.s: keccak.s:6: Error: junk at end of line, first unrecognized character is `@'
keccak.s: keccak.s:7: Error: junk at end of line, first unrecognized character is `@'
keccak.s: keccak.s:8: Error: junk at end of line, first unrecognized character is `@'
keccak.s: keccak.s:9: Error: junk at end of line, first unrecognized character is `@'
keccak.s: keccak.s:10: Error: junk at end of line, first unrecognized character is `@'
keccak.s: keccak.s:11: Error: junk at end of line, first unrecognized character is `@'
keccak.s: keccak.s:12: Error: junk at end of line, first unrecognized character is `@'
keccak.s: keccak.s:13: Error: junk at end of line, first unrecognized character is `@'
keccak.s: keccak.s:14: Error: junk at end of line, first unrecognized character is `@'
keccak.s: keccak.s:16: Error: junk at end of line, first unrecognized character is `@'
keccak.s: keccak.s:19: Error: unknown pseudo-op: `.thumb'
keccak.s: keccak.s:20: Error: unknown pseudo-op: `.syntax'
keccak.s: keccak.s:23: Error: junk at end of line, first unrecognized character is `@'
keccak.s: keccak.s:109: Error: junk at end of line, first unrecognized character is `@'
keccak.s: keccak.s:142: Error: junk at end of line, first unrecognized character is `@'
keccak.s: keccak.s:194: Error: junk at end of line, first unrecognized character is `@'
keccak.s: keccak.s:195: Error: junk at end of line, first unrecognized character is `@'
keccak.s: keccak.s:205: Error: junk at end of line, first unrecognized character is `@'
keccak.s: keccak.s:374: Error: junk at end of line, first unrecognized character is `@'
keccak.s: ...

Number of similar (compiler,implementation) pairs: 4, namely:
CompilerImplementations
gcc -march=native -mtune=native -O2 -fomit-frame-pointer -fwrapv -fPIC -fPIE T:kcp/optimized1600ARMv6Mu2
gcc -march=native -mtune=native -O3 -fomit-frame-pointer -fwrapv -fPIC -fPIE T:kcp/optimized1600ARMv6Mu2
gcc -march=native -mtune=native -O -fomit-frame-pointer -fwrapv -fPIC -fPIE T:kcp/optimized1600ARMv6Mu2
gcc -march=native -mtune=native -Os -fomit-frame-pointer -fwrapv -fPIC -fPIE T:kcp/optimized1600ARMv6Mu2

Compiler output

Implementation: T:kcp/optimized1600ARMv7A
Security model: timingleaks
Compiler: gcc -march=native -mtune=native -O2 -fomit-frame-pointer -fwrapv -fPIC -fPIE
keccak.s: keccak.s: Assembler messages:
keccak.s: keccak.s:1: Error: junk at end of line, first unrecognized character is `@'
keccak.s: keccak.s:2: Error: junk at end of line, first unrecognized character is `@'
keccak.s: keccak.s:3: Error: junk at end of line, first unrecognized character is `@'
keccak.s: keccak.s:4: Error: junk at end of line, first unrecognized character is `@'
keccak.s: keccak.s:5: Error: junk at end of line, first unrecognized character is `@'
keccak.s: keccak.s:6: Error: junk at end of line, first unrecognized character is `@'
keccak.s: keccak.s:7: Error: junk at end of line, first unrecognized character is `@'
keccak.s: keccak.s:8: Error: junk at end of line, first unrecognized character is `@'
keccak.s: keccak.s:9: Error: junk at end of line, first unrecognized character is `@'
keccak.s: keccak.s:10: Error: junk at end of line, first unrecognized character is `@'
keccak.s: keccak.s:11: Error: junk at end of line, first unrecognized character is `@'
keccak.s: keccak.s:12: Error: junk at end of line, first unrecognized character is `@'
keccak.s: keccak.s:13: Error: junk at end of line, first unrecognized character is `@'
keccak.s: keccak.s:14: Error: junk at end of line, first unrecognized character is `@'
keccak.s: keccak.s:16: Error: junk at end of line, first unrecognized character is `@'
keccak.s: keccak.s:17: Error: junk at end of line, first unrecognized character is `@'
keccak.s: keccak.s:18: Error: junk at end of line, first unrecognized character is `@'
keccak.s: keccak.s:21: Error: unknown pseudo-op: `.syntax'
keccak.s: keccak.s:22: Error: unknown pseudo-op: `.fpu'
keccak.s: keccak.s:23: Error: unknown pseudo-op: `.arm'
keccak.s: keccak.s:26: Error: junk at end of line, first unrecognized character is `@'
keccak.s: keccak.s:27: Error: junk at end of line, first unrecognized character is `@'
keccak.s: keccak.s:29: Error: junk at end of line, first unrecognized character is `@'
keccak.s: keccak.s:56: Error: junk at end of line, first unrecognized character is `@'
keccak.s: ...

Number of similar (compiler,implementation) pairs: 4, namely:
CompilerImplementations
gcc -march=native -mtune=native -O2 -fomit-frame-pointer -fwrapv -fPIC -fPIE T:kcp/optimized1600ARMv7A
gcc -march=native -mtune=native -O3 -fomit-frame-pointer -fwrapv -fPIC -fPIE T:kcp/optimized1600ARMv7A
gcc -march=native -mtune=native -O -fomit-frame-pointer -fwrapv -fPIC -fPIE T:kcp/optimized1600ARMv7A
gcc -march=native -mtune=native -Os -fomit-frame-pointer -fwrapv -fPIC -fPIE T:kcp/optimized1600ARMv7A

Compiler output

Implementation: T:kcp/optimized1600ARMv8A
Security model: timingleaks
Compiler: clang -mcpu=native -O3 -fomit-frame-pointer -fwrapv -Qunused-arguments -fPIC -fPIE
keccak.s: <instantiation>:18:18: error: invalid operand for instruction
keccak.s: mov v5.2d[0], v0.2d[1] // v5 = (A[4] ^ A[14]) || ????
keccak.s: ^
keccak.s: keccak.s:524:5: note: while in macro instantiation
keccak.s: KeccakRound
keccak.s: ^
keccak.s: <instantiation>:23:18: error: invalid operand for instruction
keccak.s: mov v4.2d[1], v3.2d[0] // v4 = B[4] || B[3]
keccak.s: ^
keccak.s: keccak.s:524:5: note: while in macro instantiation
keccak.s: KeccakRound
keccak.s: ^
keccak.s: <instantiation>:57:18: error: invalid operand for instruction
keccak.s: mov x11, v20.2d[0] // x11 = A[1]
keccak.s: ^
keccak.s: keccak.s:524:5: note: while in macro instantiation
keccak.s: KeccakRound
keccak.s: ^
keccak.s: <instantiation>:2:18: error: invalid operand for instruction
keccak.s: mov x10, v25.2d[0]
keccak.s: ^
keccak.s: <instantiation>:59:5: note: while in macro instantiation
keccak.s: RhoPi v25.2d[0], x11, x10, 1 // A[10] = ROTL64(A[1], 1)
keccak.s: ^
keccak.s: keccak.s:524:5: note: while in macro instantiation
keccak.s: ...

Number of similar (compiler,implementation) pairs: 1, namely:
CompilerImplementations
clang -mcpu=native -O3 -fomit-frame-pointer -fwrapv -Qunused-arguments -fPIC -fPIE T:kcp/optimized1600ARMv8A

Compiler output

Implementation: T:kcp/optimized1600AVX2
Security model: timingleaks
Compiler: g++ -march=native -mtune=native -O2 -fomit-frame-pointer -fwrapv -fPIC -fPIE
KeccakP-1600-AVX2.cpp: KeccakP-1600-AVX2.cpp:18:14: fatal error: x86intrin.h: No such file or directory
KeccakP-1600-AVX2.cpp: 18 | #include <x86intrin.h>
KeccakP-1600-AVX2.cpp: | ^~~~~~~~~~~~~
KeccakP-1600-AVX2.cpp: compilation terminated.

Number of similar (compiler,implementation) pairs: 4, namely:
CompilerImplementations
g++ -march=native -mtune=native -O2 -fomit-frame-pointer -fwrapv -fPIC -fPIE T:kcp/optimized1600AVX2
g++ -march=native -mtune=native -O3 -fomit-frame-pointer -fwrapv -fPIC -fPIE T:kcp/optimized1600AVX2
g++ -march=native -mtune=native -O -fomit-frame-pointer -fwrapv -fPIC -fPIE T:kcp/optimized1600AVX2
g++ -march=native -mtune=native -Os -fomit-frame-pointer -fwrapv -fPIC -fPIE T:kcp/optimized1600AVX2

Compiler output

Implementation: T:kcp/optimized1600AVX512
Security model: timingleaks
Compiler: clang -mcpu=native -O3 -fomit-frame-pointer -fwrapv -Qunused-arguments -fPIC -fPIE
KeccakP-1600-AVX512.c: In file included from KeccakP-1600-AVX512.c:24:
KeccakP-1600-AVX512.c: /usr/lib/llvm-14/lib/clang/14.0.0/include/smmintrin.h:14:2: error: "This header is only meant to be used on x86 and x64 architecture"
KeccakP-1600-AVX512.c: #error "This header is only meant to be used on x86 and x64 architecture"
KeccakP-1600-AVX512.c: ^
KeccakP-1600-AVX512.c: In file included from KeccakP-1600-AVX512.c:24:
KeccakP-1600-AVX512.c: In file included from /usr/lib/llvm-14/lib/clang/14.0.0/include/smmintrin.h:17:
KeccakP-1600-AVX512.c: /usr/lib/llvm-14/lib/clang/14.0.0/include/tmmintrin.h:14:2: error: "This header is only meant to be used on x86 and x64 architecture"
KeccakP-1600-AVX512.c: #error "This header is only meant to be used on x86 and x64 architecture"
KeccakP-1600-AVX512.c: ^
KeccakP-1600-AVX512.c: In file included from KeccakP-1600-AVX512.c:24:
KeccakP-1600-AVX512.c: In file included from /usr/lib/llvm-14/lib/clang/14.0.0/include/smmintrin.h:17:
KeccakP-1600-AVX512.c: In file included from /usr/lib/llvm-14/lib/clang/14.0.0/include/tmmintrin.h:17:
KeccakP-1600-AVX512.c: /usr/lib/llvm-14/lib/clang/14.0.0/include/pmmintrin.h:14:2: error: "This header is only meant to be used on x86 and x64 architecture"
KeccakP-1600-AVX512.c: #error "This header is only meant to be used on x86 and x64 architecture"
KeccakP-1600-AVX512.c: ^
KeccakP-1600-AVX512.c: In file included from KeccakP-1600-AVX512.c:24:
KeccakP-1600-AVX512.c: In file included from /usr/lib/llvm-14/lib/clang/14.0.0/include/smmintrin.h:17:
KeccakP-1600-AVX512.c: In file included from /usr/lib/llvm-14/lib/clang/14.0.0/include/tmmintrin.h:17:
KeccakP-1600-AVX512.c: In file included from /usr/lib/llvm-14/lib/clang/14.0.0/include/pmmintrin.h:17:
KeccakP-1600-AVX512.c: /usr/lib/llvm-14/lib/clang/14.0.0/include/emmintrin.h:14:2: error: "This header is only meant to be used on x86 and x64 architecture"
KeccakP-1600-AVX512.c: #error "This header is only meant to be used on x86 and x64 architecture"
KeccakP-1600-AVX512.c: ^
KeccakP-1600-AVX512.c: In file included from KeccakP-1600-AVX512.c:24:
KeccakP-1600-AVX512.c: In file included from /usr/lib/llvm-14/lib/clang/14.0.0/include/smmintrin.h:17:
KeccakP-1600-AVX512.c: In file included from /usr/lib/llvm-14/lib/clang/14.0.0/include/tmmintrin.h:17:
KeccakP-1600-AVX512.c: ...

Number of similar (compiler,implementation) pairs: 1, namely:
CompilerImplementations
clang -mcpu=native -O3 -fomit-frame-pointer -fwrapv -Qunused-arguments -fPIC -fPIE T:kcp/optimized1600AVX512

Compiler output

Implementation: T:kcp/optimized1600AVX512
Security model: timingleaks
Compiler: gcc -march=native -mtune=native -O2 -fomit-frame-pointer -fwrapv -fPIC -fPIE
KeccakP-1600-AVX512.c: KeccakP-1600-AVX512.c:24:10: fatal error: smmintrin.h: No such file or directory
KeccakP-1600-AVX512.c: 24 | #include <smmintrin.h>
KeccakP-1600-AVX512.c: | ^~~~~~~~~~~~~
KeccakP-1600-AVX512.c: compilation terminated.

Number of similar (compiler,implementation) pairs: 4, namely:
CompilerImplementations
gcc -march=native -mtune=native -O2 -fomit-frame-pointer -fwrapv -fPIC -fPIE T:kcp/optimized1600AVX512
gcc -march=native -mtune=native -O3 -fomit-frame-pointer -fwrapv -fPIC -fPIE T:kcp/optimized1600AVX512
gcc -march=native -mtune=native -O -fomit-frame-pointer -fwrapv -fPIC -fPIE T:kcp/optimized1600AVX512
gcc -march=native -mtune=native -Os -fomit-frame-pointer -fwrapv -fPIC -fPIE T:kcp/optimized1600AVX512

Compiler output

Implementation: T:kcp/optimized1600AsmX86-64
Security model: timingleaks
Compiler: clang -mcpu=native -O3 -fomit-frame-pointer -fwrapv -Qunused-arguments -fPIC -fPIE
keccak.s: keccak.s:52:12: error: unknown token in expression
keccak.s: .equ arg1, %rdi
keccak.s: ^
keccak.s: keccak.s:52:12: error: missing expression
keccak.s: .equ arg1, %rdi
keccak.s: ^
keccak.s: keccak.s:53:12: error: unknown token in expression
keccak.s: .equ arg2, %rsi
keccak.s: ^
keccak.s: keccak.s:53:12: error: missing expression
keccak.s: .equ arg2, %rsi
keccak.s: ^
keccak.s: keccak.s:54:12: error: unknown token in expression
keccak.s: .equ arg3, %rdx
keccak.s: ^
keccak.s: keccak.s:54:12: error: missing expression
keccak.s: .equ arg3, %rdx
keccak.s: ^
keccak.s: keccak.s:55:12: error: unknown token in expression
keccak.s: .equ arg4, %rcx
keccak.s: ^
keccak.s: keccak.s:55:12: error: missing expression
keccak.s: .equ arg4, %rcx
keccak.s: ^
keccak.s: keccak.s:56:12: error: unknown token in expression
keccak.s: ...

Number of similar (compiler,implementation) pairs: 1, namely:
CompilerImplementations
clang -mcpu=native -O3 -fomit-frame-pointer -fwrapv -Qunused-arguments -fPIC -fPIE T:kcp/optimized1600AsmX86-64

Compiler output

Implementation: T:kcp/optimized1600AsmX86-64
Security model: timingleaks
Compiler: gcc -march=native -mtune=native -O2 -fomit-frame-pointer -fwrapv -fPIC -fPIE
keccak.s: keccak.s: Assembler messages:
keccak.s: keccak.s:52: Error: bad expression
keccak.s: keccak.s:52: Error: junk at end of line, first unrecognized character is `r'
keccak.s: keccak.s:53: Error: bad expression
keccak.s: keccak.s:53: Error: junk at end of line, first unrecognized character is `r'
keccak.s: keccak.s:54: Error: bad expression
keccak.s: keccak.s:54: Error: junk at end of line, first unrecognized character is `r'
keccak.s: keccak.s:55: Error: bad expression
keccak.s: keccak.s:55: Error: junk at end of line, first unrecognized character is `r'
keccak.s: keccak.s:56: Error: bad expression
keccak.s: keccak.s:56: Error: junk at end of line, first unrecognized character is `r'
keccak.s: keccak.s:57: Error: bad expression
keccak.s: keccak.s:57: Error: junk at end of line, first unrecognized character is `r'
keccak.s: keccak.s:60: Error: bad expression
keccak.s: keccak.s:60: Error: junk at end of line, first unrecognized character is `r'
keccak.s: keccak.s:62: Error: bad expression
keccak.s: keccak.s:62: Error: junk at end of line, first unrecognized character is `r'
keccak.s: keccak.s:63: Error: bad expression
keccak.s: keccak.s:63: Error: junk at end of line, first unrecognized character is `r'
keccak.s: keccak.s:64: Error: bad expression
keccak.s: keccak.s:64: Error: junk at end of line, first unrecognized character is `r'
keccak.s: keccak.s:66: Error: bad expression
keccak.s: keccak.s:66: Error: junk at end of line, first unrecognized character is `r'
keccak.s: keccak.s:67: Error: bad expression
keccak.s: keccak.s:67: Error: junk at end of line, first unrecognized character is `r'
keccak.s: ...

Number of similar (compiler,implementation) pairs: 8, namely:
CompilerImplementations
gcc -march=native -mtune=native -O2 -fomit-frame-pointer -fwrapv -fPIC -fPIE T:kcp/optimized1600AsmX86-64
gcc -march=native -mtune=native -O3 -fomit-frame-pointer -fwrapv -fPIC -fPIE T:kcp/optimized1600AsmX86-64
gcc -march=native -mtune=native -O -fomit-frame-pointer -fwrapv -fPIC -fPIE T:kcp/optimized1600AsmX86-64
gcc -march=native -mtune=native -Os -fomit-frame-pointer -fwrapv -fPIC -fPIE T:kcp/optimized1600AsmX86-64
gcc -march=native -mtune=native -O2 -fomit-frame-pointer -fwrapv -fPIC -fPIE T:kcp/optimized1600AsmX86-64shld
gcc -march=native -mtune=native -O3 -fomit-frame-pointer -fwrapv -fPIC -fPIE T:kcp/optimized1600AsmX86-64shld
gcc -march=native -mtune=native -O -fomit-frame-pointer -fwrapv -fPIC -fPIE T:kcp/optimized1600AsmX86-64shld
gcc -march=native -mtune=native -Os -fomit-frame-pointer -fwrapv -fPIC -fPIE T:kcp/optimized1600AsmX86-64shld

Compiler output

Implementation: T:kcp/optimized1600AsmX86-64Apple
Security model: timingleaks
Compiler: clang -mcpu=native -O3 -fomit-frame-pointer -fwrapv -Qunused-arguments -fPIC -fPIE
keccak.s: keccak.s:542:5: error: unrecognized instruction mnemonic, did you mean: eret, ret?
keccak.s: retq
keccak.s: ^
keccak.s: keccak.s:551:13: error: unknown token in expression
keccak.s: xorq %rax, %rax
keccak.s: ^
keccak.s: keccak.s:551:13: error: invalid operand
keccak.s: xorq %rax, %rax
keccak.s: ^
keccak.s: keccak.s:552:13: error: unknown token in expression
keccak.s: xorq %rcx, %rcx
keccak.s: ^
keccak.s: keccak.s:552:13: error: invalid operand
keccak.s: xorq %rcx, %rcx
keccak.s: ^
keccak.s: keccak.s:553:13: error: unknown token in expression
keccak.s: notq %rcx
keccak.s: ^
keccak.s: keccak.s:553:13: error: invalid operand
keccak.s: notq %rcx
keccak.s: ^
keccak.s: keccak.s:554:13: error: unknown token in expression
keccak.s: pxor %xmm0, %xmm0
keccak.s: ^
keccak.s: keccak.s:554:13: error: invalid operand
keccak.s: ...

Number of similar (compiler,implementation) pairs: 1, namely:
CompilerImplementations
clang -mcpu=native -O3 -fomit-frame-pointer -fwrapv -Qunused-arguments -fPIC -fPIE T:kcp/optimized1600AsmX86-64Apple

Compiler output

Implementation: T:kcp/optimized1600AsmX86-64Apple
Security model: timingleaks
Compiler: gcc -march=native -mtune=native -O2 -fomit-frame-pointer -fwrapv -fPIC -fPIE
keccak.s: keccak.s: Assembler messages:
keccak.s: keccak.s:542: Error: unknown mnemonic `retq' -- `retq'
keccak.s: keccak.s:551: Error: unknown mnemonic `xorq' -- `xorq %rax,%rax'
keccak.s: keccak.s:552: Error: unknown mnemonic `xorq' -- `xorq %rcx,%rcx'
keccak.s: keccak.s:553: Error: unknown mnemonic `notq' -- `notq %rcx'
keccak.s: keccak.s:554: Error: unknown mnemonic `pxor' -- `pxor %xmm0,%xmm0'
keccak.s: keccak.s:555: Error: unknown mnemonic `movq' -- `movq %rax,_ba(arg1)'
keccak.s: keccak.s:556: Error: unknown mnemonic `movq' -- `movq %rcx,_be(arg1)'
keccak.s: keccak.s:557: Error: unknown mnemonic `movq' -- `movq %rcx,_bi(arg1)'
keccak.s: keccak.s:558: Error: unknown mnemonic `movq' -- `movq %rax,_bo(arg1)'
keccak.s: keccak.s:559: Error: unknown mnemonic `movdqu' -- `movdqu %xmm0,_bu(arg1)'
keccak.s: keccak.s:560: Error: unknown mnemonic `movdqu' -- `movdqu %xmm0,_ge(arg1)'
keccak.s: keccak.s:561: Error: unknown mnemonic `movq' -- `movq %rcx,_go(arg1)'
keccak.s: keccak.s:562: Error: unknown mnemonic `movq' -- `movq %rax,_gu(arg1)'
keccak.s: keccak.s:563: Error: unknown mnemonic `movdqu' -- `movdqu %xmm0,_ka(arg1)'
keccak.s: keccak.s:564: Error: unknown mnemonic `movq' -- `movq %rcx,_ki(arg1)'
keccak.s: keccak.s:565: Error: unknown mnemonic `movq' -- `movq %rax,_ko(arg1)'
keccak.s: keccak.s:566: Error: unknown mnemonic `movdqu' -- `movdqu %xmm0,_ku(arg1)'
keccak.s: keccak.s:567: Error: unknown mnemonic `movq' -- `movq %rax,_me(arg1)'
keccak.s: keccak.s:568: Error: unknown mnemonic `movq' -- `movq %rcx,_mi(arg1)'
keccak.s: keccak.s:569: Error: unknown mnemonic `movdqu' -- `movdqu %xmm0,_mo(arg1)'
keccak.s: keccak.s:570: Error: unknown mnemonic `movq' -- `movq %rcx,_sa(arg1)'
keccak.s: keccak.s:571: Error: unknown mnemonic `movq' -- `movq %rax,_se(arg1)'
keccak.s: keccak.s:572: Error: unknown mnemonic `movdqu' -- `movdqu %xmm0,_si(arg1)'
keccak.s: keccak.s:573: Error: unknown mnemonic `movq' -- `movq %rax,_su(arg1)'
keccak.s: ...

Number of similar (compiler,implementation) pairs: 4, namely:
CompilerImplementations
gcc -march=native -mtune=native -O2 -fomit-frame-pointer -fwrapv -fPIC -fPIE T:kcp/optimized1600AsmX86-64Apple
gcc -march=native -mtune=native -O3 -fomit-frame-pointer -fwrapv -fPIC -fPIE T:kcp/optimized1600AsmX86-64Apple
gcc -march=native -mtune=native -O -fomit-frame-pointer -fwrapv -fPIC -fPIE T:kcp/optimized1600AsmX86-64Apple
gcc -march=native -mtune=native -Os -fomit-frame-pointer -fwrapv -fPIC -fPIE T:kcp/optimized1600AsmX86-64Apple

Compiler output

Implementation: T:kcp/optimized1600AsmX86-64shld
Security model: timingleaks
Compiler: clang -mcpu=native -O3 -fomit-frame-pointer -fwrapv -Qunused-arguments -fPIC -fPIE
keccak.s: keccak.s:52:13: error: unknown token in expression
keccak.s: .equ arg1, %rdi
keccak.s: ^
keccak.s: keccak.s:52:13: error: missing expression
keccak.s: .equ arg1, %rdi
keccak.s: ^
keccak.s: keccak.s:53:13: error: unknown token in expression
keccak.s: .equ arg2, %rsi
keccak.s: ^
keccak.s: keccak.s:53:13: error: missing expression
keccak.s: .equ arg2, %rsi
keccak.s: ^
keccak.s: keccak.s:54:13: error: unknown token in expression
keccak.s: .equ arg3, %rdx
keccak.s: ^
keccak.s: keccak.s:54:13: error: missing expression
keccak.s: .equ arg3, %rdx
keccak.s: ^
keccak.s: keccak.s:55:13: error: unknown token in expression
keccak.s: .equ arg4, %rcx
keccak.s: ^
keccak.s: keccak.s:55:13: error: missing expression
keccak.s: .equ arg4, %rcx
keccak.s: ^
keccak.s: keccak.s:56:13: error: unknown token in expression
keccak.s: ...

Number of similar (compiler,implementation) pairs: 1, namely:
CompilerImplementations
clang -mcpu=native -O3 -fomit-frame-pointer -fwrapv -Qunused-arguments -fPIC -fPIE T:kcp/optimized1600AsmX86-64shld

Compiler output

Implementation: T:kcp/optimized1600XOPu6
Security model: timingleaks
Compiler: clang -mcpu=native -O3 -fomit-frame-pointer -fwrapv -Qunused-arguments -fPIC -fPIE
KeccakP-1600-XOP.c: In file included from KeccakP-1600-XOP.c:32:
KeccakP-1600-XOP.c: In file included from /usr/lib/llvm-14/lib/clang/14.0.0/include/x86intrin.h:15:
KeccakP-1600-XOP.c: /usr/lib/llvm-14/lib/clang/14.0.0/include/immintrin.h:14:2: error: "This header is only meant to be used on x86 and x64 architecture"
KeccakP-1600-XOP.c: #error "This header is only meant to be used on x86 and x64 architecture"
KeccakP-1600-XOP.c: ^
KeccakP-1600-XOP.c: In file included from KeccakP-1600-XOP.c:32:
KeccakP-1600-XOP.c: In file included from /usr/lib/llvm-14/lib/clang/14.0.0/include/x86intrin.h:15:
KeccakP-1600-XOP.c: In file included from /usr/lib/llvm-14/lib/clang/14.0.0/include/immintrin.h:17:
KeccakP-1600-XOP.c: In file included from /usr/lib/llvm-14/lib/clang/14.0.0/include/x86gprintrin.h:15:
KeccakP-1600-XOP.c: /usr/lib/llvm-14/lib/clang/14.0.0/include/hresetintrin.h:42:27: error: invalid input constraint 'a' in asm
KeccakP-1600-XOP.c: __asm__ ("hreset $0" :: "a"(__eax));
KeccakP-1600-XOP.c: ^
KeccakP-1600-XOP.c: In file included from KeccakP-1600-XOP.c:32:
KeccakP-1600-XOP.c: In file included from /usr/lib/llvm-14/lib/clang/14.0.0/include/x86intrin.h:15:
KeccakP-1600-XOP.c: In file included from /usr/lib/llvm-14/lib/clang/14.0.0/include/immintrin.h:21:
KeccakP-1600-XOP.c: /usr/lib/llvm-14/lib/clang/14.0.0/include/mmintrin.h:14:2: error: "This header is only meant to be used on x86 and x64 architecture"
KeccakP-1600-XOP.c: #error "This header is only meant to be used on x86 and x64 architecture"
KeccakP-1600-XOP.c: ^
KeccakP-1600-XOP.c: /usr/lib/llvm-14/lib/clang/14.0.0/include/mmintrin.h:54:12: error: invalid conversion between vector type '__m64' (vector of 1 'long long' value) and integer type 'int' of different size
KeccakP-1600-XOP.c: return (__m64)__builtin_ia32_vec_init_v2si(__i, 0);
KeccakP-1600-XOP.c: ^~~~~~~~~~~~~~~~~~~~~~~~~~~~~~~~~~~~~~~~~~~
KeccakP-1600-XOP.c: /usr/lib/llvm-14/lib/clang/14.0.0/include/mmintrin.h:133:12: error: invalid conversion between vector type '__m64' (vector of 1 'long long' value) and integer type 'int' of different size
KeccakP-1600-XOP.c: return (__m64)__builtin_ia32_packsswb((__v4hi)__m1, (__v4hi)__m2);
KeccakP-1600-XOP.c: ^~~~~~~~~~~~~~~~~~~~~~~~~~~~~~~~~~~~~~~~~~~~~~~~~~~~~~~~~~
KeccakP-1600-XOP.c: /usr/lib/llvm-14/lib/clang/14.0.0/include/mmintrin.h:163:12: error: invalid conversion between vector type '__m64' (vector of 1 'long long' value) and integer type 'int' of different size
KeccakP-1600-XOP.c: ...

Number of similar (compiler,implementation) pairs: 2, namely:
CompilerImplementations
clang -mcpu=native -O3 -fomit-frame-pointer -fwrapv -Qunused-arguments -fPIC -fPIE T:kcp/optimized1600XOPu6 T:kcp/optimized1600XOPufull

Compiler output

Implementation: T:kcp/optimized1600XOPu6
Security model: timingleaks
Compiler: gcc -march=native -mtune=native -O2 -fomit-frame-pointer -fwrapv -fPIC -fPIE
KeccakP-1600-XOP.c: KeccakP-1600-XOP.c:32:10: fatal error: x86intrin.h: No such file or directory
KeccakP-1600-XOP.c: 32 | #include <x86intrin.h>
KeccakP-1600-XOP.c: | ^~~~~~~~~~~~~
KeccakP-1600-XOP.c: compilation terminated.

Number of similar (compiler,implementation) pairs: 8, namely:
CompilerImplementations
gcc -march=native -mtune=native -O2 -fomit-frame-pointer -fwrapv -fPIC -fPIE T:kcp/optimized1600XOPu6
gcc -march=native -mtune=native -O3 -fomit-frame-pointer -fwrapv -fPIC -fPIE T:kcp/optimized1600XOPu6
gcc -march=native -mtune=native -O -fomit-frame-pointer -fwrapv -fPIC -fPIE T:kcp/optimized1600XOPu6
gcc -march=native -mtune=native -Os -fomit-frame-pointer -fwrapv -fPIC -fPIE T:kcp/optimized1600XOPu6
gcc -march=native -mtune=native -O2 -fomit-frame-pointer -fwrapv -fPIC -fPIE T:kcp/optimized1600XOPufull
gcc -march=native -mtune=native -O3 -fomit-frame-pointer -fwrapv -fPIC -fPIE T:kcp/optimized1600XOPufull
gcc -march=native -mtune=native -O -fomit-frame-pointer -fwrapv -fPIC -fPIE T:kcp/optimized1600XOPufull
gcc -march=native -mtune=native -Os -fomit-frame-pointer -fwrapv -fPIC -fPIE T:kcp/optimized1600XOPufull

Compiler output

Implementation: T:kcp/optimized1600lcufullshld
Security model: timingleaks
Compiler: clang -mcpu=native -O3 -fomit-frame-pointer -fwrapv -Qunused-arguments -fPIC -fPIE
KeccakP-1600-opt64.c: KeccakP-1600-opt64.c:277:5: error: unrecognized instruction mnemonic, did you mean: shl, shll, sshl, ushl?
KeccakP-1600-opt64.c: roundsN(nr)
KeccakP-1600-opt64.c: ^
KeccakP-1600-opt64.c: ./KeccakP-1600-unrolling.macros:297:9: note: expanded from macro 'roundsN'
KeccakP-1600-opt64.c: thetaRhoPiChiIotaPrepareTheta(i, A, E) \
KeccakP-1600-opt64.c: ^
KeccakP-1600-opt64.c: ./KeccakP-1600-64.macros:46:13: note: expanded from macro 'thetaRhoPiChiIotaPrepareTheta'
KeccakP-1600-opt64.c: Da = Cu^ROL64(Ce, 1); \
KeccakP-1600-opt64.c: ^
KeccakP-1600-opt64.c: KeccakP-1600-opt64.c:34:14: note: expanded from macro 'ROL64'
KeccakP-1600-opt64.c: __asm__ ("shld %2,%0,%0" : "=r"(__out) : "0"(__in), "i"(N)); \
KeccakP-1600-opt64.c: ^
KeccakP-1600-opt64.c: <inline asm>:1:2: note: instantiated into assembly here
KeccakP-1600-opt64.c: shld 1,x11,x11
KeccakP-1600-opt64.c: ^
KeccakP-1600-opt64.c: KeccakP-1600-opt64.c:277:5: error: unrecognized instruction mnemonic, did you mean: shl, shll, sshl, ushl?
KeccakP-1600-opt64.c: roundsN(nr)
KeccakP-1600-opt64.c: ^
KeccakP-1600-opt64.c: ./KeccakP-1600-unrolling.macros:297:9: note: expanded from macro 'roundsN'
KeccakP-1600-opt64.c: thetaRhoPiChiIotaPrepareTheta(i, A, E) \
KeccakP-1600-opt64.c: ^
KeccakP-1600-opt64.c: ./KeccakP-1600-64.macros:47:13: note: expanded from macro 'thetaRhoPiChiIotaPrepareTheta'
KeccakP-1600-opt64.c: De = Ca^ROL64(Ci, 1); \
KeccakP-1600-opt64.c: ^
KeccakP-1600-opt64.c: KeccakP-1600-opt64.c:34:14: note: expanded from macro 'ROL64'
KeccakP-1600-opt64.c: ...

Number of similar (compiler,implementation) pairs: 1, namely:
CompilerImplementations
clang -mcpu=native -O3 -fomit-frame-pointer -fwrapv -Qunused-arguments -fPIC -fPIE T:kcp/optimized1600lcufullshld

Compiler output

Implementation: T:kcp/optimized1600lcufullshld
Security model: timingleaks
Compiler: gcc -march=native -mtune=native -O2 -fomit-frame-pointer -fwrapv -fPIC -fPIE
KeccakP-1600-opt64.c: /tmp/cchSQ4Tw.s: Assembler messages:
KeccakP-1600-opt64.c: /tmp/cchSQ4Tw.s:635: Error: unknown mnemonic `shld' -- `shld 1,x6,x6'
KeccakP-1600-opt64.c: /tmp/cchSQ4Tw.s:641: Error: unknown mnemonic `shld' -- `shld 1,x2,x2'
KeccakP-1600-opt64.c: /tmp/cchSQ4Tw.s:647: Error: unknown mnemonic `shld' -- `shld 1,x0,x0'
KeccakP-1600-opt64.c: /tmp/cchSQ4Tw.s:655: Error: unknown mnemonic `shld' -- `shld 1,x11,x11'
KeccakP-1600-opt64.c: /tmp/cchSQ4Tw.s:662: Error: unknown mnemonic `shld' -- `shld 1,x1,x1'
KeccakP-1600-opt64.c: /tmp/cchSQ4Tw.s:680: Error: unknown mnemonic `shld' -- `shld 44,x25,x25'
KeccakP-1600-opt64.c: /tmp/cchSQ4Tw.s:690: Error: unknown mnemonic `shld' -- `shld 43,x1,x1'
KeccakP-1600-opt64.c: /tmp/cchSQ4Tw.s:704: Error: unknown mnemonic `shld' -- `shld 27,x4,x4'
KeccakP-1600-opt64.c: /tmp/cchSQ4Tw.s:716: Error: unknown mnemonic `shld' -- `shld 14,x9,x9'
KeccakP-1600-opt64.c: /tmp/cchSQ4Tw.s:719: Error: unknown mnemonic `shld' -- `shld 3,x10,x10'
KeccakP-1600-opt64.c: /tmp/cchSQ4Tw.s:725: Error: unknown mnemonic `shld' -- `shld 20,x15,x15'
KeccakP-1600-opt64.c: /tmp/cchSQ4Tw.s:732: Error: unknown mnemonic `shld' -- `shld 21,x0,x0'
KeccakP-1600-opt64.c: /tmp/cchSQ4Tw.s:742: Error: unknown mnemonic `shld' -- `shld 25,x22,x22'
KeccakP-1600-opt64.c: /tmp/cchSQ4Tw.s:750: Error: unknown mnemonic `shld' -- `shld 6,x20,x20'
KeccakP-1600-opt64.c: /tmp/cchSQ4Tw.s:753: Error: unknown mnemonic `shld' -- `shld 28,x4,x4'
KeccakP-1600-opt64.c: /tmp/cchSQ4Tw.s:763: Error: unknown mnemonic `shld' -- `shld 1,x16,x16'
KeccakP-1600-opt64.c: /tmp/cchSQ4Tw.s:766: Error: unknown mnemonic `shld' -- `shld 39,x24,x24'
KeccakP-1600-opt64.c: /tmp/cchSQ4Tw.s:772: Error: unknown mnemonic `shld' -- `shld 41,x23,x23'
KeccakP-1600-opt64.c: /tmp/cchSQ4Tw.s:775: Error: unknown mnemonic `shld' -- `shld 55,x6,x6'
KeccakP-1600-opt64.c: /tmp/cchSQ4Tw.s:781: Error: unknown mnemonic `shld' -- `shld 2,x8,x8'
KeccakP-1600-opt64.c: /tmp/cchSQ4Tw.s:792: Error: unknown mnemonic `shld' -- `shld 62,x5,x5'
KeccakP-1600-opt64.c: /tmp/cchSQ4Tw.s:809: Error: unknown mnemonic `shld' -- `shld 8,x12,x12'
KeccakP-1600-opt64.c: /tmp/cchSQ4Tw.s:818: Error: unknown mnemonic `shld' -- `shld 18,x21,x21'
KeccakP-1600-opt64.c: /tmp/cchSQ4Tw.s:825: Error: unknown mnemonic `shld' -- `shld 45,x17,x17'
KeccakP-1600-opt64.c: ...

Number of similar (compiler,implementation) pairs: 1, namely:
CompilerImplementations
gcc -march=native -mtune=native -O2 -fomit-frame-pointer -fwrapv -fPIC -fPIE T:kcp/optimized1600lcufullshld

Compiler output

Implementation: T:kcp/optimized1600lcufullshld
Security model: timingleaks
Compiler: gcc -march=native -mtune=native -O3 -fomit-frame-pointer -fwrapv -fPIC -fPIE
KeccakP-1600-opt64.c: /tmp/ccy08yjP.s: Assembler messages:
KeccakP-1600-opt64.c: /tmp/ccy08yjP.s:985: Error: unknown mnemonic `shld' -- `shld 1,x6,x6'
KeccakP-1600-opt64.c: /tmp/ccy08yjP.s:991: Error: unknown mnemonic `shld' -- `shld 1,x2,x2'
KeccakP-1600-opt64.c: /tmp/ccy08yjP.s:997: Error: unknown mnemonic `shld' -- `shld 1,x0,x0'
KeccakP-1600-opt64.c: /tmp/ccy08yjP.s:1005: Error: unknown mnemonic `shld' -- `shld 1,x11,x11'
KeccakP-1600-opt64.c: /tmp/ccy08yjP.s:1012: Error: unknown mnemonic `shld' -- `shld 1,x1,x1'
KeccakP-1600-opt64.c: /tmp/ccy08yjP.s:1030: Error: unknown mnemonic `shld' -- `shld 44,x25,x25'
KeccakP-1600-opt64.c: /tmp/ccy08yjP.s:1040: Error: unknown mnemonic `shld' -- `shld 43,x1,x1'
KeccakP-1600-opt64.c: /tmp/ccy08yjP.s:1054: Error: unknown mnemonic `shld' -- `shld 27,x4,x4'
KeccakP-1600-opt64.c: /tmp/ccy08yjP.s:1066: Error: unknown mnemonic `shld' -- `shld 14,x9,x9'
KeccakP-1600-opt64.c: /tmp/ccy08yjP.s:1069: Error: unknown mnemonic `shld' -- `shld 3,x10,x10'
KeccakP-1600-opt64.c: /tmp/ccy08yjP.s:1075: Error: unknown mnemonic `shld' -- `shld 20,x15,x15'
KeccakP-1600-opt64.c: /tmp/ccy08yjP.s:1082: Error: unknown mnemonic `shld' -- `shld 21,x0,x0'
KeccakP-1600-opt64.c: /tmp/ccy08yjP.s:1092: Error: unknown mnemonic `shld' -- `shld 25,x22,x22'
KeccakP-1600-opt64.c: /tmp/ccy08yjP.s:1100: Error: unknown mnemonic `shld' -- `shld 6,x20,x20'
KeccakP-1600-opt64.c: /tmp/ccy08yjP.s:1103: Error: unknown mnemonic `shld' -- `shld 28,x4,x4'
KeccakP-1600-opt64.c: /tmp/ccy08yjP.s:1113: Error: unknown mnemonic `shld' -- `shld 1,x16,x16'
KeccakP-1600-opt64.c: /tmp/ccy08yjP.s:1116: Error: unknown mnemonic `shld' -- `shld 39,x24,x24'
KeccakP-1600-opt64.c: /tmp/ccy08yjP.s:1122: Error: unknown mnemonic `shld' -- `shld 41,x23,x23'
KeccakP-1600-opt64.c: /tmp/ccy08yjP.s:1125: Error: unknown mnemonic `shld' -- `shld 55,x6,x6'
KeccakP-1600-opt64.c: /tmp/ccy08yjP.s:1131: Error: unknown mnemonic `shld' -- `shld 2,x8,x8'
KeccakP-1600-opt64.c: /tmp/ccy08yjP.s:1142: Error: unknown mnemonic `shld' -- `shld 62,x5,x5'
KeccakP-1600-opt64.c: /tmp/ccy08yjP.s:1159: Error: unknown mnemonic `shld' -- `shld 8,x12,x12'
KeccakP-1600-opt64.c: /tmp/ccy08yjP.s:1168: Error: unknown mnemonic `shld' -- `shld 18,x21,x21'
KeccakP-1600-opt64.c: /tmp/ccy08yjP.s:1175: Error: unknown mnemonic `shld' -- `shld 45,x17,x17'
KeccakP-1600-opt64.c: ...

Number of similar (compiler,implementation) pairs: 1, namely:
CompilerImplementations
gcc -march=native -mtune=native -O3 -fomit-frame-pointer -fwrapv -fPIC -fPIE T:kcp/optimized1600lcufullshld

Compiler output

Implementation: T:kcp/optimized1600lcufullshld
Security model: timingleaks
Compiler: gcc -march=native -mtune=native -O -fomit-frame-pointer -fwrapv -fPIC -fPIE
KeccakP-1600-opt64.c: /tmp/ccrMJmkT.s: Assembler messages:
KeccakP-1600-opt64.c: /tmp/ccrMJmkT.s:608: Error: unknown mnemonic `shld' -- `shld 1,x4,x4'
KeccakP-1600-opt64.c: /tmp/ccrMJmkT.s:615: Error: unknown mnemonic `shld' -- `shld 1,x4,x4'
KeccakP-1600-opt64.c: /tmp/ccrMJmkT.s:622: Error: unknown mnemonic `shld' -- `shld 1,x4,x4'
KeccakP-1600-opt64.c: /tmp/ccrMJmkT.s:628: Error: unknown mnemonic `shld' -- `shld 1,x6,x6'
KeccakP-1600-opt64.c: /tmp/ccrMJmkT.s:634: Error: unknown mnemonic `shld' -- `shld 1,x13,x13'
KeccakP-1600-opt64.c: /tmp/ccrMJmkT.s:642: Error: unknown mnemonic `shld' -- `shld 44,x21,x21'
KeccakP-1600-opt64.c: /tmp/ccrMJmkT.s:648: Error: unknown mnemonic `shld' -- `shld 43,x18,x18'
KeccakP-1600-opt64.c: /tmp/ccrMJmkT.s:654: Error: unknown mnemonic `shld' -- `shld 21,x7,x7'
KeccakP-1600-opt64.c: /tmp/ccrMJmkT.s:660: Error: unknown mnemonic `shld' -- `shld 14,x27,x27'
KeccakP-1600-opt64.c: /tmp/ccrMJmkT.s:685: Error: unknown mnemonic `shld' -- `shld 28,x1,x1'
KeccakP-1600-opt64.c: /tmp/ccrMJmkT.s:691: Error: unknown mnemonic `shld' -- `shld 20,x4,x4'
KeccakP-1600-opt64.c: /tmp/ccrMJmkT.s:697: Error: unknown mnemonic `shld' -- `shld 3,x19,x19'
KeccakP-1600-opt64.c: /tmp/ccrMJmkT.s:703: Error: unknown mnemonic `shld' -- `shld 45,x16,x16'
KeccakP-1600-opt64.c: /tmp/ccrMJmkT.s:709: Error: unknown mnemonic `shld' -- `shld 61,x3,x3'
KeccakP-1600-opt64.c: /tmp/ccrMJmkT.s:726: Error: unknown mnemonic `shld' -- `shld 1,x1,x1'
KeccakP-1600-opt64.c: /tmp/ccrMJmkT.s:732: Error: unknown mnemonic `shld' -- `shld 6,x20,x20'
KeccakP-1600-opt64.c: /tmp/ccrMJmkT.s:738: Error: unknown mnemonic `shld' -- `shld 25,x3,x3'
KeccakP-1600-opt64.c: /tmp/ccrMJmkT.s:744: Error: unknown mnemonic `shld' -- `shld 8,x2,x2'
KeccakP-1600-opt64.c: /tmp/ccrMJmkT.s:750: Error: unknown mnemonic `shld' -- `shld 18,x9,x9'
KeccakP-1600-opt64.c: /tmp/ccrMJmkT.s:768: Error: unknown mnemonic `shld' -- `shld 27,x2,x2'
KeccakP-1600-opt64.c: /tmp/ccrMJmkT.s:775: Error: unknown mnemonic `shld' -- `shld 36,x3,x3'
KeccakP-1600-opt64.c: /tmp/ccrMJmkT.s:782: Error: unknown mnemonic `shld' -- `shld 10,x1,x1'
KeccakP-1600-opt64.c: /tmp/ccrMJmkT.s:788: Error: unknown mnemonic `shld' -- `shld 15,x5,x5'
KeccakP-1600-opt64.c: /tmp/ccrMJmkT.s:794: Error: unknown mnemonic `shld' -- `shld 56,x11,x11'
KeccakP-1600-opt64.c: ...

Number of similar (compiler,implementation) pairs: 1, namely:
CompilerImplementations
gcc -march=native -mtune=native -O -fomit-frame-pointer -fwrapv -fPIC -fPIE T:kcp/optimized1600lcufullshld

Compiler output

Implementation: T:kcp/optimized1600lcufullshld
Security model: timingleaks
Compiler: gcc -march=native -mtune=native -Os -fomit-frame-pointer -fwrapv -fPIC -fPIE
KeccakP-1600-opt64.c: /tmp/ccwTcUbZ.s: Assembler messages:
KeccakP-1600-opt64.c: /tmp/ccwTcUbZ.s:574: Error: unknown mnemonic `shld' -- `shld 1,x23,x23'
KeccakP-1600-opt64.c: /tmp/ccwTcUbZ.s:586: Error: unknown mnemonic `shld' -- `shld 1,x20,x20'
KeccakP-1600-opt64.c: /tmp/ccwTcUbZ.s:589: Error: unknown mnemonic `shld' -- `shld 1,x19,x19'
KeccakP-1600-opt64.c: /tmp/ccwTcUbZ.s:596: Error: unknown mnemonic `shld' -- `shld 43,x12,x12'
KeccakP-1600-opt64.c: /tmp/ccwTcUbZ.s:603: Error: unknown mnemonic `shld' -- `shld 44,x14,x14'
KeccakP-1600-opt64.c: /tmp/ccwTcUbZ.s:606: Error: unknown mnemonic `shld' -- `shld 1,x16,x16'
KeccakP-1600-opt64.c: /tmp/ccwTcUbZ.s:609: Error: unknown mnemonic `shld' -- `shld 1,x2,x2'
KeccakP-1600-opt64.c: /tmp/ccwTcUbZ.s:620: Error: unknown mnemonic `shld' -- `shld 21,x10,x10'
KeccakP-1600-opt64.c: /tmp/ccwTcUbZ.s:629: Error: unknown mnemonic `shld' -- `shld 14,x1,x1'
KeccakP-1600-opt64.c: /tmp/ccwTcUbZ.s:639: Error: unknown mnemonic `shld' -- `shld 20,x5,x5'
KeccakP-1600-opt64.c: /tmp/ccwTcUbZ.s:649: Error: unknown mnemonic `shld' -- `shld 3,x13,x13'
KeccakP-1600-opt64.c: /tmp/ccwTcUbZ.s:657: Error: unknown mnemonic `shld' -- `shld 45,x11,x11'
KeccakP-1600-opt64.c: /tmp/ccwTcUbZ.s:660: Error: unknown mnemonic `shld' -- `shld 61,x8,x8'
KeccakP-1600-opt64.c: /tmp/ccwTcUbZ.s:667: Error: unknown mnemonic `shld' -- `shld 28,x1,x1'
KeccakP-1600-opt64.c: /tmp/ccwTcUbZ.s:681: Error: unknown mnemonic `shld' -- `shld 6,x1,x1'
KeccakP-1600-opt64.c: /tmp/ccwTcUbZ.s:684: Error: unknown mnemonic `shld' -- `shld 8,x3,x3'
KeccakP-1600-opt64.c: /tmp/ccwTcUbZ.s:691: Error: unknown mnemonic `shld' -- `shld 18,x9,x9'
KeccakP-1600-opt64.c: /tmp/ccwTcUbZ.s:698: Error: unknown mnemonic `shld' -- `shld 25,x8,x8'
KeccakP-1600-opt64.c: /tmp/ccwTcUbZ.s:707: Error: unknown mnemonic `shld' -- `shld 1,x6,x6'
KeccakP-1600-opt64.c: /tmp/ccwTcUbZ.s:721: Error: unknown mnemonic `shld' -- `shld 10,x9,x9'
KeccakP-1600-opt64.c: /tmp/ccwTcUbZ.s:731: Error: unknown mnemonic `shld' -- `shld 36,x1,x1'
KeccakP-1600-opt64.c: /tmp/ccwTcUbZ.s:738: Error: unknown mnemonic `shld' -- `shld 56,x7,x7'
KeccakP-1600-opt64.c: /tmp/ccwTcUbZ.s:741: Error: unknown mnemonic `shld' -- `shld 27,x3,x3'
KeccakP-1600-opt64.c: /tmp/ccwTcUbZ.s:750: Error: unknown mnemonic `shld' -- `shld 15,x8,x8'
KeccakP-1600-opt64.c: ...

Number of similar (compiler,implementation) pairs: 1, namely:
CompilerImplementations
gcc -march=native -mtune=native -Os -fomit-frame-pointer -fwrapv -fPIC -fPIE T:kcp/optimized1600lcufullshld