Implementation notes: aarch64, pi4b, crypto_hash/asconhashv12

Computer: pi4b
Architecture: aarch64
CPU ID: 410fd083
SUPERCOP version: 20221019
Operation: crypto_hash
Primitive: asconhashv12
TimeObject sizeTest sizeImplementationCompilerBenchmark dateSUPERCOP version
3180310064 0 019803 824 728opt64gcc_-march=native_-mtune=native_-O2_-fomit-frame-pointer_-fwrapv_-fPIC_-fPIE2022102020221019
3180310068 0 020779 824 736opt64gcc_-march=native_-mtune=native_-O3_-fomit-frame-pointer_-fwrapv_-fPIC_-fPIE2022102020221019
349669616 0 018315 808 720opt64gcc_-march=native_-mtune=native_-Os_-fomit-frame-pointer_-fwrapv_-fPIC_-fPIE2022102020221019
356449012 0 020458 840 728opt64clang_-mcpu=native_-O3_-fomit-frame-pointer_-fwrapv_-Qunused-arguments_-fPIC_-fPIE2022102020221019
357876052 0 016668 816 736refgcc_-march=native_-mtune=native_-O3_-fomit-frame-pointer_-fwrapv_-fPIC_-fPIE2022100720221005
3620910844 0 020450 816 728opt64gcc_-march=native_-mtune=native_-O_-fomit-frame-pointer_-fwrapv_-fPIC_-fPIE2022102020221019
3809512744 0 022483 824 728opt32gcc_-march=native_-mtune=native_-O2_-fomit-frame-pointer_-fwrapv_-fPIC_-fPIE2022102020221019
3809512744 0 023443 824 736opt32gcc_-march=native_-mtune=native_-O3_-fomit-frame-pointer_-fwrapv_-fPIC_-fPIE2022102020221019
382411980 0 013394 840 728refclang_-mcpu=native_-O3_-fomit-frame-pointer_-fwrapv_-Qunused-arguments_-fPIC_-fPIE2022100720221005
398805796 0 015444 816 728refgcc_-march=native_-mtune=native_-O2_-fomit-frame-pointer_-fwrapv_-fPIC_-fPIE2022100720221005
40237688 0 011371 824 736opt64_lowsizegcc_-march=native_-mtune=native_-O3_-fomit-frame-pointer_-fwrapv_-fPIC_-fPIE2022102020221019
40241688 0 010419 824 728opt64_lowsizegcc_-march=native_-mtune=native_-O2_-fomit-frame-pointer_-fwrapv_-fPIC_-fPIE2022102020221019
40282660 0 012074 840 728opt64_lowsizeclang_-mcpu=native_-O3_-fomit-frame-pointer_-fwrapv_-Qunused-arguments_-fPIC_-fPIE2022102020221019
42809664 0 09339 808 720opt64_lowsizegcc_-march=native_-mtune=native_-Os_-fomit-frame-pointer_-fwrapv_-fPIC_-fPIE2022102020221019
434245788 0 015299 808 728refgcc_-march=native_-mtune=native_-O_-fomit-frame-pointer_-fwrapv_-fPIC_-fPIE2022100720221005
4395912512 0 021211 808 720opt32gcc_-march=native_-mtune=native_-Os_-fomit-frame-pointer_-fwrapv_-fPIC_-fPIE2022102020221019
44355728 0 011403 824 736opt32_lowsizegcc_-march=native_-mtune=native_-O3_-fomit-frame-pointer_-fwrapv_-fPIC_-fPIE2022102020221019
44378728 0 010451 824 728opt32_lowsizegcc_-march=native_-mtune=native_-O2_-fomit-frame-pointer_-fwrapv_-fPIC_-fPIE2022102020221019
465671056 0 010634 816 728opt64_lowsizegcc_-march=native_-mtune=native_-O_-fomit-frame-pointer_-fwrapv_-fPIC_-fPIE2022102020221019
4662713352 0 022970 816 728opt32gcc_-march=native_-mtune=native_-O_-fomit-frame-pointer_-fwrapv_-fPIC_-fPIE2022102020221019
49471704 0 09387 808 720opt32_lowsizegcc_-march=native_-mtune=native_-Os_-fomit-frame-pointer_-fwrapv_-fPIC_-fPIE2022102020221019
512661096 0 010682 816 728opt32_lowsizegcc_-march=native_-mtune=native_-O_-fomit-frame-pointer_-fwrapv_-fPIC_-fPIE2022102020221019
53825684 0 012106 840 728opt32_lowsizeclang_-mcpu=native_-O3_-fomit-frame-pointer_-fwrapv_-Qunused-arguments_-fPIC_-fPIE2022102020221019
5424010824 0 022266 840 728opt32clang_-mcpu=native_-O3_-fomit-frame-pointer_-fwrapv_-Qunused-arguments_-fPIC_-fPIE2022102020221019
59468752 0 09356 800 720refgcc_-march=native_-mtune=native_-Os_-fomit-frame-pointer_-fwrapv_-fPIC_-fPIE2022100720221005
786955976 0 017402 848 728bi32clang_-mcpu=native_-O3_-fomit-frame-pointer_-fwrapv_-Qunused-arguments_-fPIC_-fPIE2022102020221019
877421260 0 012706 848 728bi32_lowsizeclang_-mcpu=native_-O3_-fomit-frame-pointer_-fwrapv_-Qunused-arguments_-fPIC_-fPIE2022100720221005
905222296 0 013762 856 728bi32_lowregclang_-mcpu=native_-O3_-fomit-frame-pointer_-fwrapv_-Qunused-arguments_-fPIC_-fPIE2022102020221019
910356972 0 016707 832 728bi32gcc_-march=native_-mtune=native_-O2_-fomit-frame-pointer_-fwrapv_-fPIC_-fPIE2022102020221019
910656972 0 017667 832 736bi32gcc_-march=native_-mtune=native_-O3_-fomit-frame-pointer_-fwrapv_-fPIC_-fPIE2022102020221019
932572916 0 013667 840 736bi32_lowreggcc_-march=native_-mtune=native_-O3_-fomit-frame-pointer_-fwrapv_-fPIC_-fPIE2022102020221019
932612900 0 012699 840 728bi32_lowreggcc_-march=native_-mtune=native_-O2_-fomit-frame-pointer_-fwrapv_-fPIC_-fPIE2022102020221019
949416656 0 015355 816 720bi32gcc_-march=native_-mtune=native_-Os_-fomit-frame-pointer_-fwrapv_-fPIC_-fPIE2022102020221019
959171440 0 011203 832 728bi32_lowsizegcc_-march=native_-mtune=native_-O2_-fomit-frame-pointer_-fwrapv_-fPIC_-fPIE2022100720221005
959171440 0 012155 832 736bi32_lowsizegcc_-march=native_-mtune=native_-O3_-fomit-frame-pointer_-fwrapv_-fPIC_-fPIE2022100720221005
964087696 0 017298 824 728bi32gcc_-march=native_-mtune=native_-O_-fomit-frame-pointer_-fwrapv_-fPIC_-fPIE2022102020221019
1128402588 0 011339 824 720bi32_lowreggcc_-march=native_-mtune=native_-Os_-fomit-frame-pointer_-fwrapv_-fPIC_-fPIE2022102020221019
1149381356 0 010043 816 720bi32_lowsizegcc_-march=native_-mtune=native_-Os_-fomit-frame-pointer_-fwrapv_-fPIC_-fPIE2022100720221005
1203423256 0 012922 832 728bi32_lowreggcc_-march=native_-mtune=native_-O_-fomit-frame-pointer_-fwrapv_-fPIC_-fPIE2022102020221019
1210941592 0 011186 824 728bi32_lowsizegcc_-march=native_-mtune=native_-O_-fomit-frame-pointer_-fwrapv_-fPIC_-fPIE2022100720221005
3264054656 0 014011 832 728bi8gcc_-march=native_-mtune=native_-O2_-fomit-frame-pointer_-fwrapv_-fPIC_-fPIE2022102020221019
3624984652 0 014963 832 736bi8gcc_-march=native_-mtune=native_-O3_-fomit-frame-pointer_-fwrapv_-fPIC_-fPIE2022102020221019
4277653332 0 014746 840 728opt8_lowsizeclang_-mcpu=native_-O3_-fomit-frame-pointer_-fwrapv_-Qunused-arguments_-fPIC_-fPIE2022100720221005
4280903864 0 015250 840 728opt8clang_-mcpu=native_-O3_-fomit-frame-pointer_-fwrapv_-Qunused-arguments_-fPIC_-fPIE2022102020221019
4383193856 0 012323 816 720bi8gcc_-march=native_-mtune=native_-Os_-fomit-frame-pointer_-fwrapv_-fPIC_-fPIE2022102020221019
4401665388 0 014602 824 728bi8gcc_-march=native_-mtune=native_-O_-fomit-frame-pointer_-fwrapv_-fPIC_-fPIE2022102020221019
6341154196 0 014836 816 736opt8gcc_-march=native_-mtune=native_-O3_-fomit-frame-pointer_-fwrapv_-fPIC_-fPIE2022102020221019
6374523356 0 013972 816 736opt8_lowsizegcc_-march=native_-mtune=native_-O3_-fomit-frame-pointer_-fwrapv_-fPIC_-fPIE2022100720221005
6745324848 0 015914 848 728bi8clang_-mcpu=native_-O3_-fomit-frame-pointer_-fwrapv_-Qunused-arguments_-fPIC_-fPIE2022102020221019
6884372760 0 012412 816 728opt8gcc_-march=native_-mtune=native_-O2_-fomit-frame-pointer_-fwrapv_-fPIC_-fPIE2022102020221019
6885002528 0 012156 816 728opt8_lowsizegcc_-march=native_-mtune=native_-O2_-fomit-frame-pointer_-fwrapv_-fPIC_-fPIE2022100720221005
7017702140 0 010740 800 720opt8gcc_-march=native_-mtune=native_-Os_-fomit-frame-pointer_-fwrapv_-fPIC_-fPIE2022102020221019
7036022072 0 010644 800 720opt8_lowsizegcc_-march=native_-mtune=native_-Os_-fomit-frame-pointer_-fwrapv_-fPIC_-fPIE2022100720221005
7392912652 0 012163 808 728opt8gcc_-march=native_-mtune=native_-O_-fomit-frame-pointer_-fwrapv_-fPIC_-fPIE2022102020221019
7398822456 0 011955 808 728opt8_lowsizegcc_-march=native_-mtune=native_-O_-fomit-frame-pointer_-fwrapv_-fPIC_-fPIE2022100720221005

Compiler output

Implementation: armv6
Security model: constbranchindex
Compiler: clang -mcpu=native -O3 -fomit-frame-pointer -fwrapv -Qunused-arguments -fPIC -fPIE
hash.c: In file included from hash.c:4:
hash.c: In file included from ./permutations.h:11:
hash.c: ./round.h:96:44: warning: value size does not match register size specified by the constraint and modifier [-Wasm-operand-widths]
hash.c: [x1_h] "+r"(s->w[1][1]), [x2_l] "+r"(s->w[2][0]), [x2_h] "+r"(s->w[2][1]),
hash.c: ^
hash.c: ./round.h:14:12: note: use constraint modifier "w"
hash.c: "eor %[x2_l], %[x2_l], %[C]\n\t"
hash.c: ^~~~~~~
hash.c: %w[x2_l]
hash.c: ./round.h:96:44: warning: value size does not match register size specified by the constraint and modifier [-Wasm-operand-widths]
hash.c: [x1_h] "+r"(s->w[1][1]), [x2_l] "+r"(s->w[2][0]), [x2_h] "+r"(s->w[2][1]),
hash.c: ^
hash.c: ./round.h:14:21: note: use constraint modifier "w"
hash.c: "eor %[x2_l], %[x2_l], %[C]\n\t"
hash.c: ^~~~~~~
hash.c: %w[x2_l]
hash.c: ./round.h:98:41: warning: value size does not match register size specified by the constraint and modifier [-Wasm-operand-widths]
hash.c: [x4_h] "+r"(s->w[4][1]), [C] "+r"(C), [tmp0] "=r"(tmp0), [tmp1] "=r"(tmp1)
hash.c: ^
hash.c: ./round.h:14:30: note: use constraint modifier "w"
hash.c: "eor %[x2_l], %[x2_l], %[C]\n\t"
hash.c: ^~~~
hash.c: %w[C]
hash.c: ./round.h:95:19: warning: value size does not match register size specified by the constraint and modifier [-Wasm-operand-widths]
hash.c: [x0_l] "+r"(s->w[0][0]), [x0_h] "+r"(s->w[0][1]), [x1_l] "+r"(s->w[1][0]),
hash.c: ...

Number of similar (compiler,implementation) pairs: 2, namely:
CompilerImplementations
clang -mcpu=native -O3 -fomit-frame-pointer -fwrapv -Qunused-arguments -fPIC -fPIE armv6 armv6_lowsize

Compiler output

Implementation: armv6
Security model: constbranchindex
Compiler: gcc -march=native -mtune=native -O2 -fomit-frame-pointer -fwrapv -fPIC -fPIE
permutations.c: /tmp/cc0qYzF9.s: Assembler messages:
permutations.c: /tmp/cc0qYzF9.s:124: Error: immediate out of range at operand 3 -- `eor x13,x13,225'
permutations.c: /tmp/cc0qYzF9.s:222: Error: immediate out of range at operand 3 -- `eor x13,x13,210'
permutations.c: /tmp/cc0qYzF9.s:320: Error: immediate out of range at operand 3 -- `eor x13,x13,195'
permutations.c: /tmp/cc0qYzF9.s:418: Error: immediate out of range at operand 3 -- `eor x13,x13,180'
permutations.c: /tmp/cc0qYzF9.s:516: Error: immediate out of range at operand 3 -- `eor x13,x13,165'
permutations.c: /tmp/cc0qYzF9.s:614: Error: immediate out of range at operand 3 -- `eor x13,x13,150'
permutations.c: /tmp/cc0qYzF9.s:712: Error: immediate out of range at operand 3 -- `eor x13,x13,135'
permutations.c: /tmp/cc0qYzF9.s:908: Error: immediate out of range at operand 3 -- `eor x13,x13,105'
permutations.c: /tmp/cc0qYzF9.s:1006: Error: immediate out of range at operand 3 -- `eor x13,x13,90'
permutations.c: /tmp/cc0qYzF9.s:1104: Error: immediate out of range at operand 3 -- `eor x13,x13,75'

Number of similar (compiler,implementation) pairs: 1, namely:
CompilerImplementations
gcc -march=native -mtune=native -O2 -fomit-frame-pointer -fwrapv -fPIC -fPIE armv6

Compiler output

Implementation: armv6
Security model: constbranchindex
Compiler: gcc -march=native -mtune=native -O3 -fomit-frame-pointer -fwrapv -fPIC -fPIE
permutations.c: /tmp/ccEhWrDv.s: Assembler messages:
permutations.c: /tmp/ccEhWrDv.s:124: Error: immediate out of range at operand 3 -- `eor x13,x13,225'
permutations.c: /tmp/ccEhWrDv.s:222: Error: immediate out of range at operand 3 -- `eor x13,x13,210'
permutations.c: /tmp/ccEhWrDv.s:320: Error: immediate out of range at operand 3 -- `eor x13,x13,195'
permutations.c: /tmp/ccEhWrDv.s:418: Error: immediate out of range at operand 3 -- `eor x13,x13,180'
permutations.c: /tmp/ccEhWrDv.s:516: Error: immediate out of range at operand 3 -- `eor x13,x13,165'
permutations.c: /tmp/ccEhWrDv.s:614: Error: immediate out of range at operand 3 -- `eor x13,x13,150'
permutations.c: /tmp/ccEhWrDv.s:712: Error: immediate out of range at operand 3 -- `eor x13,x13,135'
permutations.c: /tmp/ccEhWrDv.s:908: Error: immediate out of range at operand 3 -- `eor x13,x13,105'
permutations.c: /tmp/ccEhWrDv.s:1006: Error: immediate out of range at operand 3 -- `eor x13,x13,90'
permutations.c: /tmp/ccEhWrDv.s:1104: Error: immediate out of range at operand 3 -- `eor x13,x13,75'

Number of similar (compiler,implementation) pairs: 1, namely:
CompilerImplementations
gcc -march=native -mtune=native -O3 -fomit-frame-pointer -fwrapv -fPIC -fPIE armv6

Compiler output

Implementation: armv6
Security model: constbranchindex
Compiler: gcc -march=native -mtune=native -O -fomit-frame-pointer -fwrapv -fPIC -fPIE
permutations.c: /tmp/ccmXPyc0.s: Assembler messages:
permutations.c: /tmp/ccmXPyc0.s:125: Error: immediate out of range at operand 3 -- `eor x13,x13,225'
permutations.c: /tmp/ccmXPyc0.s:223: Error: immediate out of range at operand 3 -- `eor x13,x13,210'
permutations.c: /tmp/ccmXPyc0.s:321: Error: immediate out of range at operand 3 -- `eor x13,x13,195'
permutations.c: /tmp/ccmXPyc0.s:419: Error: immediate out of range at operand 3 -- `eor x13,x13,180'
permutations.c: /tmp/ccmXPyc0.s:517: Error: immediate out of range at operand 3 -- `eor x13,x13,165'
permutations.c: /tmp/ccmXPyc0.s:615: Error: immediate out of range at operand 3 -- `eor x13,x13,150'
permutations.c: /tmp/ccmXPyc0.s:713: Error: immediate out of range at operand 3 -- `eor x13,x13,135'
permutations.c: /tmp/ccmXPyc0.s:909: Error: immediate out of range at operand 3 -- `eor x13,x13,105'
permutations.c: /tmp/ccmXPyc0.s:1007: Error: immediate out of range at operand 3 -- `eor x13,x13,90'
permutations.c: /tmp/ccmXPyc0.s:1105: Error: immediate out of range at operand 3 -- `eor x13,x13,75'

Number of similar (compiler,implementation) pairs: 1, namely:
CompilerImplementations
gcc -march=native -mtune=native -O -fomit-frame-pointer -fwrapv -fPIC -fPIE armv6

Compiler output

Implementation: armv6
Security model: constbranchindex
Compiler: gcc -march=native -mtune=native -Os -fomit-frame-pointer -fwrapv -fPIC -fPIE
permutations.c: /tmp/ccj0KI8F.s: Assembler messages:
permutations.c: /tmp/ccj0KI8F.s:123: Error: immediate out of range at operand 3 -- `eor x13,x13,225'
permutations.c: /tmp/ccj0KI8F.s:221: Error: immediate out of range at operand 3 -- `eor x13,x13,210'
permutations.c: /tmp/ccj0KI8F.s:319: Error: immediate out of range at operand 3 -- `eor x13,x13,195'
permutations.c: /tmp/ccj0KI8F.s:417: Error: immediate out of range at operand 3 -- `eor x13,x13,180'
permutations.c: /tmp/ccj0KI8F.s:515: Error: immediate out of range at operand 3 -- `eor x13,x13,165'
permutations.c: /tmp/ccj0KI8F.s:613: Error: immediate out of range at operand 3 -- `eor x13,x13,150'
permutations.c: /tmp/ccj0KI8F.s:711: Error: immediate out of range at operand 3 -- `eor x13,x13,135'
permutations.c: /tmp/ccj0KI8F.s:907: Error: immediate out of range at operand 3 -- `eor x13,x13,105'
permutations.c: /tmp/ccj0KI8F.s:1005: Error: immediate out of range at operand 3 -- `eor x13,x13,90'
permutations.c: /tmp/ccj0KI8F.s:1103: Error: immediate out of range at operand 3 -- `eor x13,x13,75'

Number of similar (compiler,implementation) pairs: 1, namely:
CompilerImplementations
gcc -march=native -mtune=native -Os -fomit-frame-pointer -fwrapv -fPIC -fPIE armv6

Compiler output

Implementation: armv6_lowsize
Security model: constbranchindex
Compiler: gcc -march=native -mtune=native -O2 -fomit-frame-pointer -fwrapv -fPIC -fPIE
permutations.c: /tmp/ccRAWHdu.s: Assembler messages:
permutations.c: /tmp/ccRAWHdu.s:100: Error: operand 2 must be an integer or stack pointer register -- `sub x1,#15'

Number of similar (compiler,implementation) pairs: 1, namely:
CompilerImplementations
gcc -march=native -mtune=native -O2 -fomit-frame-pointer -fwrapv -fPIC -fPIE armv6_lowsize

Compiler output

Implementation: armv6_lowsize
Security model: constbranchindex
Compiler: gcc -march=native -mtune=native -O3 -fomit-frame-pointer -fwrapv -fPIC -fPIE
permutations.c: /tmp/ccCe4kcR.s: Assembler messages:
permutations.c: /tmp/ccCe4kcR.s:100: Error: operand 2 must be an integer or stack pointer register -- `sub x1,#15'

Number of similar (compiler,implementation) pairs: 1, namely:
CompilerImplementations
gcc -march=native -mtune=native -O3 -fomit-frame-pointer -fwrapv -fPIC -fPIE armv6_lowsize

Compiler output

Implementation: armv6_lowsize
Security model: constbranchindex
Compiler: gcc -march=native -mtune=native -O -fomit-frame-pointer -fwrapv -fPIC -fPIE
permutations.c: /tmp/cc2jxUoA.s: Assembler messages:
permutations.c: /tmp/cc2jxUoA.s:104: Error: operand 2 must be an integer or stack pointer register -- `sub x1,#15'

Number of similar (compiler,implementation) pairs: 1, namely:
CompilerImplementations
gcc -march=native -mtune=native -O -fomit-frame-pointer -fwrapv -fPIC -fPIE armv6_lowsize

Compiler output

Implementation: armv6_lowsize
Security model: constbranchindex
Compiler: gcc -march=native -mtune=native -Os -fomit-frame-pointer -fwrapv -fPIC -fPIE
permutations.c: /tmp/cc9iHB98.s: Assembler messages:
permutations.c: /tmp/cc9iHB98.s:100: Error: operand 2 must be an integer or stack pointer register -- `sub x1,#15'

Number of similar (compiler,implementation) pairs: 1, namely:
CompilerImplementations
gcc -march=native -mtune=native -Os -fomit-frame-pointer -fwrapv -fPIC -fPIE armv6_lowsize

Compiler output

Implementation: armv6m
Security model: constbranchindex
Compiler: clang -mcpu=native -O3 -fomit-frame-pointer -fwrapv -Qunused-arguments -fPIC -fPIE
hash.c: In file included from hash.c:4:
hash.c: In file included from ./permutations.h:11:
hash.c: ./round.h:173:14: error: invalid output constraint '+l' in asm
hash.c: [x0_l] "+l"(s->w[0][0]), [x0_h] "+h"(s->w[0][1]), [x1_l] "+l"(s->w[1][0]),
hash.c: ^
hash.c: ./round.h:338:14: error: invalid output constraint '+l' in asm
hash.c: [x0_l] "+l"(s->w[0][0]), [x0_h] "+h"(s->w[0][1]), [x1_l] "+l"(s->w[1][0]),
hash.c: ^
hash.c: 2 errors generated.

Number of similar (compiler,implementation) pairs: 2, namely:
CompilerImplementations
clang -mcpu=native -O3 -fomit-frame-pointer -fwrapv -Qunused-arguments -fPIC -fPIE armv6m armv6m_lowsize

Compiler output

Implementation: armv6m
Security model: constbranchindex
Compiler: gcc -march=native -mtune=native -O2 -fomit-frame-pointer -fwrapv -fPIC -fPIE
hash.c: In file included from permutations.h:11,
hash.c: from hash.c:4:
hash.c: hash.c: In function 'ascon_absorb':
hash.c: round.h:12:3: error: impossible constraint in 'asm'
hash.c: 12 | __asm__ __volatile__(
hash.c: | ^~~~~~~

Number of similar (compiler,implementation) pairs: 4, namely:
CompilerImplementations
gcc -march=native -mtune=native -O2 -fomit-frame-pointer -fwrapv -fPIC -fPIE armv6m
gcc -march=native -mtune=native -O3 -fomit-frame-pointer -fwrapv -fPIC -fPIE armv6m
gcc -march=native -mtune=native -O -fomit-frame-pointer -fwrapv -fPIC -fPIE armv6m
gcc -march=native -mtune=native -Os -fomit-frame-pointer -fwrapv -fPIC -fPIE armv6m

Compiler output

Implementation: armv6m_lowsize
Security model: constbranchindex
Compiler: gcc -march=native -mtune=native -O2 -fomit-frame-pointer -fwrapv -fPIC -fPIE
permutations.c: In file included from permutations.h:11,
permutations.c: from permutations.c:1:
permutations.c: permutations.c: In function 'P':
permutations.c: round.h:12:3: error: impossible constraint in 'asm'
permutations.c: 12 | __asm__ __volatile__(
permutations.c: | ^~~~~~~

Number of similar (compiler,implementation) pairs: 4, namely:
CompilerImplementations
gcc -march=native -mtune=native -O2 -fomit-frame-pointer -fwrapv -fPIC -fPIE armv6m_lowsize
gcc -march=native -mtune=native -O3 -fomit-frame-pointer -fwrapv -fPIC -fPIE armv6m_lowsize
gcc -march=native -mtune=native -O -fomit-frame-pointer -fwrapv -fPIC -fPIE armv6m_lowsize
gcc -march=native -mtune=native -Os -fomit-frame-pointer -fwrapv -fPIC -fPIE armv6m_lowsize

Compiler output

Implementation: armv7m
Security model: constbranchindex
Compiler: clang -mcpu=native -O3 -fomit-frame-pointer -fwrapv -Qunused-arguments -fPIC -fPIE
hash.c: In file included from hash.c:4:
hash.c: In file included from ./permutations.h:11:
hash.c: ./round.h:92:44: warning: value size does not match register size specified by the constraint and modifier [-Wasm-operand-widths]
hash.c: [x1_h] "+r"(s->w[1][1]), [x2_l] "+r"(s->w[2][0]), [x2_h] "+r"(s->w[2][1]),
hash.c: ^
hash.c: ./round.h:14:12: note: use constraint modifier "w"
hash.c: "eor %[x2_l], %[x2_l], %[C]\n\t"
hash.c: ^~~~~~~
hash.c: %w[x2_l]
hash.c: ./round.h:92:44: warning: value size does not match register size specified by the constraint and modifier [-Wasm-operand-widths]
hash.c: [x1_h] "+r"(s->w[1][1]), [x2_l] "+r"(s->w[2][0]), [x2_h] "+r"(s->w[2][1]),
hash.c: ^
hash.c: ./round.h:14:21: note: use constraint modifier "w"
hash.c: "eor %[x2_l], %[x2_l], %[C]\n\t"
hash.c: ^~~~~~~
hash.c: %w[x2_l]
hash.c: ./round.h:94:41: warning: value size does not match register size specified by the constraint and modifier [-Wasm-operand-widths]
hash.c: [x4_h] "+r"(s->w[4][1]), [C] "+r"(C), [tmp0] "=r"(tmp0), [tmp1] "=r"(tmp1)
hash.c: ^
hash.c: ./round.h:14:30: note: use constraint modifier "w"
hash.c: "eor %[x2_l], %[x2_l], %[C]\n\t"
hash.c: ^~~~
hash.c: %w[C]
hash.c: ./round.h:91:19: warning: value size does not match register size specified by the constraint and modifier [-Wasm-operand-widths]
hash.c: [x0_l] "+r"(s->w[0][0]), [x0_h] "+r"(s->w[0][1]), [x1_l] "+r"(s->w[1][0]),
hash.c: ...

Number of similar (compiler,implementation) pairs: 3, namely:
CompilerImplementations
clang -mcpu=native -O3 -fomit-frame-pointer -fwrapv -Qunused-arguments -fPIC -fPIE armv7m armv7m_lowsize armv7m_small

Compiler output

Implementation: armv7m
Security model: constbranchindex
Compiler: gcc -march=native -mtune=native -O2 -fomit-frame-pointer -fwrapv -fPIC -fPIE
permutations.c: /tmp/ccnlYglm.s: Assembler messages:
permutations.c: /tmp/ccnlYglm.s:122: Error: immediate out of range at operand 3 -- `eor x13,x13,225'
permutations.c: /tmp/ccnlYglm.s:218: Error: immediate out of range at operand 3 -- `eor x13,x13,210'
permutations.c: /tmp/ccnlYglm.s:314: Error: immediate out of range at operand 3 -- `eor x13,x13,195'
permutations.c: /tmp/ccnlYglm.s:410: Error: immediate out of range at operand 3 -- `eor x13,x13,180'
permutations.c: /tmp/ccnlYglm.s:506: Error: immediate out of range at operand 3 -- `eor x13,x13,165'
permutations.c: /tmp/ccnlYglm.s:602: Error: immediate out of range at operand 3 -- `eor x13,x13,150'
permutations.c: /tmp/ccnlYglm.s:698: Error: immediate out of range at operand 3 -- `eor x13,x13,135'
permutations.c: /tmp/ccnlYglm.s:890: Error: immediate out of range at operand 3 -- `eor x13,x13,105'
permutations.c: /tmp/ccnlYglm.s:986: Error: immediate out of range at operand 3 -- `eor x13,x13,90'
permutations.c: /tmp/ccnlYglm.s:1082: Error: immediate out of range at operand 3 -- `eor x13,x13,75'

Number of similar (compiler,implementation) pairs: 1, namely:
CompilerImplementations
gcc -march=native -mtune=native -O2 -fomit-frame-pointer -fwrapv -fPIC -fPIE armv7m

Compiler output

Implementation: armv7m
Security model: constbranchindex
Compiler: gcc -march=native -mtune=native -O3 -fomit-frame-pointer -fwrapv -fPIC -fPIE
permutations.c: /tmp/ccgj6cVl.s: Assembler messages:
permutations.c: /tmp/ccgj6cVl.s:122: Error: immediate out of range at operand 3 -- `eor x13,x13,225'
permutations.c: /tmp/ccgj6cVl.s:218: Error: immediate out of range at operand 3 -- `eor x13,x13,210'
permutations.c: /tmp/ccgj6cVl.s:314: Error: immediate out of range at operand 3 -- `eor x13,x13,195'
permutations.c: /tmp/ccgj6cVl.s:410: Error: immediate out of range at operand 3 -- `eor x13,x13,180'
permutations.c: /tmp/ccgj6cVl.s:506: Error: immediate out of range at operand 3 -- `eor x13,x13,165'
permutations.c: /tmp/ccgj6cVl.s:602: Error: immediate out of range at operand 3 -- `eor x13,x13,150'
permutations.c: /tmp/ccgj6cVl.s:698: Error: immediate out of range at operand 3 -- `eor x13,x13,135'
permutations.c: /tmp/ccgj6cVl.s:890: Error: immediate out of range at operand 3 -- `eor x13,x13,105'
permutations.c: /tmp/ccgj6cVl.s:986: Error: immediate out of range at operand 3 -- `eor x13,x13,90'
permutations.c: /tmp/ccgj6cVl.s:1082: Error: immediate out of range at operand 3 -- `eor x13,x13,75'

Number of similar (compiler,implementation) pairs: 1, namely:
CompilerImplementations
gcc -march=native -mtune=native -O3 -fomit-frame-pointer -fwrapv -fPIC -fPIE armv7m

Compiler output

Implementation: armv7m
Security model: constbranchindex
Compiler: gcc -march=native -mtune=native -O -fomit-frame-pointer -fwrapv -fPIC -fPIE
permutations.c: /tmp/ccRALqV6.s: Assembler messages:
permutations.c: /tmp/ccRALqV6.s:123: Error: immediate out of range at operand 3 -- `eor x13,x13,225'
permutations.c: /tmp/ccRALqV6.s:219: Error: immediate out of range at operand 3 -- `eor x13,x13,210'
permutations.c: /tmp/ccRALqV6.s:315: Error: immediate out of range at operand 3 -- `eor x13,x13,195'
permutations.c: /tmp/ccRALqV6.s:411: Error: immediate out of range at operand 3 -- `eor x13,x13,180'
permutations.c: /tmp/ccRALqV6.s:507: Error: immediate out of range at operand 3 -- `eor x13,x13,165'
permutations.c: /tmp/ccRALqV6.s:603: Error: immediate out of range at operand 3 -- `eor x13,x13,150'
permutations.c: /tmp/ccRALqV6.s:699: Error: immediate out of range at operand 3 -- `eor x13,x13,135'
permutations.c: /tmp/ccRALqV6.s:891: Error: immediate out of range at operand 3 -- `eor x13,x13,105'
permutations.c: /tmp/ccRALqV6.s:987: Error: immediate out of range at operand 3 -- `eor x13,x13,90'
permutations.c: /tmp/ccRALqV6.s:1083: Error: immediate out of range at operand 3 -- `eor x13,x13,75'

Number of similar (compiler,implementation) pairs: 1, namely:
CompilerImplementations
gcc -march=native -mtune=native -O -fomit-frame-pointer -fwrapv -fPIC -fPIE armv7m

Compiler output

Implementation: armv7m
Security model: constbranchindex
Compiler: gcc -march=native -mtune=native -Os -fomit-frame-pointer -fwrapv -fPIC -fPIE
permutations.c: /tmp/ccZCF2LJ.s: Assembler messages:
permutations.c: /tmp/ccZCF2LJ.s:121: Error: immediate out of range at operand 3 -- `eor x13,x13,225'
permutations.c: /tmp/ccZCF2LJ.s:217: Error: immediate out of range at operand 3 -- `eor x13,x13,210'
permutations.c: /tmp/ccZCF2LJ.s:313: Error: immediate out of range at operand 3 -- `eor x13,x13,195'
permutations.c: /tmp/ccZCF2LJ.s:409: Error: immediate out of range at operand 3 -- `eor x13,x13,180'
permutations.c: /tmp/ccZCF2LJ.s:505: Error: immediate out of range at operand 3 -- `eor x13,x13,165'
permutations.c: /tmp/ccZCF2LJ.s:601: Error: immediate out of range at operand 3 -- `eor x13,x13,150'
permutations.c: /tmp/ccZCF2LJ.s:697: Error: immediate out of range at operand 3 -- `eor x13,x13,135'
permutations.c: /tmp/ccZCF2LJ.s:889: Error: immediate out of range at operand 3 -- `eor x13,x13,105'
permutations.c: /tmp/ccZCF2LJ.s:985: Error: immediate out of range at operand 3 -- `eor x13,x13,90'
permutations.c: /tmp/ccZCF2LJ.s:1081: Error: immediate out of range at operand 3 -- `eor x13,x13,75'

Number of similar (compiler,implementation) pairs: 1, namely:
CompilerImplementations
gcc -march=native -mtune=native -Os -fomit-frame-pointer -fwrapv -fPIC -fPIE armv7m

Compiler output

Implementation: armv7m_lowsize
Security model: constbranchindex
Compiler: gcc -march=native -mtune=native -O2 -fomit-frame-pointer -fwrapv -fPIC -fPIE
permutations.c: /tmp/cc6IHJT0.s: Assembler messages:
permutations.c: /tmp/cc6IHJT0.s:96: Error: operand 2 must be an integer or stack pointer register -- `sub x1,#15'

Number of similar (compiler,implementation) pairs: 1, namely:
CompilerImplementations
gcc -march=native -mtune=native -O2 -fomit-frame-pointer -fwrapv -fPIC -fPIE armv7m_lowsize

Compiler output

Implementation: armv7m_lowsize
Security model: constbranchindex
Compiler: gcc -march=native -mtune=native -O3 -fomit-frame-pointer -fwrapv -fPIC -fPIE
permutations.c: /tmp/cc9xrsrk.s: Assembler messages:
permutations.c: /tmp/cc9xrsrk.s:96: Error: operand 2 must be an integer or stack pointer register -- `sub x1,#15'

Number of similar (compiler,implementation) pairs: 1, namely:
CompilerImplementations
gcc -march=native -mtune=native -O3 -fomit-frame-pointer -fwrapv -fPIC -fPIE armv7m_lowsize

Compiler output

Implementation: armv7m_lowsize
Security model: constbranchindex
Compiler: gcc -march=native -mtune=native -O -fomit-frame-pointer -fwrapv -fPIC -fPIE
permutations.c: /tmp/ccYugNd0.s: Assembler messages:
permutations.c: /tmp/ccYugNd0.s:100: Error: operand 2 must be an integer or stack pointer register -- `sub x1,#15'

Number of similar (compiler,implementation) pairs: 1, namely:
CompilerImplementations
gcc -march=native -mtune=native -O -fomit-frame-pointer -fwrapv -fPIC -fPIE armv7m_lowsize

Compiler output

Implementation: armv7m_lowsize
Security model: constbranchindex
Compiler: gcc -march=native -mtune=native -Os -fomit-frame-pointer -fwrapv -fPIC -fPIE
permutations.c: /tmp/ccfEKjt6.s: Assembler messages:
permutations.c: /tmp/ccfEKjt6.s:96: Error: operand 2 must be an integer or stack pointer register -- `sub x1,#15'

Number of similar (compiler,implementation) pairs: 1, namely:
CompilerImplementations
gcc -march=native -mtune=native -Os -fomit-frame-pointer -fwrapv -fPIC -fPIE armv7m_lowsize

Compiler output

Implementation: armv7m_small
Security model: constbranchindex
Compiler: gcc -march=native -mtune=native -O2 -fomit-frame-pointer -fwrapv -fPIC -fPIE
permutations.c: /tmp/ccNHBG1g.s: Assembler messages:
permutations.c: /tmp/ccNHBG1g.s:96: Error: operand 2 must be an integer or stack pointer register -- `sub x1,#15'

Number of similar (compiler,implementation) pairs: 1, namely:
CompilerImplementations
gcc -march=native -mtune=native -O2 -fomit-frame-pointer -fwrapv -fPIC -fPIE armv7m_small

Compiler output

Implementation: armv7m_small
Security model: constbranchindex
Compiler: gcc -march=native -mtune=native -O3 -fomit-frame-pointer -fwrapv -fPIC -fPIE
permutations.c: /tmp/ccXhe1Gx.s: Assembler messages:
permutations.c: /tmp/ccXhe1Gx.s:96: Error: operand 2 must be an integer or stack pointer register -- `sub x1,#15'

Number of similar (compiler,implementation) pairs: 1, namely:
CompilerImplementations
gcc -march=native -mtune=native -O3 -fomit-frame-pointer -fwrapv -fPIC -fPIE armv7m_small

Compiler output

Implementation: armv7m_small
Security model: constbranchindex
Compiler: gcc -march=native -mtune=native -O -fomit-frame-pointer -fwrapv -fPIC -fPIE
permutations.c: /tmp/ccMk0CHb.s: Assembler messages:
permutations.c: /tmp/ccMk0CHb.s:100: Error: operand 2 must be an integer or stack pointer register -- `sub x1,#15'

Number of similar (compiler,implementation) pairs: 1, namely:
CompilerImplementations
gcc -march=native -mtune=native -O -fomit-frame-pointer -fwrapv -fPIC -fPIE armv7m_small

Compiler output

Implementation: armv7m_small
Security model: constbranchindex
Compiler: gcc -march=native -mtune=native -Os -fomit-frame-pointer -fwrapv -fPIC -fPIE
permutations.c: /tmp/cca6ZPxv.s: Assembler messages:
permutations.c: /tmp/cca6ZPxv.s:96: Error: operand 2 must be an integer or stack pointer register -- `sub x1,#15'

Number of similar (compiler,implementation) pairs: 1, namely:
CompilerImplementations
gcc -march=native -mtune=native -Os -fomit-frame-pointer -fwrapv -fPIC -fPIE armv7m_small

Compiler output

Implementation: T:asm_esp32
Security model: timingleaks
Compiler: clang -mcpu=native -O3 -fomit-frame-pointer -fwrapv -Qunused-arguments -fPIC -fPIE
ascon.S: ascon.S:1:10: fatal error: 'xtensa/coreasm.h' file not found
ascon.S: #include <xtensa/coreasm.h>
ascon.S: ^~~~~~~~~~~~~~~~~~
ascon.S: 1 error generated.

Number of similar (compiler,implementation) pairs: 1, namely:
CompilerImplementations
clang -mcpu=native -O3 -fomit-frame-pointer -fwrapv -Qunused-arguments -fPIC -fPIE T:asm_esp32

Compiler output

Implementation: T:asm_esp32
Security model: timingleaks
Compiler: gcc -march=native -mtune=native -O2 -fomit-frame-pointer -fwrapv -fPIC -fPIE
ascon.S: ascon.S:1:10: fatal error: xtensa/coreasm.h: No such file or directory
ascon.S: 1 | #include <xtensa/coreasm.h>
ascon.S: | ^~~~~~~~~~~~~~~~~~
ascon.S: compilation terminated.

Number of similar (compiler,implementation) pairs: 4, namely:
CompilerImplementations
gcc -march=native -mtune=native -O2 -fomit-frame-pointer -fwrapv -fPIC -fPIE T:asm_esp32
gcc -march=native -mtune=native -O3 -fomit-frame-pointer -fwrapv -fPIC -fPIE T:asm_esp32
gcc -march=native -mtune=native -O -fomit-frame-pointer -fwrapv -fPIC -fPIE T:asm_esp32
gcc -march=native -mtune=native -Os -fomit-frame-pointer -fwrapv -fPIC -fPIE T:asm_esp32

Compiler output

Implementation: avr
Security model: constbranchindex
Compiler: clang -mcpu=native -O3 -fomit-frame-pointer -fwrapv -Qunused-arguments -fPIC -fPIE
permutations.S: permutations.S:29:10: fatal error: 'avr/io.h' file not found
permutations.S: #include "avr/io.h"
permutations.S: ^~~~~~~~~~
permutations.S: 1 error generated.

Number of similar (compiler,implementation) pairs: 2, namely:
CompilerImplementations
clang -mcpu=native -O3 -fomit-frame-pointer -fwrapv -Qunused-arguments -fPIC -fPIE avr avr_lowsize

Compiler output

Implementation: avr
Security model: constbranchindex
Compiler: gcc -march=native -mtune=native -O2 -fomit-frame-pointer -fwrapv -fPIC -fPIE
permutations.S: permutations.S:29:10: fatal error: avr/io.h: No such file or directory
permutations.S: 29 | #include "avr/io.h"
permutations.S: | ^~~~~~~~~~
permutations.S: compilation terminated.

Number of similar (compiler,implementation) pairs: 8, namely:
CompilerImplementations
gcc -march=native -mtune=native -O2 -fomit-frame-pointer -fwrapv -fPIC -fPIE avr
gcc -march=native -mtune=native -O3 -fomit-frame-pointer -fwrapv -fPIC -fPIE avr
gcc -march=native -mtune=native -O -fomit-frame-pointer -fwrapv -fPIC -fPIE avr
gcc -march=native -mtune=native -Os -fomit-frame-pointer -fwrapv -fPIC -fPIE avr
gcc -march=native -mtune=native -O2 -fomit-frame-pointer -fwrapv -fPIC -fPIE avr_lowsize
gcc -march=native -mtune=native -O3 -fomit-frame-pointer -fwrapv -fPIC -fPIE avr_lowsize
gcc -march=native -mtune=native -O -fomit-frame-pointer -fwrapv -fPIC -fPIE avr_lowsize
gcc -march=native -mtune=native -Os -fomit-frame-pointer -fwrapv -fPIC -fPIE avr_lowsize

Compiler output

Implementation: bi32_armv6
Security model: constbranchindex
Compiler: clang -mcpu=native -O3 -fomit-frame-pointer -fwrapv -Qunused-arguments -fPIC -fPIE
hash.c: In file included from hash.c:4:
hash.c: In file included from ./permutations.h:11:
hash.c: ./round.h:82:19: warning: value size does not match register size specified by the constraint and modifier [-Wasm-operand-widths]
hash.c: [tmp1] "=r"(tmp1)
hash.c: ^
hash.c: ./round.h:15:13: note: use constraint modifier "w"
hash.c: "ldrb %[tmp1], [%[C]], #1\n\t"
hash.c: ^~~~~~~
hash.c: %w[tmp1]
hash.c: ./round.h:78:19: warning: value size does not match register size specified by the constraint and modifier [-Wasm-operand-widths]
hash.c: [x0_l] "+r"(s->w[0][0]), [x0_h] "+r"(s->w[0][1]), [x1_l] "+r"(s->w[1][0]),
hash.c: ^
hash.c: ./round.h:16:12: note: use constraint modifier "w"
hash.c: "eor %[x0_l], %[x0_l], %[x4_l]\n\t"
hash.c: ^~~~~~~
hash.c: %w[x0_l]
hash.c: ./round.h:78:19: warning: value size does not match register size specified by the constraint and modifier [-Wasm-operand-widths]
hash.c: [x0_l] "+r"(s->w[0][0]), [x0_h] "+r"(s->w[0][1]), [x1_l] "+r"(s->w[1][0]),
hash.c: ^
hash.c: ./round.h:16:21: note: use constraint modifier "w"
hash.c: "eor %[x0_l], %[x0_l], %[x4_l]\n\t"
hash.c: ^~~~~~~
hash.c: %w[x0_l]
hash.c: ./round.h:80:69: warning: value size does not match register size specified by the constraint and modifier [-Wasm-operand-widths]
hash.c: [x3_l] "+r"(s->w[3][0]), [x3_h] "+r"(s->w[3][1]), [x4_l] "+r"(s->w[4][0]),
hash.c: ...

Number of similar (compiler,implementation) pairs: 1, namely:
CompilerImplementations
clang -mcpu=native -O3 -fomit-frame-pointer -fwrapv -Qunused-arguments -fPIC -fPIE bi32_armv6

Compiler output

Implementation: bi32_armv6
Security model: constbranchindex
Compiler: gcc -march=native -mtune=native -O2 -fomit-frame-pointer -fwrapv -fPIC -fPIE
permutations.c: /tmp/cc1AQXEk.s: Assembler messages:
permutations.c: /tmp/cc1AQXEk.s:105: Error: immediate out of range at operand 3 -- `eor x13,x13,9'
permutations.c: /tmp/cc1AQXEk.s:201: Error: immediate out of range at operand 3 -- `eor x8,x8,9'
permutations.c: /tmp/cc1AQXEk.s:263: Error: immediate out of range at operand 3 -- `eor x13,x13,9'
permutations.c: /tmp/cc1AQXEk.s:280: Error: immediate out of range at operand 3 -- `eor x6,x6,9'
permutations.c: /tmp/cc1AQXEk.s:517: Error: immediate out of range at operand 3 -- `eor x6,x6,9'
permutations.c: /tmp/cc1AQXEk.s:596: Error: immediate out of range at operand 3 -- `eor x7,x7,9'
permutations.c: /tmp/cc1AQXEk.s:737: Error: immediate out of range at operand 3 -- `eor x13,x13,9'
permutations.c: /tmp/cc1AQXEk.s:895: Error: immediate out of range at operand 3 -- `eor x13,x13,9'

Number of similar (compiler,implementation) pairs: 1, namely:
CompilerImplementations
gcc -march=native -mtune=native -O2 -fomit-frame-pointer -fwrapv -fPIC -fPIE bi32_armv6

Compiler output

Implementation: bi32_armv6
Security model: constbranchindex
Compiler: gcc -march=native -mtune=native -O3 -fomit-frame-pointer -fwrapv -fPIC -fPIE
permutations.c: /tmp/cciyRVRr.s: Assembler messages:
permutations.c: /tmp/cciyRVRr.s:105: Error: immediate out of range at operand 3 -- `eor x13,x13,9'
permutations.c: /tmp/cciyRVRr.s:201: Error: immediate out of range at operand 3 -- `eor x8,x8,9'
permutations.c: /tmp/cciyRVRr.s:263: Error: immediate out of range at operand 3 -- `eor x13,x13,9'
permutations.c: /tmp/cciyRVRr.s:280: Error: immediate out of range at operand 3 -- `eor x6,x6,9'
permutations.c: /tmp/cciyRVRr.s:517: Error: immediate out of range at operand 3 -- `eor x6,x6,9'
permutations.c: /tmp/cciyRVRr.s:596: Error: immediate out of range at operand 3 -- `eor x7,x7,9'
permutations.c: /tmp/cciyRVRr.s:737: Error: immediate out of range at operand 3 -- `eor x13,x13,9'
permutations.c: /tmp/cciyRVRr.s:895: Error: immediate out of range at operand 3 -- `eor x13,x13,9'

Number of similar (compiler,implementation) pairs: 1, namely:
CompilerImplementations
gcc -march=native -mtune=native -O3 -fomit-frame-pointer -fwrapv -fPIC -fPIE bi32_armv6

Compiler output

Implementation: bi32_armv6
Security model: constbranchindex
Compiler: gcc -march=native -mtune=native -O -fomit-frame-pointer -fwrapv -fPIC -fPIE
permutations.c: /tmp/cc47idMl.s: Assembler messages:
permutations.c: /tmp/cc47idMl.s:106: Error: immediate out of range at operand 3 -- `eor x13,x13,9'
permutations.c: /tmp/cc47idMl.s:202: Error: immediate out of range at operand 3 -- `eor x8,x8,9'
permutations.c: /tmp/cc47idMl.s:264: Error: immediate out of range at operand 3 -- `eor x13,x13,9'
permutations.c: /tmp/cc47idMl.s:281: Error: immediate out of range at operand 3 -- `eor x8,x8,9'
permutations.c: /tmp/cc47idMl.s:518: Error: immediate out of range at operand 3 -- `eor x8,x8,9'
permutations.c: /tmp/cc47idMl.s:597: Error: immediate out of range at operand 3 -- `eor x8,x8,9'
permutations.c: /tmp/cc47idMl.s:738: Error: immediate out of range at operand 3 -- `eor x13,x13,9'
permutations.c: /tmp/cc47idMl.s:896: Error: immediate out of range at operand 3 -- `eor x13,x13,9'

Number of similar (compiler,implementation) pairs: 1, namely:
CompilerImplementations
gcc -march=native -mtune=native -O -fomit-frame-pointer -fwrapv -fPIC -fPIE bi32_armv6

Compiler output

Implementation: bi32_armv6
Security model: constbranchindex
Compiler: gcc -march=native -mtune=native -Os -fomit-frame-pointer -fwrapv -fPIC -fPIE
permutations.c: /tmp/cczwQoNT.s: Assembler messages:
permutations.c: /tmp/cczwQoNT.s:104: Error: immediate out of range at operand 3 -- `eor x13,x13,9'
permutations.c: /tmp/cczwQoNT.s:200: Error: immediate out of range at operand 3 -- `eor x8,x8,9'
permutations.c: /tmp/cczwQoNT.s:262: Error: immediate out of range at operand 3 -- `eor x13,x13,9'
permutations.c: /tmp/cczwQoNT.s:279: Error: immediate out of range at operand 3 -- `eor x8,x8,9'
permutations.c: /tmp/cczwQoNT.s:516: Error: immediate out of range at operand 3 -- `eor x8,x8,9'
permutations.c: /tmp/cczwQoNT.s:595: Error: immediate out of range at operand 3 -- `eor x8,x8,9'
permutations.c: /tmp/cczwQoNT.s:736: Error: immediate out of range at operand 3 -- `eor x13,x13,9'
permutations.c: /tmp/cczwQoNT.s:894: Error: immediate out of range at operand 3 -- `eor x13,x13,9'

Number of similar (compiler,implementation) pairs: 1, namely:
CompilerImplementations
gcc -march=native -mtune=native -Os -fomit-frame-pointer -fwrapv -fPIC -fPIE bi32_armv6

Compiler output

Implementation: bi32_armv6m
Security model: constbranchindex
Compiler: clang -mcpu=native -O3 -fomit-frame-pointer -fwrapv -Qunused-arguments -fPIC -fPIE
hash.c: In file included from hash.c:4:
hash.c: In file included from ./permutations.h:11:
hash.c: ./round.h:164:14: error: invalid output constraint '+l' in asm
hash.c: [x0_l] "+l"(s->w[0][0]), [x0_h] "+h"(s->w[0][1]), [x1_l] "+l"(s->w[1][0]),
hash.c: ^
hash.c: ./round.h:314:14: error: invalid output constraint '+l' in asm
hash.c: [x0_l] "+l"(s->w[0][0]), [x0_h] "+h"(s->w[0][1]), [x1_l] "+l"(s->w[1][0]),
hash.c: ^
hash.c: 2 errors generated.

Number of similar (compiler,implementation) pairs: 1, namely:
CompilerImplementations
clang -mcpu=native -O3 -fomit-frame-pointer -fwrapv -Qunused-arguments -fPIC -fPIE bi32_armv6m

Compiler output

Implementation: bi32_armv6m
Security model: constbranchindex
Compiler: gcc -march=native -mtune=native -O2 -fomit-frame-pointer -fwrapv -fPIC -fPIE
hash.c: In file included from permutations.h:11,
hash.c: from hash.c:4:
hash.c: hash.c: In function 'ascon_absorb':
hash.c: round.h:13:3: error: impossible constraint in 'asm'
hash.c: 13 | __asm__ __volatile__(
hash.c: | ^~~~~~~

Number of similar (compiler,implementation) pairs: 4, namely:
CompilerImplementations
gcc -march=native -mtune=native -O2 -fomit-frame-pointer -fwrapv -fPIC -fPIE bi32_armv6m
gcc -march=native -mtune=native -O3 -fomit-frame-pointer -fwrapv -fPIC -fPIE bi32_armv6m
gcc -march=native -mtune=native -O -fomit-frame-pointer -fwrapv -fPIC -fPIE bi32_armv6m
gcc -march=native -mtune=native -Os -fomit-frame-pointer -fwrapv -fPIC -fPIE bi32_armv6m

Compiler output

Implementation: bi32_armv7m
Security model: constbranchindex
Compiler: clang -mcpu=native -O3 -fomit-frame-pointer -fwrapv -Qunused-arguments -fPIC -fPIE
hash.c: In file included from hash.c:4:
hash.c: In file included from ./permutations.h:11:
hash.c: ./round.h:78:19: warning: value size does not match register size specified by the constraint and modifier [-Wasm-operand-widths]
hash.c: [tmp1] "=r"(tmp1)
hash.c: ^
hash.c: ./round.h:15:13: note: use constraint modifier "w"
hash.c: "ldrb %[tmp1], [%[C]], #1\n\t"
hash.c: ^~~~~~~
hash.c: %w[tmp1]
hash.c: ./round.h:74:19: warning: value size does not match register size specified by the constraint and modifier [-Wasm-operand-widths]
hash.c: [x0_l] "+r"(s->w[0][0]), [x0_h] "+r"(s->w[0][1]), [x1_l] "+r"(s->w[1][0]),
hash.c: ^
hash.c: ./round.h:16:12: note: use constraint modifier "w"
hash.c: "eor %[x0_l], %[x0_l], %[x4_l]\n\t"
hash.c: ^~~~~~~
hash.c: %w[x0_l]
hash.c: ./round.h:74:19: warning: value size does not match register size specified by the constraint and modifier [-Wasm-operand-widths]
hash.c: [x0_l] "+r"(s->w[0][0]), [x0_h] "+r"(s->w[0][1]), [x1_l] "+r"(s->w[1][0]),
hash.c: ^
hash.c: ./round.h:16:21: note: use constraint modifier "w"
hash.c: "eor %[x0_l], %[x0_l], %[x4_l]\n\t"
hash.c: ^~~~~~~
hash.c: %w[x0_l]
hash.c: ./round.h:76:69: warning: value size does not match register size specified by the constraint and modifier [-Wasm-operand-widths]
hash.c: [x3_l] "+r"(s->w[3][0]), [x3_h] "+r"(s->w[3][1]), [x4_l] "+r"(s->w[4][0]),
hash.c: ...

Number of similar (compiler,implementation) pairs: 2, namely:
CompilerImplementations
clang -mcpu=native -O3 -fomit-frame-pointer -fwrapv -Qunused-arguments -fPIC -fPIE bi32_armv7m bi32_armv7m_small

Compiler output

Implementation: bi32_armv7m
Security model: constbranchindex
Compiler: gcc -march=native -mtune=native -O2 -fomit-frame-pointer -fwrapv -fPIC -fPIE
hash.c: /tmp/cc0QDRUi.s: Assembler messages:
hash.c: /tmp/cc0QDRUi.s:220: Error: immediate out of range at operand 3 -- `eor x15,x15,9'
hash.c: /tmp/cc0QDRUi.s:313: Error: immediate out of range at operand 3 -- `eor x0,x0,9'
hash.c: /tmp/cc0QDRUi.s:374: Error: immediate out of range at operand 3 -- `eor x15,x15,9'
hash.c: /tmp/cc0QDRUi.s:390: Error: immediate out of range at operand 3 -- `eor x8,x8,9'
hash.c: /tmp/cc0QDRUi.s:621: Error: immediate out of range at operand 3 -- `eor x0,x0,9'
hash.c: /tmp/cc0QDRUi.s:698: Error: immediate out of range at operand 3 -- `eor x8,x8,9'
hash.c: /tmp/cc0QDRUi.s:836: Error: immediate out of range at operand 3 -- `eor x15,x15,9'
hash.c: /tmp/cc0QDRUi.s:969: Error: immediate out of range at operand 3 -- `eor x5,x5,9'
hash.c: /tmp/cc0QDRUi.s:1234: Error: immediate out of range at operand 3 -- `eor x15,x15,9'
hash.c: /tmp/cc0QDRUi.s:1327: Error: immediate out of range at operand 3 -- `eor x7,x7,9'
hash.c: /tmp/cc0QDRUi.s:1388: Error: immediate out of range at operand 3 -- `eor x15,x15,9'
hash.c: /tmp/cc0QDRUi.s:1404: Error: immediate out of range at operand 3 -- `eor x9,x9,9'
hash.c: /tmp/cc0QDRUi.s:1635: Error: immediate out of range at operand 3 -- `eor x9,x9,9'
hash.c: /tmp/cc0QDRUi.s:1712: Error: immediate out of range at operand 3 -- `eor x8,x8,9'
hash.c: /tmp/cc0QDRUi.s:1850: Error: immediate out of range at operand 3 -- `eor x15,x15,9'
hash.c: /tmp/cc0QDRUi.s:1983: Error: immediate out of range at operand 3 -- `eor x4,x4,9'
hash.c: /tmp/cc0QDRUi.s:2195: Error: immediate out of range at operand 3 -- `eor x18,x18,9'
hash.c: /tmp/cc0QDRUi.s:2288: Error: immediate out of range at operand 3 -- `eor x8,x8,9'
hash.c: /tmp/cc0QDRUi.s:2349: Error: immediate out of range at operand 3 -- `eor x18,x18,9'
hash.c: /tmp/cc0QDRUi.s:2365: Error: immediate out of range at operand 3 -- `eor x8,x8,9'
hash.c: /tmp/cc0QDRUi.s:2596: Error: immediate out of range at operand 3 -- `eor x8,x8,9'
hash.c: /tmp/cc0QDRUi.s:2673: Error: immediate out of range at operand 3 -- `eor x8,x8,9'
hash.c: /tmp/cc0QDRUi.s:2811: Error: immediate out of range at operand 3 -- `eor x18,x18,9'
hash.c: /tmp/cc0QDRUi.s:2944: Error: immediate out of range at operand 3 -- `eor x4,x4,9'
hash.c: ...

Number of similar (compiler,implementation) pairs: 1, namely:
CompilerImplementations
gcc -march=native -mtune=native -O2 -fomit-frame-pointer -fwrapv -fPIC -fPIE bi32_armv7m

Compiler output

Implementation: bi32_armv7m
Security model: constbranchindex
Compiler: gcc -march=native -mtune=native -O3 -fomit-frame-pointer -fwrapv -fPIC -fPIE
hash.c: /tmp/cciOUGKW.s: Assembler messages:
hash.c: /tmp/cciOUGKW.s:220: Error: immediate out of range at operand 3 -- `eor x15,x15,9'
hash.c: /tmp/cciOUGKW.s:313: Error: immediate out of range at operand 3 -- `eor x0,x0,9'
hash.c: /tmp/cciOUGKW.s:374: Error: immediate out of range at operand 3 -- `eor x15,x15,9'
hash.c: /tmp/cciOUGKW.s:390: Error: immediate out of range at operand 3 -- `eor x8,x8,9'
hash.c: /tmp/cciOUGKW.s:621: Error: immediate out of range at operand 3 -- `eor x0,x0,9'
hash.c: /tmp/cciOUGKW.s:698: Error: immediate out of range at operand 3 -- `eor x8,x8,9'
hash.c: /tmp/cciOUGKW.s:836: Error: immediate out of range at operand 3 -- `eor x15,x15,9'
hash.c: /tmp/cciOUGKW.s:969: Error: immediate out of range at operand 3 -- `eor x5,x5,9'
hash.c: /tmp/cciOUGKW.s:1234: Error: immediate out of range at operand 3 -- `eor x15,x15,9'
hash.c: /tmp/cciOUGKW.s:1327: Error: immediate out of range at operand 3 -- `eor x7,x7,9'
hash.c: /tmp/cciOUGKW.s:1388: Error: immediate out of range at operand 3 -- `eor x15,x15,9'
hash.c: /tmp/cciOUGKW.s:1404: Error: immediate out of range at operand 3 -- `eor x9,x9,9'
hash.c: /tmp/cciOUGKW.s:1635: Error: immediate out of range at operand 3 -- `eor x9,x9,9'
hash.c: /tmp/cciOUGKW.s:1712: Error: immediate out of range at operand 3 -- `eor x8,x8,9'
hash.c: /tmp/cciOUGKW.s:1850: Error: immediate out of range at operand 3 -- `eor x15,x15,9'
hash.c: /tmp/cciOUGKW.s:1983: Error: immediate out of range at operand 3 -- `eor x4,x4,9'
hash.c: /tmp/cciOUGKW.s:2195: Error: immediate out of range at operand 3 -- `eor x18,x18,9'
hash.c: /tmp/cciOUGKW.s:2288: Error: immediate out of range at operand 3 -- `eor x8,x8,9'
hash.c: /tmp/cciOUGKW.s:2349: Error: immediate out of range at operand 3 -- `eor x18,x18,9'
hash.c: /tmp/cciOUGKW.s:2365: Error: immediate out of range at operand 3 -- `eor x8,x8,9'
hash.c: /tmp/cciOUGKW.s:2596: Error: immediate out of range at operand 3 -- `eor x8,x8,9'
hash.c: /tmp/cciOUGKW.s:2673: Error: immediate out of range at operand 3 -- `eor x8,x8,9'
hash.c: /tmp/cciOUGKW.s:2811: Error: immediate out of range at operand 3 -- `eor x18,x18,9'
hash.c: /tmp/cciOUGKW.s:2944: Error: immediate out of range at operand 3 -- `eor x4,x4,9'
hash.c: ...

Number of similar (compiler,implementation) pairs: 1, namely:
CompilerImplementations
gcc -march=native -mtune=native -O3 -fomit-frame-pointer -fwrapv -fPIC -fPIE bi32_armv7m

Compiler output

Implementation: bi32_armv7m
Security model: constbranchindex
Compiler: gcc -march=native -mtune=native -O -fomit-frame-pointer -fwrapv -fPIC -fPIE
hash.c: /tmp/ccHpFt2z.s: Assembler messages:
hash.c: /tmp/ccHpFt2z.s:244: Error: immediate out of range at operand 3 -- `eor x17,x17,9'
hash.c: /tmp/ccHpFt2z.s:337: Error: immediate out of range at operand 3 -- `eor x8,x8,9'
hash.c: /tmp/ccHpFt2z.s:398: Error: immediate out of range at operand 3 -- `eor x17,x17,9'
hash.c: /tmp/ccHpFt2z.s:414: Error: immediate out of range at operand 3 -- `eor x8,x8,9'
hash.c: /tmp/ccHpFt2z.s:645: Error: immediate out of range at operand 3 -- `eor x8,x8,9'
hash.c: /tmp/ccHpFt2z.s:722: Error: immediate out of range at operand 3 -- `eor x8,x8,9'
hash.c: /tmp/ccHpFt2z.s:860: Error: immediate out of range at operand 3 -- `eor x17,x17,9'
hash.c: /tmp/ccHpFt2z.s:993: Error: immediate out of range at operand 3 -- `eor x5,x5,9'
hash.c: /tmp/ccHpFt2z.s:1285: Error: immediate out of range at operand 3 -- `eor x15,x15,9'
hash.c: /tmp/ccHpFt2z.s:1378: Error: immediate out of range at operand 3 -- `eor x9,x9,9'
hash.c: /tmp/ccHpFt2z.s:1439: Error: immediate out of range at operand 3 -- `eor x15,x15,9'
hash.c: /tmp/ccHpFt2z.s:1455: Error: immediate out of range at operand 3 -- `eor x9,x9,9'
hash.c: /tmp/ccHpFt2z.s:1686: Error: immediate out of range at operand 3 -- `eor x9,x9,9'
hash.c: /tmp/ccHpFt2z.s:1763: Error: immediate out of range at operand 3 -- `eor x9,x9,9'
hash.c: /tmp/ccHpFt2z.s:1901: Error: immediate out of range at operand 3 -- `eor x15,x15,9'
hash.c: /tmp/ccHpFt2z.s:2034: Error: immediate out of range at operand 3 -- `eor x4,x4,9'
hash.c: /tmp/ccHpFt2z.s:2269: Error: immediate out of range at operand 3 -- `eor x20,x20,9'
hash.c: /tmp/ccHpFt2z.s:2362: Error: immediate out of range at operand 3 -- `eor x10,x10,9'
hash.c: /tmp/ccHpFt2z.s:2423: Error: immediate out of range at operand 3 -- `eor x20,x20,9'
hash.c: /tmp/ccHpFt2z.s:2439: Error: immediate out of range at operand 3 -- `eor x10,x10,9'
hash.c: /tmp/ccHpFt2z.s:2670: Error: immediate out of range at operand 3 -- `eor x10,x10,9'
hash.c: /tmp/ccHpFt2z.s:2747: Error: immediate out of range at operand 3 -- `eor x10,x10,9'
hash.c: /tmp/ccHpFt2z.s:2885: Error: immediate out of range at operand 3 -- `eor x19,x19,9'
hash.c: /tmp/ccHpFt2z.s:3018: Error: immediate out of range at operand 3 -- `eor x5,x5,9'
hash.c: ...

Number of similar (compiler,implementation) pairs: 1, namely:
CompilerImplementations
gcc -march=native -mtune=native -O -fomit-frame-pointer -fwrapv -fPIC -fPIE bi32_armv7m

Compiler output

Implementation: bi32_armv7m
Security model: constbranchindex
Compiler: gcc -march=native -mtune=native -Os -fomit-frame-pointer -fwrapv -fPIC -fPIE
hash.c: /tmp/cc8xCaiT.s: Assembler messages:
hash.c: /tmp/cc8xCaiT.s:275: Error: immediate out of range at operand 3 -- `eor x15,x15,9'
hash.c: /tmp/cc8xCaiT.s:368: Error: immediate out of range at operand 3 -- `eor x9,x9,9'
hash.c: /tmp/cc8xCaiT.s:429: Error: immediate out of range at operand 3 -- `eor x15,x15,9'
hash.c: /tmp/cc8xCaiT.s:445: Error: immediate out of range at operand 3 -- `eor x9,x9,9'
hash.c: /tmp/cc8xCaiT.s:676: Error: immediate out of range at operand 3 -- `eor x9,x9,9'
hash.c: /tmp/cc8xCaiT.s:753: Error: immediate out of range at operand 3 -- `eor x9,x9,9'
hash.c: /tmp/cc8xCaiT.s:891: Error: immediate out of range at operand 3 -- `eor x15,x15,9'
hash.c: /tmp/cc8xCaiT.s:1024: Error: immediate out of range at operand 3 -- `eor x6,x6,9'
hash.c: /tmp/cc8xCaiT.s:1213: Error: immediate out of range at operand 3 -- `eor x15,x15,9'
hash.c: /tmp/cc8xCaiT.s:1306: Error: immediate out of range at operand 3 -- `eor x10,x10,9'
hash.c: /tmp/cc8xCaiT.s:1367: Error: immediate out of range at operand 3 -- `eor x15,x15,9'
hash.c: /tmp/cc8xCaiT.s:1383: Error: immediate out of range at operand 3 -- `eor x10,x10,9'
hash.c: /tmp/cc8xCaiT.s:1614: Error: immediate out of range at operand 3 -- `eor x10,x10,9'
hash.c: /tmp/cc8xCaiT.s:1691: Error: immediate out of range at operand 3 -- `eor x10,x10,9'
hash.c: /tmp/cc8xCaiT.s:1829: Error: immediate out of range at operand 3 -- `eor x15,x15,9'
hash.c: /tmp/cc8xCaiT.s:1962: Error: immediate out of range at operand 3 -- `eor x5,x5,9'
hash.c: /tmp/cc8xCaiT.s:2172: Error: immediate out of range at operand 3 -- `eor x18,x18,9'
hash.c: /tmp/cc8xCaiT.s:2265: Error: immediate out of range at operand 3 -- `eor x10,x10,9'
hash.c: /tmp/cc8xCaiT.s:2326: Error: immediate out of range at operand 3 -- `eor x18,x18,9'
hash.c: /tmp/cc8xCaiT.s:2342: Error: immediate out of range at operand 3 -- `eor x10,x10,9'
hash.c: /tmp/cc8xCaiT.s:2573: Error: immediate out of range at operand 3 -- `eor x10,x10,9'
hash.c: /tmp/cc8xCaiT.s:2650: Error: immediate out of range at operand 3 -- `eor x10,x10,9'
hash.c: /tmp/cc8xCaiT.s:2788: Error: immediate out of range at operand 3 -- `eor x18,x18,9'
hash.c: /tmp/cc8xCaiT.s:2921: Error: immediate out of range at operand 3 -- `eor x5,x5,9'
hash.c: ...

Number of similar (compiler,implementation) pairs: 1, namely:
CompilerImplementations
gcc -march=native -mtune=native -Os -fomit-frame-pointer -fwrapv -fPIC -fPIE bi32_armv7m

Compiler output

Implementation: bi32_armv7m_small
Security model: constbranchindex
Compiler: gcc -march=native -mtune=native -O2 -fomit-frame-pointer -fwrapv -fPIC -fPIE
permutations.c: /tmp/ccceRABc.s: Assembler messages:
permutations.c: /tmp/ccceRABc.s:26: Error: operand mismatch -- `ldrb x14,[x1],#1'
permutations.c: /tmp/ccceRABc.s:26: Info: did you mean this?
permutations.c: /tmp/ccceRABc.s:26: Info: ldrb w14, [x1], #1
permutations.c: /tmp/ccceRABc.s:41: Error: operand mismatch -- `ldrb x14,[x1],#1'
permutations.c: /tmp/ccceRABc.s:41: Info: did you mean this?
permutations.c: /tmp/ccceRABc.s:41: Info: ldrb w14, [x1], #1

Number of similar (compiler,implementation) pairs: 1, namely:
CompilerImplementations
gcc -march=native -mtune=native -O2 -fomit-frame-pointer -fwrapv -fPIC -fPIE bi32_armv7m_small

Compiler output

Implementation: bi32_armv7m_small
Security model: constbranchindex
Compiler: gcc -march=native -mtune=native -O3 -fomit-frame-pointer -fwrapv -fPIC -fPIE
permutations.c: /tmp/ccKtL200.s: Assembler messages:
permutations.c: /tmp/ccKtL200.s:26: Error: operand mismatch -- `ldrb x14,[x1],#1'
permutations.c: /tmp/ccKtL200.s:26: Info: did you mean this?
permutations.c: /tmp/ccKtL200.s:26: Info: ldrb w14, [x1], #1
permutations.c: /tmp/ccKtL200.s:41: Error: operand mismatch -- `ldrb x14,[x1],#1'
permutations.c: /tmp/ccKtL200.s:41: Info: did you mean this?
permutations.c: /tmp/ccKtL200.s:41: Info: ldrb w14, [x1], #1

Number of similar (compiler,implementation) pairs: 1, namely:
CompilerImplementations
gcc -march=native -mtune=native -O3 -fomit-frame-pointer -fwrapv -fPIC -fPIE bi32_armv7m_small

Compiler output

Implementation: bi32_armv7m_small
Security model: constbranchindex
Compiler: gcc -march=native -mtune=native -O -fomit-frame-pointer -fwrapv -fPIC -fPIE
permutations.c: /tmp/ccpXOlA2.s: Assembler messages:
permutations.c: /tmp/ccpXOlA2.s:30: Error: operand mismatch -- `ldrb x14,[x1],#1'
permutations.c: /tmp/ccpXOlA2.s:30: Info: did you mean this?
permutations.c: /tmp/ccpXOlA2.s:30: Info: ldrb w14, [x1], #1
permutations.c: /tmp/ccpXOlA2.s:45: Error: operand mismatch -- `ldrb x14,[x1],#1'
permutations.c: /tmp/ccpXOlA2.s:45: Info: did you mean this?
permutations.c: /tmp/ccpXOlA2.s:45: Info: ldrb w14, [x1], #1

Number of similar (compiler,implementation) pairs: 1, namely:
CompilerImplementations
gcc -march=native -mtune=native -O -fomit-frame-pointer -fwrapv -fPIC -fPIE bi32_armv7m_small

Compiler output

Implementation: bi32_armv7m_small
Security model: constbranchindex
Compiler: gcc -march=native -mtune=native -Os -fomit-frame-pointer -fwrapv -fPIC -fPIE
permutations.c: /tmp/cci1CQ1u.s: Assembler messages:
permutations.c: /tmp/cci1CQ1u.s:25: Error: operand mismatch -- `ldrb x14,[x1],#1'
permutations.c: /tmp/cci1CQ1u.s:25: Info: did you mean this?
permutations.c: /tmp/cci1CQ1u.s:25: Info: ldrb w14, [x1], #1
permutations.c: /tmp/cci1CQ1u.s:40: Error: operand mismatch -- `ldrb x14,[x1],#1'
permutations.c: /tmp/cci1CQ1u.s:40: Info: did you mean this?
permutations.c: /tmp/cci1CQ1u.s:40: Info: ldrb w14, [x1], #1

Number of similar (compiler,implementation) pairs: 1, namely:
CompilerImplementations
gcc -march=native -mtune=native -Os -fomit-frame-pointer -fwrapv -fPIC -fPIE bi32_armv7m_small

Compiler output

Implementation: T:esp32
Security model: timingleaks
Compiler: clang -mcpu=native -O3 -fomit-frame-pointer -fwrapv -Qunused-arguments -fPIC -fPIE
try.c: /usr/bin/ld: /tmp/try-small-abe42e.o: in function `doit':
try.c: try-small.c:(.text+0x...): undefined reference to `crypto_hash_asconhashv12_esp32_timingleaks'
try.c: /usr/bin/ld: /tmp/try-small-abe42e.o: in function `test':
try.c: try-small.c:(.text+0x...): undefined reference to `crypto_hash_asconhashv12_esp32_timingleaks'
try.c: /usr/bin/ld: try-small.c:(.text+0x...): undefined reference to `crypto_hash_asconhashv12_esp32_timingleaks'
try.c: /usr/bin/ld: try-small.c:(.text+0x...): undefined reference to `crypto_hash_asconhashv12_esp32_timingleaks'
try.c: clang: error: linker command failed with exit code 1 (use -v to see invocation)

Number of similar (compiler,implementation) pairs: 1, namely:
CompilerImplementations
clang -mcpu=native -O3 -fomit-frame-pointer -fwrapv -Qunused-arguments -fPIC -fPIE T:esp32

Compiler output

Implementation: T:esp32
Security model: timingleaks
Compiler: gcc -march=native -mtune=native -O2 -fomit-frame-pointer -fwrapv -fPIC -fPIE
try.c: /usr/bin/ld: /tmp/cc86Di1n.o: in function `doit':
try.c: try-small.c:(.text+0x...): undefined reference to `crypto_hash_asconhashv12_esp32_timingleaks'
try.c: /usr/bin/ld: /tmp/cc86Di1n.o: in function `test':
try.c: try-small.c:(.text+0x...): undefined reference to `crypto_hash_asconhashv12_esp32_timingleaks'
try.c: /usr/bin/ld: try-small.c:(.text+0x...): undefined reference to `crypto_hash_asconhashv12_esp32_timingleaks'
try.c: /usr/bin/ld: try-small.c:(.text+0x...): undefined reference to `crypto_hash_asconhashv12_esp32_timingleaks'
try.c: collect2: error: ld returned 1 exit status

Number of similar (compiler,implementation) pairs: 1, namely:
CompilerImplementations
gcc -march=native -mtune=native -O2 -fomit-frame-pointer -fwrapv -fPIC -fPIE T:esp32

Compiler output

Implementation: T:esp32
Security model: timingleaks
Compiler: gcc -march=native -mtune=native -O3 -fomit-frame-pointer -fwrapv -fPIC -fPIE
try.c: /usr/bin/ld: /tmp/ccku4UgY.o: in function `doit':
try.c: try-small.c:(.text+0x...): undefined reference to `crypto_hash_asconhashv12_esp32_timingleaks'
try.c: /usr/bin/ld: /tmp/ccku4UgY.o: in function `test':
try.c: try-small.c:(.text+0x...): undefined reference to `crypto_hash_asconhashv12_esp32_timingleaks'
try.c: /usr/bin/ld: try-small.c:(.text+0x...): undefined reference to `crypto_hash_asconhashv12_esp32_timingleaks'
try.c: /usr/bin/ld: try-small.c:(.text+0x...): undefined reference to `crypto_hash_asconhashv12_esp32_timingleaks'
try.c: collect2: error: ld returned 1 exit status

Number of similar (compiler,implementation) pairs: 1, namely:
CompilerImplementations
gcc -march=native -mtune=native -O3 -fomit-frame-pointer -fwrapv -fPIC -fPIE T:esp32

Compiler output

Implementation: T:esp32
Security model: timingleaks
Compiler: gcc -march=native -mtune=native -O -fomit-frame-pointer -fwrapv -fPIC -fPIE
try.c: /usr/bin/ld: /tmp/ccHwRLvK.o: in function `doit':
try.c: try-small.c:(.text+0x...): undefined reference to `crypto_hash_asconhashv12_esp32_timingleaks'
try.c: /usr/bin/ld: /tmp/ccHwRLvK.o: in function `test':
try.c: try-small.c:(.text+0x...): undefined reference to `crypto_hash_asconhashv12_esp32_timingleaks'
try.c: /usr/bin/ld: try-small.c:(.text+0x...): undefined reference to `crypto_hash_asconhashv12_esp32_timingleaks'
try.c: /usr/bin/ld: try-small.c:(.text+0x...): undefined reference to `crypto_hash_asconhashv12_esp32_timingleaks'
try.c: collect2: error: ld returned 1 exit status

Number of similar (compiler,implementation) pairs: 1, namely:
CompilerImplementations
gcc -march=native -mtune=native -O -fomit-frame-pointer -fwrapv -fPIC -fPIE T:esp32

Compiler output

Implementation: T:esp32
Security model: timingleaks
Compiler: gcc -march=native -mtune=native -Os -fomit-frame-pointer -fwrapv -fPIC -fPIE
try.c: /usr/bin/ld: /tmp/ccNGv69h.o: in function `doit':
try.c: try-small.c:(.text+0x...): undefined reference to `crypto_hash_asconhashv12_esp32_timingleaks'
try.c: /usr/bin/ld: /tmp/ccNGv69h.o: in function `test':
try.c: try-small.c:(.text+0x...): undefined reference to `crypto_hash_asconhashv12_esp32_timingleaks'
try.c: /usr/bin/ld: try-small.c:(.text+0x...): undefined reference to `crypto_hash_asconhashv12_esp32_timingleaks'
try.c: /usr/bin/ld: try-small.c:(.text+0x...): undefined reference to `crypto_hash_asconhashv12_esp32_timingleaks'
try.c: collect2: error: ld returned 1 exit status

Number of similar (compiler,implementation) pairs: 1, namely:
CompilerImplementations
gcc -march=native -mtune=native -Os -fomit-frame-pointer -fwrapv -fPIC -fPIE T:esp32