Implementation notes: aarch64, pi4b, crypto_hash/asconhashav12

Computer: pi4b
Architecture: aarch64
CPU ID: 410fd083
SUPERCOP version: 20221019
Operation: crypto_hash
Primitive: asconhashav12
TimeObject sizeTest sizeImplementationCompilerBenchmark dateSUPERCOP version
222468072 0 017827 824 728opt64gcc_-march=native_-mtune=native_-O2_-fomit-frame-pointer_-fwrapv_-fPIC_-fPIE2022102020221019
222468072 0 018787 824 736opt64gcc_-march=native_-mtune=native_-O3_-fomit-frame-pointer_-fwrapv_-fPIC_-fPIE2022102020221019
239377256 0 018706 840 728opt64clang_-mcpu=native_-O3_-fomit-frame-pointer_-fwrapv_-Qunused-arguments_-fPIC_-fPIE2022102020221019
242184820 0 015444 816 736refgcc_-march=native_-mtune=native_-O3_-fomit-frame-pointer_-fwrapv_-fPIC_-fPIE2022100720221005
246297684 0 016387 808 720opt64gcc_-march=native_-mtune=native_-Os_-fomit-frame-pointer_-fwrapv_-fPIC_-fPIE2022102020221019
254698764 0 018378 816 728opt64gcc_-march=native_-mtune=native_-O_-fomit-frame-pointer_-fwrapv_-fPIC_-fPIE2022102020221019
2579310136 0 019891 824 728opt32gcc_-march=native_-mtune=native_-O2_-fomit-frame-pointer_-fwrapv_-fPIC_-fPIE2022102020221019
2579310136 0 020851 824 736opt32gcc_-march=native_-mtune=native_-O3_-fomit-frame-pointer_-fwrapv_-fPIC_-fPIE2022102020221019
261772960 0 014386 840 728refclang_-mcpu=native_-O3_-fomit-frame-pointer_-fwrapv_-Qunused-arguments_-fPIC_-fPIE2022100720221005
27585660 0 012074 840 728opt64_lowsizeclang_-mcpu=native_-O3_-fomit-frame-pointer_-fwrapv_-Qunused-arguments_-fPIC_-fPIE2022102020221019
27783688 0 010419 824 728opt64_lowsizegcc_-march=native_-mtune=native_-O2_-fomit-frame-pointer_-fwrapv_-fPIC_-fPIE2022102020221019
27783688 0 011371 824 736opt64_lowsizegcc_-march=native_-mtune=native_-O3_-fomit-frame-pointer_-fwrapv_-fPIC_-fPIE2022102020221019
281254588 0 014236 816 728refgcc_-march=native_-mtune=native_-O2_-fomit-frame-pointer_-fwrapv_-fPIC_-fPIE2022100720221005
295389924 0 018627 808 720opt32gcc_-march=native_-mtune=native_-Os_-fomit-frame-pointer_-fwrapv_-fPIC_-fPIE2022102020221019
30121664 0 09339 808 720opt64_lowsizegcc_-march=native_-mtune=native_-Os_-fomit-frame-pointer_-fwrapv_-fPIC_-fPIE2022102020221019
30314728 0 011403 824 736opt32_lowsizegcc_-march=native_-mtune=native_-O3_-fomit-frame-pointer_-fwrapv_-fPIC_-fPIE2022102020221019
30315728 0 010451 824 728opt32_lowsizegcc_-march=native_-mtune=native_-O2_-fomit-frame-pointer_-fwrapv_-fPIC_-fPIE2022102020221019
306764536 0 014043 808 728refgcc_-march=native_-mtune=native_-O_-fomit-frame-pointer_-fwrapv_-fPIC_-fPIE2022100720221005
3180210744 0 020354 816 728opt32gcc_-march=native_-mtune=native_-O_-fomit-frame-pointer_-fwrapv_-fPIC_-fPIE2022102020221019
325311056 0 010634 816 728opt64_lowsizegcc_-march=native_-mtune=native_-O_-fomit-frame-pointer_-fwrapv_-fPIC_-fPIE2022102020221019
34426704 0 09387 808 720opt32_lowsizegcc_-march=native_-mtune=native_-Os_-fomit-frame-pointer_-fwrapv_-fPIC_-fPIE2022102020221019
356401096 0 010682 816 728opt32_lowsizegcc_-march=native_-mtune=native_-O_-fomit-frame-pointer_-fwrapv_-fPIC_-fPIE2022102020221019
362668680 0 020130 840 728opt32clang_-mcpu=native_-O3_-fomit-frame-pointer_-fwrapv_-Qunused-arguments_-fPIC_-fPIE2022102020221019
36841684 0 012106 840 728opt32_lowsizeclang_-mcpu=native_-O3_-fomit-frame-pointer_-fwrapv_-Qunused-arguments_-fPIC_-fPIE2022102020221019
41556856 0 09476 800 720refgcc_-march=native_-mtune=native_-Os_-fomit-frame-pointer_-fwrapv_-fPIC_-fPIE2022100720221005
553018168 0 019602 848 728bi32clang_-mcpu=native_-O3_-fomit-frame-pointer_-fwrapv_-Qunused-arguments_-fPIC_-fPIE2022102020221019
611851260 0 012706 848 728bi32_lowsizeclang_-mcpu=native_-O3_-fomit-frame-pointer_-fwrapv_-Qunused-arguments_-fPIC_-fPIE2022100720221005
624572296 0 013762 856 728bi32_lowregclang_-mcpu=native_-O3_-fomit-frame-pointer_-fwrapv_-Qunused-arguments_-fPIC_-fPIE2022102020221019
631829968 0 020667 832 736bi32gcc_-march=native_-mtune=native_-O3_-fomit-frame-pointer_-fwrapv_-fPIC_-fPIE2022102020221019
631869968 0 019707 832 728bi32gcc_-march=native_-mtune=native_-O2_-fomit-frame-pointer_-fwrapv_-fPIC_-fPIE2022102020221019
643662900 0 012699 840 728bi32_lowreggcc_-march=native_-mtune=native_-O2_-fomit-frame-pointer_-fwrapv_-fPIC_-fPIE2022102020221019
643682916 0 013667 840 736bi32_lowreggcc_-march=native_-mtune=native_-O3_-fomit-frame-pointer_-fwrapv_-fPIC_-fPIE2022102020221019
662829624 0 018323 816 720bi32gcc_-march=native_-mtune=native_-Os_-fomit-frame-pointer_-fwrapv_-fPIC_-fPIE2022102020221019
670871440 0 011203 832 728bi32_lowsizegcc_-march=native_-mtune=native_-O2_-fomit-frame-pointer_-fwrapv_-fPIC_-fPIE2022100720221005
676621440 0 012155 832 736bi32_lowsizegcc_-march=native_-mtune=native_-O3_-fomit-frame-pointer_-fwrapv_-fPIC_-fPIE2022100720221005
6774410676 0 020282 824 728bi32gcc_-march=native_-mtune=native_-O_-fomit-frame-pointer_-fwrapv_-fPIC_-fPIE2022102020221019
784132596 0 011363 824 720bi32_lowreggcc_-march=native_-mtune=native_-Os_-fomit-frame-pointer_-fwrapv_-fPIC_-fPIE2022102020221019
812071356 0 010043 816 720bi32_lowsizegcc_-march=native_-mtune=native_-Os_-fomit-frame-pointer_-fwrapv_-fPIC_-fPIE2022100720221005
832503256 0 012922 832 728bi32_lowreggcc_-march=native_-mtune=native_-O_-fomit-frame-pointer_-fwrapv_-fPIC_-fPIE2022102020221019
838141592 0 011186 824 728bi32_lowsizegcc_-march=native_-mtune=native_-O_-fomit-frame-pointer_-fwrapv_-fPIC_-fPIE2022100720221005
2203284656 0 014011 832 728bi8gcc_-march=native_-mtune=native_-O2_-fomit-frame-pointer_-fwrapv_-fPIC_-fPIE2022102020221019
2439384652 0 014963 832 736bi8gcc_-march=native_-mtune=native_-O3_-fomit-frame-pointer_-fwrapv_-fPIC_-fPIE2022102020221019
2881183332 0 014746 840 728opt8_lowsizeclang_-mcpu=native_-O3_-fomit-frame-pointer_-fwrapv_-Qunused-arguments_-fPIC_-fPIE2022100720221005
2884713864 0 015266 840 728opt8clang_-mcpu=native_-O3_-fomit-frame-pointer_-fwrapv_-Qunused-arguments_-fPIC_-fPIE2022102020221019
2932543856 0 012331 816 720bi8gcc_-march=native_-mtune=native_-Os_-fomit-frame-pointer_-fwrapv_-fPIC_-fPIE2022102020221019
2958665388 0 014602 824 728bi8gcc_-march=native_-mtune=native_-O_-fomit-frame-pointer_-fwrapv_-fPIC_-fPIE2022102020221019
4243574196 0 014836 816 736opt8gcc_-march=native_-mtune=native_-O3_-fomit-frame-pointer_-fwrapv_-fPIC_-fPIE2022102020221019
4274133356 0 013972 816 736opt8_lowsizegcc_-march=native_-mtune=native_-O3_-fomit-frame-pointer_-fwrapv_-fPIC_-fPIE2022100720221005
4522424848 0 015914 848 728bi8clang_-mcpu=native_-O3_-fomit-frame-pointer_-fwrapv_-Qunused-arguments_-fPIC_-fPIE2022102020221019
4637892760 0 012412 816 728opt8gcc_-march=native_-mtune=native_-O2_-fomit-frame-pointer_-fwrapv_-fPIC_-fPIE2022102020221019
4638602528 0 012156 816 728opt8_lowsizegcc_-march=native_-mtune=native_-O2_-fomit-frame-pointer_-fwrapv_-fPIC_-fPIE2022100720221005
4726512132 0 010740 800 720opt8gcc_-march=native_-mtune=native_-Os_-fomit-frame-pointer_-fwrapv_-fPIC_-fPIE2022102020221019
4742822072 0 010644 800 720opt8_lowsizegcc_-march=native_-mtune=native_-Os_-fomit-frame-pointer_-fwrapv_-fPIC_-fPIE2022100720221005
4974632652 0 012163 808 728opt8gcc_-march=native_-mtune=native_-O_-fomit-frame-pointer_-fwrapv_-fPIC_-fPIE2022102020221019
4980832456 0 011955 808 728opt8_lowsizegcc_-march=native_-mtune=native_-O_-fomit-frame-pointer_-fwrapv_-fPIC_-fPIE2022100720221005

Compiler output

Implementation: armv6
Security model: constbranchindex
Compiler: clang -mcpu=native -O3 -fomit-frame-pointer -fwrapv -Qunused-arguments -fPIC -fPIE
hash.c: In file included from hash.c:4:
hash.c: In file included from ./permutations.h:11:
hash.c: ./round.h:96:44: warning: value size does not match register size specified by the constraint and modifier [-Wasm-operand-widths]
hash.c: [x1_h] "+r"(s->w[1][1]), [x2_l] "+r"(s->w[2][0]), [x2_h] "+r"(s->w[2][1]),
hash.c: ^
hash.c: ./round.h:14:12: note: use constraint modifier "w"
hash.c: "eor %[x2_l], %[x2_l], %[C]\n\t"
hash.c: ^~~~~~~
hash.c: %w[x2_l]
hash.c: ./round.h:96:44: warning: value size does not match register size specified by the constraint and modifier [-Wasm-operand-widths]
hash.c: [x1_h] "+r"(s->w[1][1]), [x2_l] "+r"(s->w[2][0]), [x2_h] "+r"(s->w[2][1]),
hash.c: ^
hash.c: ./round.h:14:21: note: use constraint modifier "w"
hash.c: "eor %[x2_l], %[x2_l], %[C]\n\t"
hash.c: ^~~~~~~
hash.c: %w[x2_l]
hash.c: ./round.h:98:41: warning: value size does not match register size specified by the constraint and modifier [-Wasm-operand-widths]
hash.c: [x4_h] "+r"(s->w[4][1]), [C] "+r"(C), [tmp0] "=r"(tmp0), [tmp1] "=r"(tmp1)
hash.c: ^
hash.c: ./round.h:14:30: note: use constraint modifier "w"
hash.c: "eor %[x2_l], %[x2_l], %[C]\n\t"
hash.c: ^~~~
hash.c: %w[C]
hash.c: ./round.h:95:19: warning: value size does not match register size specified by the constraint and modifier [-Wasm-operand-widths]
hash.c: [x0_l] "+r"(s->w[0][0]), [x0_h] "+r"(s->w[0][1]), [x1_l] "+r"(s->w[1][0]),
hash.c: ...

Number of similar (compiler,implementation) pairs: 2, namely:
CompilerImplementations
clang -mcpu=native -O3 -fomit-frame-pointer -fwrapv -Qunused-arguments -fPIC -fPIE armv6 armv6_lowsize

Compiler output

Implementation: armv6
Security model: constbranchindex
Compiler: gcc -march=native -mtune=native -O2 -fomit-frame-pointer -fwrapv -fPIC -fPIE
permutations.c: /tmp/ccwEl8tN.s: Assembler messages:
permutations.c: /tmp/ccwEl8tN.s:124: Error: immediate out of range at operand 3 -- `eor x13,x13,225'
permutations.c: /tmp/ccwEl8tN.s:222: Error: immediate out of range at operand 3 -- `eor x13,x13,210'
permutations.c: /tmp/ccwEl8tN.s:320: Error: immediate out of range at operand 3 -- `eor x13,x13,195'
permutations.c: /tmp/ccwEl8tN.s:418: Error: immediate out of range at operand 3 -- `eor x13,x13,180'
permutations.c: /tmp/ccwEl8tN.s:516: Error: immediate out of range at operand 3 -- `eor x13,x13,165'
permutations.c: /tmp/ccwEl8tN.s:614: Error: immediate out of range at operand 3 -- `eor x13,x13,150'
permutations.c: /tmp/ccwEl8tN.s:712: Error: immediate out of range at operand 3 -- `eor x13,x13,135'
permutations.c: /tmp/ccwEl8tN.s:908: Error: immediate out of range at operand 3 -- `eor x13,x13,105'
permutations.c: /tmp/ccwEl8tN.s:1006: Error: immediate out of range at operand 3 -- `eor x13,x13,90'
permutations.c: /tmp/ccwEl8tN.s:1104: Error: immediate out of range at operand 3 -- `eor x13,x13,75'
permutations.c: /tmp/ccwEl8tN.s:1219: Error: immediate out of range at operand 3 -- `eor x13,x13,180'
permutations.c: /tmp/ccwEl8tN.s:1317: Error: immediate out of range at operand 3 -- `eor x13,x13,165'
permutations.c: /tmp/ccwEl8tN.s:1415: Error: immediate out of range at operand 3 -- `eor x13,x13,150'
permutations.c: /tmp/ccwEl8tN.s:1513: Error: immediate out of range at operand 3 -- `eor x13,x13,135'
permutations.c: /tmp/ccwEl8tN.s:1709: Error: immediate out of range at operand 3 -- `eor x13,x13,105'
permutations.c: /tmp/ccwEl8tN.s:1807: Error: immediate out of range at operand 3 -- `eor x13,x13,90'
permutations.c: /tmp/ccwEl8tN.s:1905: Error: immediate out of range at operand 3 -- `eor x13,x13,75'

Number of similar (compiler,implementation) pairs: 1, namely:
CompilerImplementations
gcc -march=native -mtune=native -O2 -fomit-frame-pointer -fwrapv -fPIC -fPIE armv6

Compiler output

Implementation: armv6
Security model: constbranchindex
Compiler: gcc -march=native -mtune=native -O3 -fomit-frame-pointer -fwrapv -fPIC -fPIE
permutations.c: /tmp/ccU5Pt1a.s: Assembler messages:
permutations.c: /tmp/ccU5Pt1a.s:124: Error: immediate out of range at operand 3 -- `eor x13,x13,225'
permutations.c: /tmp/ccU5Pt1a.s:222: Error: immediate out of range at operand 3 -- `eor x13,x13,210'
permutations.c: /tmp/ccU5Pt1a.s:320: Error: immediate out of range at operand 3 -- `eor x13,x13,195'
permutations.c: /tmp/ccU5Pt1a.s:418: Error: immediate out of range at operand 3 -- `eor x13,x13,180'
permutations.c: /tmp/ccU5Pt1a.s:516: Error: immediate out of range at operand 3 -- `eor x13,x13,165'
permutations.c: /tmp/ccU5Pt1a.s:614: Error: immediate out of range at operand 3 -- `eor x13,x13,150'
permutations.c: /tmp/ccU5Pt1a.s:712: Error: immediate out of range at operand 3 -- `eor x13,x13,135'
permutations.c: /tmp/ccU5Pt1a.s:908: Error: immediate out of range at operand 3 -- `eor x13,x13,105'
permutations.c: /tmp/ccU5Pt1a.s:1006: Error: immediate out of range at operand 3 -- `eor x13,x13,90'
permutations.c: /tmp/ccU5Pt1a.s:1104: Error: immediate out of range at operand 3 -- `eor x13,x13,75'
permutations.c: /tmp/ccU5Pt1a.s:1219: Error: immediate out of range at operand 3 -- `eor x13,x13,180'
permutations.c: /tmp/ccU5Pt1a.s:1317: Error: immediate out of range at operand 3 -- `eor x13,x13,165'
permutations.c: /tmp/ccU5Pt1a.s:1415: Error: immediate out of range at operand 3 -- `eor x13,x13,150'
permutations.c: /tmp/ccU5Pt1a.s:1513: Error: immediate out of range at operand 3 -- `eor x13,x13,135'
permutations.c: /tmp/ccU5Pt1a.s:1709: Error: immediate out of range at operand 3 -- `eor x13,x13,105'
permutations.c: /tmp/ccU5Pt1a.s:1807: Error: immediate out of range at operand 3 -- `eor x13,x13,90'
permutations.c: /tmp/ccU5Pt1a.s:1905: Error: immediate out of range at operand 3 -- `eor x13,x13,75'

Number of similar (compiler,implementation) pairs: 1, namely:
CompilerImplementations
gcc -march=native -mtune=native -O3 -fomit-frame-pointer -fwrapv -fPIC -fPIE armv6

Compiler output

Implementation: armv6
Security model: constbranchindex
Compiler: gcc -march=native -mtune=native -O -fomit-frame-pointer -fwrapv -fPIC -fPIE
permutations.c: /tmp/ccC0eLiz.s: Assembler messages:
permutations.c: /tmp/ccC0eLiz.s:125: Error: immediate out of range at operand 3 -- `eor x13,x13,225'
permutations.c: /tmp/ccC0eLiz.s:223: Error: immediate out of range at operand 3 -- `eor x13,x13,210'
permutations.c: /tmp/ccC0eLiz.s:321: Error: immediate out of range at operand 3 -- `eor x13,x13,195'
permutations.c: /tmp/ccC0eLiz.s:419: Error: immediate out of range at operand 3 -- `eor x13,x13,180'
permutations.c: /tmp/ccC0eLiz.s:517: Error: immediate out of range at operand 3 -- `eor x13,x13,165'
permutations.c: /tmp/ccC0eLiz.s:615: Error: immediate out of range at operand 3 -- `eor x13,x13,150'
permutations.c: /tmp/ccC0eLiz.s:713: Error: immediate out of range at operand 3 -- `eor x13,x13,135'
permutations.c: /tmp/ccC0eLiz.s:909: Error: immediate out of range at operand 3 -- `eor x13,x13,105'
permutations.c: /tmp/ccC0eLiz.s:1007: Error: immediate out of range at operand 3 -- `eor x13,x13,90'
permutations.c: /tmp/ccC0eLiz.s:1105: Error: immediate out of range at operand 3 -- `eor x13,x13,75'
permutations.c: /tmp/ccC0eLiz.s:1223: Error: immediate out of range at operand 3 -- `eor x8,x8,180'
permutations.c: /tmp/ccC0eLiz.s:1321: Error: immediate out of range at operand 3 -- `eor x13,x13,165'
permutations.c: /tmp/ccC0eLiz.s:1419: Error: immediate out of range at operand 3 -- `eor x13,x13,150'
permutations.c: /tmp/ccC0eLiz.s:1517: Error: immediate out of range at operand 3 -- `eor x13,x13,135'
permutations.c: /tmp/ccC0eLiz.s:1713: Error: immediate out of range at operand 3 -- `eor x13,x13,105'
permutations.c: /tmp/ccC0eLiz.s:1811: Error: immediate out of range at operand 3 -- `eor x13,x13,90'
permutations.c: /tmp/ccC0eLiz.s:1909: Error: immediate out of range at operand 3 -- `eor x13,x13,75'

Number of similar (compiler,implementation) pairs: 1, namely:
CompilerImplementations
gcc -march=native -mtune=native -O -fomit-frame-pointer -fwrapv -fPIC -fPIE armv6

Compiler output

Implementation: armv6
Security model: constbranchindex
Compiler: gcc -march=native -mtune=native -Os -fomit-frame-pointer -fwrapv -fPIC -fPIE
permutations.c: /tmp/ccTmp3kE.s: Assembler messages:
permutations.c: /tmp/ccTmp3kE.s:123: Error: immediate out of range at operand 3 -- `eor x13,x13,225'
permutations.c: /tmp/ccTmp3kE.s:221: Error: immediate out of range at operand 3 -- `eor x13,x13,210'
permutations.c: /tmp/ccTmp3kE.s:319: Error: immediate out of range at operand 3 -- `eor x13,x13,195'
permutations.c: /tmp/ccTmp3kE.s:417: Error: immediate out of range at operand 3 -- `eor x13,x13,180'
permutations.c: /tmp/ccTmp3kE.s:515: Error: immediate out of range at operand 3 -- `eor x13,x13,165'
permutations.c: /tmp/ccTmp3kE.s:613: Error: immediate out of range at operand 3 -- `eor x13,x13,150'
permutations.c: /tmp/ccTmp3kE.s:711: Error: immediate out of range at operand 3 -- `eor x13,x13,135'
permutations.c: /tmp/ccTmp3kE.s:907: Error: immediate out of range at operand 3 -- `eor x13,x13,105'
permutations.c: /tmp/ccTmp3kE.s:1005: Error: immediate out of range at operand 3 -- `eor x13,x13,90'
permutations.c: /tmp/ccTmp3kE.s:1103: Error: immediate out of range at operand 3 -- `eor x13,x13,75'
permutations.c: /tmp/ccTmp3kE.s:1217: Error: immediate out of range at operand 3 -- `eor x13,x13,180'
permutations.c: /tmp/ccTmp3kE.s:1315: Error: immediate out of range at operand 3 -- `eor x13,x13,165'
permutations.c: /tmp/ccTmp3kE.s:1413: Error: immediate out of range at operand 3 -- `eor x13,x13,150'
permutations.c: /tmp/ccTmp3kE.s:1511: Error: immediate out of range at operand 3 -- `eor x13,x13,135'
permutations.c: /tmp/ccTmp3kE.s:1707: Error: immediate out of range at operand 3 -- `eor x13,x13,105'
permutations.c: /tmp/ccTmp3kE.s:1805: Error: immediate out of range at operand 3 -- `eor x13,x13,90'
permutations.c: /tmp/ccTmp3kE.s:1903: Error: immediate out of range at operand 3 -- `eor x13,x13,75'

Number of similar (compiler,implementation) pairs: 1, namely:
CompilerImplementations
gcc -march=native -mtune=native -Os -fomit-frame-pointer -fwrapv -fPIC -fPIE armv6

Compiler output

Implementation: armv6_lowsize
Security model: constbranchindex
Compiler: gcc -march=native -mtune=native -O2 -fomit-frame-pointer -fwrapv -fPIC -fPIE
permutations.c: /tmp/ccqxpKM8.s: Assembler messages:
permutations.c: /tmp/ccqxpKM8.s:100: Error: operand 2 must be an integer or stack pointer register -- `sub x1,#15'

Number of similar (compiler,implementation) pairs: 1, namely:
CompilerImplementations
gcc -march=native -mtune=native -O2 -fomit-frame-pointer -fwrapv -fPIC -fPIE armv6_lowsize

Compiler output

Implementation: armv6_lowsize
Security model: constbranchindex
Compiler: gcc -march=native -mtune=native -O3 -fomit-frame-pointer -fwrapv -fPIC -fPIE
permutations.c: /tmp/ccBeImMs.s: Assembler messages:
permutations.c: /tmp/ccBeImMs.s:100: Error: operand 2 must be an integer or stack pointer register -- `sub x1,#15'

Number of similar (compiler,implementation) pairs: 1, namely:
CompilerImplementations
gcc -march=native -mtune=native -O3 -fomit-frame-pointer -fwrapv -fPIC -fPIE armv6_lowsize

Compiler output

Implementation: armv6_lowsize
Security model: constbranchindex
Compiler: gcc -march=native -mtune=native -O -fomit-frame-pointer -fwrapv -fPIC -fPIE
permutations.c: /tmp/ccCTTnnK.s: Assembler messages:
permutations.c: /tmp/ccCTTnnK.s:104: Error: operand 2 must be an integer or stack pointer register -- `sub x1,#15'

Number of similar (compiler,implementation) pairs: 1, namely:
CompilerImplementations
gcc -march=native -mtune=native -O -fomit-frame-pointer -fwrapv -fPIC -fPIE armv6_lowsize

Compiler output

Implementation: armv6_lowsize
Security model: constbranchindex
Compiler: gcc -march=native -mtune=native -Os -fomit-frame-pointer -fwrapv -fPIC -fPIE
permutations.c: /tmp/ccr4LXmS.s: Assembler messages:
permutations.c: /tmp/ccr4LXmS.s:100: Error: operand 2 must be an integer or stack pointer register -- `sub x1,#15'

Number of similar (compiler,implementation) pairs: 1, namely:
CompilerImplementations
gcc -march=native -mtune=native -Os -fomit-frame-pointer -fwrapv -fPIC -fPIE armv6_lowsize

Compiler output

Implementation: armv6m
Security model: constbranchindex
Compiler: clang -mcpu=native -O3 -fomit-frame-pointer -fwrapv -Qunused-arguments -fPIC -fPIE
hash.c: In file included from hash.c:4:
hash.c: In file included from ./permutations.h:11:
hash.c: ./round.h:173:14: error: invalid output constraint '+l' in asm
hash.c: [x0_l] "+l"(s->w[0][0]), [x0_h] "+h"(s->w[0][1]), [x1_l] "+l"(s->w[1][0]),
hash.c: ^
hash.c: ./round.h:338:14: error: invalid output constraint '+l' in asm
hash.c: [x0_l] "+l"(s->w[0][0]), [x0_h] "+h"(s->w[0][1]), [x1_l] "+l"(s->w[1][0]),
hash.c: ^
hash.c: 2 errors generated.

Number of similar (compiler,implementation) pairs: 2, namely:
CompilerImplementations
clang -mcpu=native -O3 -fomit-frame-pointer -fwrapv -Qunused-arguments -fPIC -fPIE armv6m armv6m_lowsize

Compiler output

Implementation: armv6m
Security model: constbranchindex
Compiler: gcc -march=native -mtune=native -O2 -fomit-frame-pointer -fwrapv -fPIC -fPIE
hash.c: In file included from permutations.h:11,
hash.c: from hash.c:4:
hash.c: hash.c: In function 'ascon_absorb':
hash.c: round.h:12:3: error: impossible constraint in 'asm'
hash.c: 12 | __asm__ __volatile__(
hash.c: | ^~~~~~~

Number of similar (compiler,implementation) pairs: 4, namely:
CompilerImplementations
gcc -march=native -mtune=native -O2 -fomit-frame-pointer -fwrapv -fPIC -fPIE armv6m
gcc -march=native -mtune=native -O3 -fomit-frame-pointer -fwrapv -fPIC -fPIE armv6m
gcc -march=native -mtune=native -O -fomit-frame-pointer -fwrapv -fPIC -fPIE armv6m
gcc -march=native -mtune=native -Os -fomit-frame-pointer -fwrapv -fPIC -fPIE armv6m

Compiler output

Implementation: armv6m_lowsize
Security model: constbranchindex
Compiler: gcc -march=native -mtune=native -O2 -fomit-frame-pointer -fwrapv -fPIC -fPIE
permutations.c: In file included from permutations.h:11,
permutations.c: from permutations.c:1:
permutations.c: permutations.c: In function 'P':
permutations.c: round.h:12:3: error: impossible constraint in 'asm'
permutations.c: 12 | __asm__ __volatile__(
permutations.c: | ^~~~~~~

Number of similar (compiler,implementation) pairs: 4, namely:
CompilerImplementations
gcc -march=native -mtune=native -O2 -fomit-frame-pointer -fwrapv -fPIC -fPIE armv6m_lowsize
gcc -march=native -mtune=native -O3 -fomit-frame-pointer -fwrapv -fPIC -fPIE armv6m_lowsize
gcc -march=native -mtune=native -O -fomit-frame-pointer -fwrapv -fPIC -fPIE armv6m_lowsize
gcc -march=native -mtune=native -Os -fomit-frame-pointer -fwrapv -fPIC -fPIE armv6m_lowsize

Compiler output

Implementation: armv7m
Security model: constbranchindex
Compiler: clang -mcpu=native -O3 -fomit-frame-pointer -fwrapv -Qunused-arguments -fPIC -fPIE
hash.c: In file included from hash.c:4:
hash.c: In file included from ./permutations.h:11:
hash.c: ./round.h:92:44: warning: value size does not match register size specified by the constraint and modifier [-Wasm-operand-widths]
hash.c: [x1_h] "+r"(s->w[1][1]), [x2_l] "+r"(s->w[2][0]), [x2_h] "+r"(s->w[2][1]),
hash.c: ^
hash.c: ./round.h:14:12: note: use constraint modifier "w"
hash.c: "eor %[x2_l], %[x2_l], %[C]\n\t"
hash.c: ^~~~~~~
hash.c: %w[x2_l]
hash.c: ./round.h:92:44: warning: value size does not match register size specified by the constraint and modifier [-Wasm-operand-widths]
hash.c: [x1_h] "+r"(s->w[1][1]), [x2_l] "+r"(s->w[2][0]), [x2_h] "+r"(s->w[2][1]),
hash.c: ^
hash.c: ./round.h:14:21: note: use constraint modifier "w"
hash.c: "eor %[x2_l], %[x2_l], %[C]\n\t"
hash.c: ^~~~~~~
hash.c: %w[x2_l]
hash.c: ./round.h:94:41: warning: value size does not match register size specified by the constraint and modifier [-Wasm-operand-widths]
hash.c: [x4_h] "+r"(s->w[4][1]), [C] "+r"(C), [tmp0] "=r"(tmp0), [tmp1] "=r"(tmp1)
hash.c: ^
hash.c: ./round.h:14:30: note: use constraint modifier "w"
hash.c: "eor %[x2_l], %[x2_l], %[C]\n\t"
hash.c: ^~~~
hash.c: %w[C]
hash.c: ./round.h:91:19: warning: value size does not match register size specified by the constraint and modifier [-Wasm-operand-widths]
hash.c: [x0_l] "+r"(s->w[0][0]), [x0_h] "+r"(s->w[0][1]), [x1_l] "+r"(s->w[1][0]),
hash.c: ...

Number of similar (compiler,implementation) pairs: 3, namely:
CompilerImplementations
clang -mcpu=native -O3 -fomit-frame-pointer -fwrapv -Qunused-arguments -fPIC -fPIE armv7m armv7m_lowsize armv7m_small

Compiler output

Implementation: armv7m
Security model: constbranchindex
Compiler: gcc -march=native -mtune=native -O2 -fomit-frame-pointer -fwrapv -fPIC -fPIE
permutations.c: /tmp/ccrzXFvY.s: Assembler messages:
permutations.c: /tmp/ccrzXFvY.s:122: Error: immediate out of range at operand 3 -- `eor x13,x13,225'
permutations.c: /tmp/ccrzXFvY.s:218: Error: immediate out of range at operand 3 -- `eor x13,x13,210'
permutations.c: /tmp/ccrzXFvY.s:314: Error: immediate out of range at operand 3 -- `eor x13,x13,195'
permutations.c: /tmp/ccrzXFvY.s:410: Error: immediate out of range at operand 3 -- `eor x13,x13,180'
permutations.c: /tmp/ccrzXFvY.s:506: Error: immediate out of range at operand 3 -- `eor x13,x13,165'
permutations.c: /tmp/ccrzXFvY.s:602: Error: immediate out of range at operand 3 -- `eor x13,x13,150'
permutations.c: /tmp/ccrzXFvY.s:698: Error: immediate out of range at operand 3 -- `eor x13,x13,135'
permutations.c: /tmp/ccrzXFvY.s:890: Error: immediate out of range at operand 3 -- `eor x13,x13,105'
permutations.c: /tmp/ccrzXFvY.s:986: Error: immediate out of range at operand 3 -- `eor x13,x13,90'
permutations.c: /tmp/ccrzXFvY.s:1082: Error: immediate out of range at operand 3 -- `eor x13,x13,75'
permutations.c: /tmp/ccrzXFvY.s:1195: Error: immediate out of range at operand 3 -- `eor x13,x13,180'
permutations.c: /tmp/ccrzXFvY.s:1291: Error: immediate out of range at operand 3 -- `eor x13,x13,165'
permutations.c: /tmp/ccrzXFvY.s:1387: Error: immediate out of range at operand 3 -- `eor x13,x13,150'
permutations.c: /tmp/ccrzXFvY.s:1483: Error: immediate out of range at operand 3 -- `eor x13,x13,135'
permutations.c: /tmp/ccrzXFvY.s:1675: Error: immediate out of range at operand 3 -- `eor x13,x13,105'
permutations.c: /tmp/ccrzXFvY.s:1771: Error: immediate out of range at operand 3 -- `eor x13,x13,90'
permutations.c: /tmp/ccrzXFvY.s:1867: Error: immediate out of range at operand 3 -- `eor x13,x13,75'

Number of similar (compiler,implementation) pairs: 1, namely:
CompilerImplementations
gcc -march=native -mtune=native -O2 -fomit-frame-pointer -fwrapv -fPIC -fPIE armv7m

Compiler output

Implementation: armv7m
Security model: constbranchindex
Compiler: gcc -march=native -mtune=native -O3 -fomit-frame-pointer -fwrapv -fPIC -fPIE
permutations.c: /tmp/cc8mu8AK.s: Assembler messages:
permutations.c: /tmp/cc8mu8AK.s:122: Error: immediate out of range at operand 3 -- `eor x13,x13,225'
permutations.c: /tmp/cc8mu8AK.s:218: Error: immediate out of range at operand 3 -- `eor x13,x13,210'
permutations.c: /tmp/cc8mu8AK.s:314: Error: immediate out of range at operand 3 -- `eor x13,x13,195'
permutations.c: /tmp/cc8mu8AK.s:410: Error: immediate out of range at operand 3 -- `eor x13,x13,180'
permutations.c: /tmp/cc8mu8AK.s:506: Error: immediate out of range at operand 3 -- `eor x13,x13,165'
permutations.c: /tmp/cc8mu8AK.s:602: Error: immediate out of range at operand 3 -- `eor x13,x13,150'
permutations.c: /tmp/cc8mu8AK.s:698: Error: immediate out of range at operand 3 -- `eor x13,x13,135'
permutations.c: /tmp/cc8mu8AK.s:890: Error: immediate out of range at operand 3 -- `eor x13,x13,105'
permutations.c: /tmp/cc8mu8AK.s:986: Error: immediate out of range at operand 3 -- `eor x13,x13,90'
permutations.c: /tmp/cc8mu8AK.s:1082: Error: immediate out of range at operand 3 -- `eor x13,x13,75'
permutations.c: /tmp/cc8mu8AK.s:1195: Error: immediate out of range at operand 3 -- `eor x13,x13,180'
permutations.c: /tmp/cc8mu8AK.s:1291: Error: immediate out of range at operand 3 -- `eor x13,x13,165'
permutations.c: /tmp/cc8mu8AK.s:1387: Error: immediate out of range at operand 3 -- `eor x13,x13,150'
permutations.c: /tmp/cc8mu8AK.s:1483: Error: immediate out of range at operand 3 -- `eor x13,x13,135'
permutations.c: /tmp/cc8mu8AK.s:1675: Error: immediate out of range at operand 3 -- `eor x13,x13,105'
permutations.c: /tmp/cc8mu8AK.s:1771: Error: immediate out of range at operand 3 -- `eor x13,x13,90'
permutations.c: /tmp/cc8mu8AK.s:1867: Error: immediate out of range at operand 3 -- `eor x13,x13,75'

Number of similar (compiler,implementation) pairs: 1, namely:
CompilerImplementations
gcc -march=native -mtune=native -O3 -fomit-frame-pointer -fwrapv -fPIC -fPIE armv7m

Compiler output

Implementation: armv7m
Security model: constbranchindex
Compiler: gcc -march=native -mtune=native -O -fomit-frame-pointer -fwrapv -fPIC -fPIE
permutations.c: /tmp/cc1y1jsO.s: Assembler messages:
permutations.c: /tmp/cc1y1jsO.s:123: Error: immediate out of range at operand 3 -- `eor x13,x13,225'
permutations.c: /tmp/cc1y1jsO.s:219: Error: immediate out of range at operand 3 -- `eor x13,x13,210'
permutations.c: /tmp/cc1y1jsO.s:315: Error: immediate out of range at operand 3 -- `eor x13,x13,195'
permutations.c: /tmp/cc1y1jsO.s:411: Error: immediate out of range at operand 3 -- `eor x13,x13,180'
permutations.c: /tmp/cc1y1jsO.s:507: Error: immediate out of range at operand 3 -- `eor x13,x13,165'
permutations.c: /tmp/cc1y1jsO.s:603: Error: immediate out of range at operand 3 -- `eor x13,x13,150'
permutations.c: /tmp/cc1y1jsO.s:699: Error: immediate out of range at operand 3 -- `eor x13,x13,135'
permutations.c: /tmp/cc1y1jsO.s:891: Error: immediate out of range at operand 3 -- `eor x13,x13,105'
permutations.c: /tmp/cc1y1jsO.s:987: Error: immediate out of range at operand 3 -- `eor x13,x13,90'
permutations.c: /tmp/cc1y1jsO.s:1083: Error: immediate out of range at operand 3 -- `eor x13,x13,75'
permutations.c: /tmp/cc1y1jsO.s:1199: Error: immediate out of range at operand 3 -- `eor x8,x8,180'
permutations.c: /tmp/cc1y1jsO.s:1295: Error: immediate out of range at operand 3 -- `eor x13,x13,165'
permutations.c: /tmp/cc1y1jsO.s:1391: Error: immediate out of range at operand 3 -- `eor x13,x13,150'
permutations.c: /tmp/cc1y1jsO.s:1487: Error: immediate out of range at operand 3 -- `eor x13,x13,135'
permutations.c: /tmp/cc1y1jsO.s:1679: Error: immediate out of range at operand 3 -- `eor x13,x13,105'
permutations.c: /tmp/cc1y1jsO.s:1775: Error: immediate out of range at operand 3 -- `eor x13,x13,90'
permutations.c: /tmp/cc1y1jsO.s:1871: Error: immediate out of range at operand 3 -- `eor x13,x13,75'

Number of similar (compiler,implementation) pairs: 1, namely:
CompilerImplementations
gcc -march=native -mtune=native -O -fomit-frame-pointer -fwrapv -fPIC -fPIE armv7m

Compiler output

Implementation: armv7m
Security model: constbranchindex
Compiler: gcc -march=native -mtune=native -Os -fomit-frame-pointer -fwrapv -fPIC -fPIE
permutations.c: /tmp/cc4geg3J.s: Assembler messages:
permutations.c: /tmp/cc4geg3J.s:121: Error: immediate out of range at operand 3 -- `eor x13,x13,225'
permutations.c: /tmp/cc4geg3J.s:217: Error: immediate out of range at operand 3 -- `eor x13,x13,210'
permutations.c: /tmp/cc4geg3J.s:313: Error: immediate out of range at operand 3 -- `eor x13,x13,195'
permutations.c: /tmp/cc4geg3J.s:409: Error: immediate out of range at operand 3 -- `eor x13,x13,180'
permutations.c: /tmp/cc4geg3J.s:505: Error: immediate out of range at operand 3 -- `eor x13,x13,165'
permutations.c: /tmp/cc4geg3J.s:601: Error: immediate out of range at operand 3 -- `eor x13,x13,150'
permutations.c: /tmp/cc4geg3J.s:697: Error: immediate out of range at operand 3 -- `eor x13,x13,135'
permutations.c: /tmp/cc4geg3J.s:889: Error: immediate out of range at operand 3 -- `eor x13,x13,105'
permutations.c: /tmp/cc4geg3J.s:985: Error: immediate out of range at operand 3 -- `eor x13,x13,90'
permutations.c: /tmp/cc4geg3J.s:1081: Error: immediate out of range at operand 3 -- `eor x13,x13,75'
permutations.c: /tmp/cc4geg3J.s:1193: Error: immediate out of range at operand 3 -- `eor x13,x13,180'
permutations.c: /tmp/cc4geg3J.s:1289: Error: immediate out of range at operand 3 -- `eor x13,x13,165'
permutations.c: /tmp/cc4geg3J.s:1385: Error: immediate out of range at operand 3 -- `eor x13,x13,150'
permutations.c: /tmp/cc4geg3J.s:1481: Error: immediate out of range at operand 3 -- `eor x13,x13,135'
permutations.c: /tmp/cc4geg3J.s:1673: Error: immediate out of range at operand 3 -- `eor x13,x13,105'
permutations.c: /tmp/cc4geg3J.s:1769: Error: immediate out of range at operand 3 -- `eor x13,x13,90'
permutations.c: /tmp/cc4geg3J.s:1865: Error: immediate out of range at operand 3 -- `eor x13,x13,75'

Number of similar (compiler,implementation) pairs: 1, namely:
CompilerImplementations
gcc -march=native -mtune=native -Os -fomit-frame-pointer -fwrapv -fPIC -fPIE armv7m

Compiler output

Implementation: armv7m_lowsize
Security model: constbranchindex
Compiler: gcc -march=native -mtune=native -O2 -fomit-frame-pointer -fwrapv -fPIC -fPIE
permutations.c: /tmp/cchgpZ9W.s: Assembler messages:
permutations.c: /tmp/cchgpZ9W.s:96: Error: operand 2 must be an integer or stack pointer register -- `sub x1,#15'

Number of similar (compiler,implementation) pairs: 1, namely:
CompilerImplementations
gcc -march=native -mtune=native -O2 -fomit-frame-pointer -fwrapv -fPIC -fPIE armv7m_lowsize

Compiler output

Implementation: armv7m_lowsize
Security model: constbranchindex
Compiler: gcc -march=native -mtune=native -O3 -fomit-frame-pointer -fwrapv -fPIC -fPIE
permutations.c: /tmp/ccnLIa0x.s: Assembler messages:
permutations.c: /tmp/ccnLIa0x.s:96: Error: operand 2 must be an integer or stack pointer register -- `sub x1,#15'

Number of similar (compiler,implementation) pairs: 1, namely:
CompilerImplementations
gcc -march=native -mtune=native -O3 -fomit-frame-pointer -fwrapv -fPIC -fPIE armv7m_lowsize

Compiler output

Implementation: armv7m_lowsize
Security model: constbranchindex
Compiler: gcc -march=native -mtune=native -O -fomit-frame-pointer -fwrapv -fPIC -fPIE
permutations.c: /tmp/ccepXbDw.s: Assembler messages:
permutations.c: /tmp/ccepXbDw.s:100: Error: operand 2 must be an integer or stack pointer register -- `sub x1,#15'

Number of similar (compiler,implementation) pairs: 1, namely:
CompilerImplementations
gcc -march=native -mtune=native -O -fomit-frame-pointer -fwrapv -fPIC -fPIE armv7m_lowsize

Compiler output

Implementation: armv7m_lowsize
Security model: constbranchindex
Compiler: gcc -march=native -mtune=native -Os -fomit-frame-pointer -fwrapv -fPIC -fPIE
permutations.c: /tmp/ccnPYGqV.s: Assembler messages:
permutations.c: /tmp/ccnPYGqV.s:96: Error: operand 2 must be an integer or stack pointer register -- `sub x1,#15'

Number of similar (compiler,implementation) pairs: 1, namely:
CompilerImplementations
gcc -march=native -mtune=native -Os -fomit-frame-pointer -fwrapv -fPIC -fPIE armv7m_lowsize

Compiler output

Implementation: armv7m_small
Security model: constbranchindex
Compiler: gcc -march=native -mtune=native -O2 -fomit-frame-pointer -fwrapv -fPIC -fPIE
permutations.c: /tmp/ccECofCN.s: Assembler messages:
permutations.c: /tmp/ccECofCN.s:96: Error: operand 2 must be an integer or stack pointer register -- `sub x1,#15'

Number of similar (compiler,implementation) pairs: 1, namely:
CompilerImplementations
gcc -march=native -mtune=native -O2 -fomit-frame-pointer -fwrapv -fPIC -fPIE armv7m_small

Compiler output

Implementation: armv7m_small
Security model: constbranchindex
Compiler: gcc -march=native -mtune=native -O3 -fomit-frame-pointer -fwrapv -fPIC -fPIE
permutations.c: /tmp/cckPGKhQ.s: Assembler messages:
permutations.c: /tmp/cckPGKhQ.s:96: Error: operand 2 must be an integer or stack pointer register -- `sub x1,#15'

Number of similar (compiler,implementation) pairs: 1, namely:
CompilerImplementations
gcc -march=native -mtune=native -O3 -fomit-frame-pointer -fwrapv -fPIC -fPIE armv7m_small

Compiler output

Implementation: armv7m_small
Security model: constbranchindex
Compiler: gcc -march=native -mtune=native -O -fomit-frame-pointer -fwrapv -fPIC -fPIE
permutations.c: /tmp/ccQvUZrj.s: Assembler messages:
permutations.c: /tmp/ccQvUZrj.s:100: Error: operand 2 must be an integer or stack pointer register -- `sub x1,#15'

Number of similar (compiler,implementation) pairs: 1, namely:
CompilerImplementations
gcc -march=native -mtune=native -O -fomit-frame-pointer -fwrapv -fPIC -fPIE armv7m_small

Compiler output

Implementation: armv7m_small
Security model: constbranchindex
Compiler: gcc -march=native -mtune=native -Os -fomit-frame-pointer -fwrapv -fPIC -fPIE
permutations.c: /tmp/cccNzBvC.s: Assembler messages:
permutations.c: /tmp/cccNzBvC.s:96: Error: operand 2 must be an integer or stack pointer register -- `sub x1,#15'

Number of similar (compiler,implementation) pairs: 1, namely:
CompilerImplementations
gcc -march=native -mtune=native -Os -fomit-frame-pointer -fwrapv -fPIC -fPIE armv7m_small

Compiler output

Implementation: T:asm_esp32
Security model: timingleaks
Compiler: clang -mcpu=native -O3 -fomit-frame-pointer -fwrapv -Qunused-arguments -fPIC -fPIE
ascon.S: ascon.S:1:10: fatal error: 'xtensa/coreasm.h' file not found
ascon.S: #include <xtensa/coreasm.h>
ascon.S: ^~~~~~~~~~~~~~~~~~
ascon.S: 1 error generated.

Number of similar (compiler,implementation) pairs: 1, namely:
CompilerImplementations
clang -mcpu=native -O3 -fomit-frame-pointer -fwrapv -Qunused-arguments -fPIC -fPIE T:asm_esp32

Compiler output

Implementation: T:asm_esp32
Security model: timingleaks
Compiler: gcc -march=native -mtune=native -O2 -fomit-frame-pointer -fwrapv -fPIC -fPIE
ascon.S: ascon.S:1:10: fatal error: xtensa/coreasm.h: No such file or directory
ascon.S: 1 | #include <xtensa/coreasm.h>
ascon.S: | ^~~~~~~~~~~~~~~~~~
ascon.S: compilation terminated.

Number of similar (compiler,implementation) pairs: 4, namely:
CompilerImplementations
gcc -march=native -mtune=native -O2 -fomit-frame-pointer -fwrapv -fPIC -fPIE T:asm_esp32
gcc -march=native -mtune=native -O3 -fomit-frame-pointer -fwrapv -fPIC -fPIE T:asm_esp32
gcc -march=native -mtune=native -O -fomit-frame-pointer -fwrapv -fPIC -fPIE T:asm_esp32
gcc -march=native -mtune=native -Os -fomit-frame-pointer -fwrapv -fPIC -fPIE T:asm_esp32

Compiler output

Implementation: avr
Security model: constbranchindex
Compiler: clang -mcpu=native -O3 -fomit-frame-pointer -fwrapv -Qunused-arguments -fPIC -fPIE
permutations.S: permutations.S:29:10: fatal error: 'avr/io.h' file not found
permutations.S: #include "avr/io.h"
permutations.S: ^~~~~~~~~~
permutations.S: 1 error generated.

Number of similar (compiler,implementation) pairs: 2, namely:
CompilerImplementations
clang -mcpu=native -O3 -fomit-frame-pointer -fwrapv -Qunused-arguments -fPIC -fPIE avr avr_lowsize

Compiler output

Implementation: avr
Security model: constbranchindex
Compiler: gcc -march=native -mtune=native -O2 -fomit-frame-pointer -fwrapv -fPIC -fPIE
permutations.S: permutations.S:29:10: fatal error: avr/io.h: No such file or directory
permutations.S: 29 | #include "avr/io.h"
permutations.S: | ^~~~~~~~~~
permutations.S: compilation terminated.

Number of similar (compiler,implementation) pairs: 8, namely:
CompilerImplementations
gcc -march=native -mtune=native -O2 -fomit-frame-pointer -fwrapv -fPIC -fPIE avr
gcc -march=native -mtune=native -O3 -fomit-frame-pointer -fwrapv -fPIC -fPIE avr
gcc -march=native -mtune=native -O -fomit-frame-pointer -fwrapv -fPIC -fPIE avr
gcc -march=native -mtune=native -Os -fomit-frame-pointer -fwrapv -fPIC -fPIE avr
gcc -march=native -mtune=native -O2 -fomit-frame-pointer -fwrapv -fPIC -fPIE avr_lowsize
gcc -march=native -mtune=native -O3 -fomit-frame-pointer -fwrapv -fPIC -fPIE avr_lowsize
gcc -march=native -mtune=native -O -fomit-frame-pointer -fwrapv -fPIC -fPIE avr_lowsize
gcc -march=native -mtune=native -Os -fomit-frame-pointer -fwrapv -fPIC -fPIE avr_lowsize

Compiler output

Implementation: bi32_armv6
Security model: constbranchindex
Compiler: clang -mcpu=native -O3 -fomit-frame-pointer -fwrapv -Qunused-arguments -fPIC -fPIE
hash.c: In file included from hash.c:4:
hash.c: In file included from ./permutations.h:11:
hash.c: ./round.h:82:19: warning: value size does not match register size specified by the constraint and modifier [-Wasm-operand-widths]
hash.c: [tmp1] "=r"(tmp1)
hash.c: ^
hash.c: ./round.h:15:13: note: use constraint modifier "w"
hash.c: "ldrb %[tmp1], [%[C]], #1\n\t"
hash.c: ^~~~~~~
hash.c: %w[tmp1]
hash.c: ./round.h:78:19: warning: value size does not match register size specified by the constraint and modifier [-Wasm-operand-widths]
hash.c: [x0_l] "+r"(s->w[0][0]), [x0_h] "+r"(s->w[0][1]), [x1_l] "+r"(s->w[1][0]),
hash.c: ^
hash.c: ./round.h:16:12: note: use constraint modifier "w"
hash.c: "eor %[x0_l], %[x0_l], %[x4_l]\n\t"
hash.c: ^~~~~~~
hash.c: %w[x0_l]
hash.c: ./round.h:78:19: warning: value size does not match register size specified by the constraint and modifier [-Wasm-operand-widths]
hash.c: [x0_l] "+r"(s->w[0][0]), [x0_h] "+r"(s->w[0][1]), [x1_l] "+r"(s->w[1][0]),
hash.c: ^
hash.c: ./round.h:16:21: note: use constraint modifier "w"
hash.c: "eor %[x0_l], %[x0_l], %[x4_l]\n\t"
hash.c: ^~~~~~~
hash.c: %w[x0_l]
hash.c: ./round.h:80:69: warning: value size does not match register size specified by the constraint and modifier [-Wasm-operand-widths]
hash.c: [x3_l] "+r"(s->w[3][0]), [x3_h] "+r"(s->w[3][1]), [x4_l] "+r"(s->w[4][0]),
hash.c: ...

Number of similar (compiler,implementation) pairs: 1, namely:
CompilerImplementations
clang -mcpu=native -O3 -fomit-frame-pointer -fwrapv -Qunused-arguments -fPIC -fPIE bi32_armv6

Compiler output

Implementation: bi32_armv6
Security model: constbranchindex
Compiler: gcc -march=native -mtune=native -O2 -fomit-frame-pointer -fwrapv -fPIC -fPIE
permutations.c: /tmp/ccM8W5hl.s: Assembler messages:
permutations.c: /tmp/ccM8W5hl.s:105: Error: immediate out of range at operand 3 -- `eor x13,x13,9'
permutations.c: /tmp/ccM8W5hl.s:201: Error: immediate out of range at operand 3 -- `eor x8,x8,9'
permutations.c: /tmp/ccM8W5hl.s:263: Error: immediate out of range at operand 3 -- `eor x13,x13,9'
permutations.c: /tmp/ccM8W5hl.s:280: Error: immediate out of range at operand 3 -- `eor x6,x6,9'
permutations.c: /tmp/ccM8W5hl.s:517: Error: immediate out of range at operand 3 -- `eor x6,x6,9'
permutations.c: /tmp/ccM8W5hl.s:596: Error: immediate out of range at operand 3 -- `eor x7,x7,9'
permutations.c: /tmp/ccM8W5hl.s:737: Error: immediate out of range at operand 3 -- `eor x13,x13,9'
permutations.c: /tmp/ccM8W5hl.s:895: Error: immediate out of range at operand 3 -- `eor x13,x13,9'
permutations.c: /tmp/ccM8W5hl.s:1166: Error: immediate out of range at operand 3 -- `eor x6,x6,9'
permutations.c: /tmp/ccM8W5hl.s:1245: Error: immediate out of range at operand 3 -- `eor x7,x7,9'
permutations.c: /tmp/ccM8W5hl.s:1386: Error: immediate out of range at operand 3 -- `eor x13,x13,9'
permutations.c: /tmp/ccM8W5hl.s:1544: Error: immediate out of range at operand 3 -- `eor x13,x13,9'

Number of similar (compiler,implementation) pairs: 1, namely:
CompilerImplementations
gcc -march=native -mtune=native -O2 -fomit-frame-pointer -fwrapv -fPIC -fPIE bi32_armv6

Compiler output

Implementation: bi32_armv6
Security model: constbranchindex
Compiler: gcc -march=native -mtune=native -O3 -fomit-frame-pointer -fwrapv -fPIC -fPIE
permutations.c: /tmp/cc6tH7JG.s: Assembler messages:
permutations.c: /tmp/cc6tH7JG.s:105: Error: immediate out of range at operand 3 -- `eor x13,x13,9'
permutations.c: /tmp/cc6tH7JG.s:201: Error: immediate out of range at operand 3 -- `eor x8,x8,9'
permutations.c: /tmp/cc6tH7JG.s:263: Error: immediate out of range at operand 3 -- `eor x13,x13,9'
permutations.c: /tmp/cc6tH7JG.s:280: Error: immediate out of range at operand 3 -- `eor x6,x6,9'
permutations.c: /tmp/cc6tH7JG.s:517: Error: immediate out of range at operand 3 -- `eor x6,x6,9'
permutations.c: /tmp/cc6tH7JG.s:596: Error: immediate out of range at operand 3 -- `eor x7,x7,9'
permutations.c: /tmp/cc6tH7JG.s:737: Error: immediate out of range at operand 3 -- `eor x13,x13,9'
permutations.c: /tmp/cc6tH7JG.s:895: Error: immediate out of range at operand 3 -- `eor x13,x13,9'
permutations.c: /tmp/cc6tH7JG.s:1166: Error: immediate out of range at operand 3 -- `eor x6,x6,9'
permutations.c: /tmp/cc6tH7JG.s:1245: Error: immediate out of range at operand 3 -- `eor x7,x7,9'
permutations.c: /tmp/cc6tH7JG.s:1386: Error: immediate out of range at operand 3 -- `eor x13,x13,9'
permutations.c: /tmp/cc6tH7JG.s:1544: Error: immediate out of range at operand 3 -- `eor x13,x13,9'

Number of similar (compiler,implementation) pairs: 1, namely:
CompilerImplementations
gcc -march=native -mtune=native -O3 -fomit-frame-pointer -fwrapv -fPIC -fPIE bi32_armv6

Compiler output

Implementation: bi32_armv6
Security model: constbranchindex
Compiler: gcc -march=native -mtune=native -O -fomit-frame-pointer -fwrapv -fPIC -fPIE
permutations.c: /tmp/ccX9Z9oG.s: Assembler messages:
permutations.c: /tmp/ccX9Z9oG.s:106: Error: immediate out of range at operand 3 -- `eor x13,x13,9'
permutations.c: /tmp/ccX9Z9oG.s:202: Error: immediate out of range at operand 3 -- `eor x8,x8,9'
permutations.c: /tmp/ccX9Z9oG.s:264: Error: immediate out of range at operand 3 -- `eor x13,x13,9'
permutations.c: /tmp/ccX9Z9oG.s:281: Error: immediate out of range at operand 3 -- `eor x8,x8,9'
permutations.c: /tmp/ccX9Z9oG.s:518: Error: immediate out of range at operand 3 -- `eor x8,x8,9'
permutations.c: /tmp/ccX9Z9oG.s:597: Error: immediate out of range at operand 3 -- `eor x8,x8,9'
permutations.c: /tmp/ccX9Z9oG.s:738: Error: immediate out of range at operand 3 -- `eor x13,x13,9'
permutations.c: /tmp/ccX9Z9oG.s:896: Error: immediate out of range at operand 3 -- `eor x13,x13,9'
permutations.c: /tmp/ccX9Z9oG.s:1170: Error: immediate out of range at operand 3 -- `eor x8,x8,9'
permutations.c: /tmp/ccX9Z9oG.s:1249: Error: immediate out of range at operand 3 -- `eor x8,x8,9'
permutations.c: /tmp/ccX9Z9oG.s:1390: Error: immediate out of range at operand 3 -- `eor x13,x13,9'
permutations.c: /tmp/ccX9Z9oG.s:1548: Error: immediate out of range at operand 3 -- `eor x13,x13,9'

Number of similar (compiler,implementation) pairs: 1, namely:
CompilerImplementations
gcc -march=native -mtune=native -O -fomit-frame-pointer -fwrapv -fPIC -fPIE bi32_armv6

Compiler output

Implementation: bi32_armv6
Security model: constbranchindex
Compiler: gcc -march=native -mtune=native -Os -fomit-frame-pointer -fwrapv -fPIC -fPIE
permutations.c: /tmp/ccySCigE.s: Assembler messages:
permutations.c: /tmp/ccySCigE.s:104: Error: immediate out of range at operand 3 -- `eor x13,x13,9'
permutations.c: /tmp/ccySCigE.s:200: Error: immediate out of range at operand 3 -- `eor x8,x8,9'
permutations.c: /tmp/ccySCigE.s:262: Error: immediate out of range at operand 3 -- `eor x13,x13,9'
permutations.c: /tmp/ccySCigE.s:279: Error: immediate out of range at operand 3 -- `eor x8,x8,9'
permutations.c: /tmp/ccySCigE.s:516: Error: immediate out of range at operand 3 -- `eor x8,x8,9'
permutations.c: /tmp/ccySCigE.s:595: Error: immediate out of range at operand 3 -- `eor x8,x8,9'
permutations.c: /tmp/ccySCigE.s:736: Error: immediate out of range at operand 3 -- `eor x13,x13,9'
permutations.c: /tmp/ccySCigE.s:894: Error: immediate out of range at operand 3 -- `eor x13,x13,9'
permutations.c: /tmp/ccySCigE.s:1164: Error: immediate out of range at operand 3 -- `eor x8,x8,9'
permutations.c: /tmp/ccySCigE.s:1243: Error: immediate out of range at operand 3 -- `eor x8,x8,9'
permutations.c: /tmp/ccySCigE.s:1384: Error: immediate out of range at operand 3 -- `eor x13,x13,9'
permutations.c: /tmp/ccySCigE.s:1542: Error: immediate out of range at operand 3 -- `eor x13,x13,9'

Number of similar (compiler,implementation) pairs: 1, namely:
CompilerImplementations
gcc -march=native -mtune=native -Os -fomit-frame-pointer -fwrapv -fPIC -fPIE bi32_armv6

Compiler output

Implementation: bi32_armv6m
Security model: constbranchindex
Compiler: clang -mcpu=native -O3 -fomit-frame-pointer -fwrapv -Qunused-arguments -fPIC -fPIE
hash.c: In file included from hash.c:4:
hash.c: In file included from ./permutations.h:11:
hash.c: ./round.h:164:14: error: invalid output constraint '+l' in asm
hash.c: [x0_l] "+l"(s->w[0][0]), [x0_h] "+h"(s->w[0][1]), [x1_l] "+l"(s->w[1][0]),
hash.c: ^
hash.c: ./round.h:314:14: error: invalid output constraint '+l' in asm
hash.c: [x0_l] "+l"(s->w[0][0]), [x0_h] "+h"(s->w[0][1]), [x1_l] "+l"(s->w[1][0]),
hash.c: ^
hash.c: 2 errors generated.

Number of similar (compiler,implementation) pairs: 1, namely:
CompilerImplementations
clang -mcpu=native -O3 -fomit-frame-pointer -fwrapv -Qunused-arguments -fPIC -fPIE bi32_armv6m

Compiler output

Implementation: bi32_armv6m
Security model: constbranchindex
Compiler: gcc -march=native -mtune=native -O2 -fomit-frame-pointer -fwrapv -fPIC -fPIE
hash.c: In file included from permutations.h:11,
hash.c: from hash.c:4:
hash.c: hash.c: In function 'ascon_absorb':
hash.c: round.h:13:3: error: impossible constraint in 'asm'
hash.c: 13 | __asm__ __volatile__(
hash.c: | ^~~~~~~

Number of similar (compiler,implementation) pairs: 4, namely:
CompilerImplementations
gcc -march=native -mtune=native -O2 -fomit-frame-pointer -fwrapv -fPIC -fPIE bi32_armv6m
gcc -march=native -mtune=native -O3 -fomit-frame-pointer -fwrapv -fPIC -fPIE bi32_armv6m
gcc -march=native -mtune=native -O -fomit-frame-pointer -fwrapv -fPIC -fPIE bi32_armv6m
gcc -march=native -mtune=native -Os -fomit-frame-pointer -fwrapv -fPIC -fPIE bi32_armv6m

Compiler output

Implementation: bi32_armv7m
Security model: constbranchindex
Compiler: clang -mcpu=native -O3 -fomit-frame-pointer -fwrapv -Qunused-arguments -fPIC -fPIE
hash.c: In file included from hash.c:4:
hash.c: In file included from ./permutations.h:11:
hash.c: ./round.h:78:19: warning: value size does not match register size specified by the constraint and modifier [-Wasm-operand-widths]
hash.c: [tmp1] "=r"(tmp1)
hash.c: ^
hash.c: ./round.h:15:13: note: use constraint modifier "w"
hash.c: "ldrb %[tmp1], [%[C]], #1\n\t"
hash.c: ^~~~~~~
hash.c: %w[tmp1]
hash.c: ./round.h:74:19: warning: value size does not match register size specified by the constraint and modifier [-Wasm-operand-widths]
hash.c: [x0_l] "+r"(s->w[0][0]), [x0_h] "+r"(s->w[0][1]), [x1_l] "+r"(s->w[1][0]),
hash.c: ^
hash.c: ./round.h:16:12: note: use constraint modifier "w"
hash.c: "eor %[x0_l], %[x0_l], %[x4_l]\n\t"
hash.c: ^~~~~~~
hash.c: %w[x0_l]
hash.c: ./round.h:74:19: warning: value size does not match register size specified by the constraint and modifier [-Wasm-operand-widths]
hash.c: [x0_l] "+r"(s->w[0][0]), [x0_h] "+r"(s->w[0][1]), [x1_l] "+r"(s->w[1][0]),
hash.c: ^
hash.c: ./round.h:16:21: note: use constraint modifier "w"
hash.c: "eor %[x0_l], %[x0_l], %[x4_l]\n\t"
hash.c: ^~~~~~~
hash.c: %w[x0_l]
hash.c: ./round.h:76:69: warning: value size does not match register size specified by the constraint and modifier [-Wasm-operand-widths]
hash.c: [x3_l] "+r"(s->w[3][0]), [x3_h] "+r"(s->w[3][1]), [x4_l] "+r"(s->w[4][0]),
hash.c: ...

Number of similar (compiler,implementation) pairs: 2, namely:
CompilerImplementations
clang -mcpu=native -O3 -fomit-frame-pointer -fwrapv -Qunused-arguments -fPIC -fPIE bi32_armv7m bi32_armv7m_small

Compiler output

Implementation: bi32_armv7m
Security model: constbranchindex
Compiler: gcc -march=native -mtune=native -O2 -fomit-frame-pointer -fwrapv -fPIC -fPIE
hash.c: /tmp/ccXYSeBf.s: Assembler messages:
hash.c: /tmp/ccXYSeBf.s:313: Error: immediate out of range at operand 3 -- `eor x0,x0,9'
hash.c: /tmp/ccXYSeBf.s:390: Error: immediate out of range at operand 3 -- `eor x8,x8,9'
hash.c: /tmp/ccXYSeBf.s:527: Error: immediate out of range at operand 3 -- `eor x5,x5,9'
hash.c: /tmp/ccXYSeBf.s:641: Error: immediate out of range at operand 3 -- `eor x5,x5,9'
hash.c: /tmp/ccXYSeBf.s:906: Error: immediate out of range at operand 3 -- `eor x15,x15,9'
hash.c: /tmp/ccXYSeBf.s:999: Error: immediate out of range at operand 3 -- `eor x7,x7,9'
hash.c: /tmp/ccXYSeBf.s:1060: Error: immediate out of range at operand 3 -- `eor x15,x15,9'
hash.c: /tmp/ccXYSeBf.s:1076: Error: immediate out of range at operand 3 -- `eor x9,x9,9'
hash.c: /tmp/ccXYSeBf.s:1307: Error: immediate out of range at operand 3 -- `eor x9,x9,9'
hash.c: /tmp/ccXYSeBf.s:1384: Error: immediate out of range at operand 3 -- `eor x8,x8,9'
hash.c: /tmp/ccXYSeBf.s:1522: Error: immediate out of range at operand 3 -- `eor x15,x15,9'
hash.c: /tmp/ccXYSeBf.s:1655: Error: immediate out of range at operand 3 -- `eor x4,x4,9'
hash.c: /tmp/ccXYSeBf.s:1960: Error: immediate out of range at operand 3 -- `eor x8,x8,9'
hash.c: /tmp/ccXYSeBf.s:2037: Error: immediate out of range at operand 3 -- `eor x8,x8,9'
hash.c: /tmp/ccXYSeBf.s:2174: Error: immediate out of range at operand 3 -- `eor x4,x4,9'
hash.c: /tmp/ccXYSeBf.s:2288: Error: immediate out of range at operand 3 -- `eor x4,x4,9'
hash.c: /tmp/ccXYSeBf.s:2719: Error: immediate out of range at operand 3 -- `eor x6,x6,9'
hash.c: /tmp/ccXYSeBf.s:2796: Error: immediate out of range at operand 3 -- `eor x6,x6,9'
hash.c: /tmp/ccXYSeBf.s:2933: Error: immediate out of range at operand 3 -- `eor x4,x4,9'
hash.c: /tmp/ccXYSeBf.s:3047: Error: immediate out of range at operand 3 -- `eor x4,x4,9'
hash.c: /tmp/ccXYSeBf.s:3263: Error: immediate out of range at operand 3 -- `eor x15,x15,9'
hash.c: /tmp/ccXYSeBf.s:3356: Error: immediate out of range at operand 3 -- `eor x5,x5,9'
hash.c: /tmp/ccXYSeBf.s:3417: Error: immediate out of range at operand 3 -- `eor x15,x15,9'
hash.c: /tmp/ccXYSeBf.s:3433: Error: immediate out of range at operand 3 -- `eor x7,x7,9'
hash.c: ...

Number of similar (compiler,implementation) pairs: 1, namely:
CompilerImplementations
gcc -march=native -mtune=native -O2 -fomit-frame-pointer -fwrapv -fPIC -fPIE bi32_armv7m

Compiler output

Implementation: bi32_armv7m
Security model: constbranchindex
Compiler: gcc -march=native -mtune=native -O3 -fomit-frame-pointer -fwrapv -fPIC -fPIE
hash.c: /tmp/ccUn67qy.s: Assembler messages:
hash.c: /tmp/ccUn67qy.s:313: Error: immediate out of range at operand 3 -- `eor x0,x0,9'
hash.c: /tmp/ccUn67qy.s:390: Error: immediate out of range at operand 3 -- `eor x8,x8,9'
hash.c: /tmp/ccUn67qy.s:527: Error: immediate out of range at operand 3 -- `eor x5,x5,9'
hash.c: /tmp/ccUn67qy.s:641: Error: immediate out of range at operand 3 -- `eor x5,x5,9'
hash.c: /tmp/ccUn67qy.s:906: Error: immediate out of range at operand 3 -- `eor x15,x15,9'
hash.c: /tmp/ccUn67qy.s:999: Error: immediate out of range at operand 3 -- `eor x7,x7,9'
hash.c: /tmp/ccUn67qy.s:1060: Error: immediate out of range at operand 3 -- `eor x15,x15,9'
hash.c: /tmp/ccUn67qy.s:1076: Error: immediate out of range at operand 3 -- `eor x9,x9,9'
hash.c: /tmp/ccUn67qy.s:1307: Error: immediate out of range at operand 3 -- `eor x9,x9,9'
hash.c: /tmp/ccUn67qy.s:1384: Error: immediate out of range at operand 3 -- `eor x8,x8,9'
hash.c: /tmp/ccUn67qy.s:1522: Error: immediate out of range at operand 3 -- `eor x15,x15,9'
hash.c: /tmp/ccUn67qy.s:1655: Error: immediate out of range at operand 3 -- `eor x4,x4,9'
hash.c: /tmp/ccUn67qy.s:1960: Error: immediate out of range at operand 3 -- `eor x8,x8,9'
hash.c: /tmp/ccUn67qy.s:2037: Error: immediate out of range at operand 3 -- `eor x8,x8,9'
hash.c: /tmp/ccUn67qy.s:2174: Error: immediate out of range at operand 3 -- `eor x4,x4,9'
hash.c: /tmp/ccUn67qy.s:2288: Error: immediate out of range at operand 3 -- `eor x4,x4,9'
hash.c: /tmp/ccUn67qy.s:2719: Error: immediate out of range at operand 3 -- `eor x6,x6,9'
hash.c: /tmp/ccUn67qy.s:2796: Error: immediate out of range at operand 3 -- `eor x6,x6,9'
hash.c: /tmp/ccUn67qy.s:2933: Error: immediate out of range at operand 3 -- `eor x4,x4,9'
hash.c: /tmp/ccUn67qy.s:3047: Error: immediate out of range at operand 3 -- `eor x4,x4,9'
hash.c: /tmp/ccUn67qy.s:3263: Error: immediate out of range at operand 3 -- `eor x15,x15,9'
hash.c: /tmp/ccUn67qy.s:3356: Error: immediate out of range at operand 3 -- `eor x5,x5,9'
hash.c: /tmp/ccUn67qy.s:3417: Error: immediate out of range at operand 3 -- `eor x15,x15,9'
hash.c: /tmp/ccUn67qy.s:3433: Error: immediate out of range at operand 3 -- `eor x7,x7,9'
hash.c: ...

Number of similar (compiler,implementation) pairs: 1, namely:
CompilerImplementations
gcc -march=native -mtune=native -O3 -fomit-frame-pointer -fwrapv -fPIC -fPIE bi32_armv7m

Compiler output

Implementation: bi32_armv7m
Security model: constbranchindex
Compiler: gcc -march=native -mtune=native -O -fomit-frame-pointer -fwrapv -fPIC -fPIE
hash.c: /tmp/cc0sWGJV.s: Assembler messages:
hash.c: /tmp/cc0sWGJV.s:337: Error: immediate out of range at operand 3 -- `eor x12,x12,9'
hash.c: /tmp/cc0sWGJV.s:414: Error: immediate out of range at operand 3 -- `eor x12,x12,9'
hash.c: /tmp/cc0sWGJV.s:551: Error: immediate out of range at operand 3 -- `eor x0,x0,9'
hash.c: /tmp/cc0sWGJV.s:665: Error: immediate out of range at operand 3 -- `eor x0,x0,9'
hash.c: /tmp/cc0sWGJV.s:957: Error: immediate out of range at operand 3 -- `eor x15,x15,9'
hash.c: /tmp/cc0sWGJV.s:1050: Error: immediate out of range at operand 3 -- `eor x10,x10,9'
hash.c: /tmp/cc0sWGJV.s:1111: Error: immediate out of range at operand 3 -- `eor x15,x15,9'
hash.c: /tmp/cc0sWGJV.s:1127: Error: immediate out of range at operand 3 -- `eor x10,x10,9'
hash.c: /tmp/cc0sWGJV.s:1358: Error: immediate out of range at operand 3 -- `eor x10,x10,9'
hash.c: /tmp/cc0sWGJV.s:1435: Error: immediate out of range at operand 3 -- `eor x10,x10,9'
hash.c: /tmp/cc0sWGJV.s:1573: Error: immediate out of range at operand 3 -- `eor x15,x15,9'
hash.c: /tmp/cc0sWGJV.s:1706: Error: immediate out of range at operand 3 -- `eor x4,x4,9'
hash.c: /tmp/cc0sWGJV.s:2034: Error: immediate out of range at operand 3 -- `eor x15,x15,9'
hash.c: /tmp/cc0sWGJV.s:2111: Error: immediate out of range at operand 3 -- `eor x15,x15,9'
hash.c: /tmp/cc0sWGJV.s:2248: Error: immediate out of range at operand 3 -- `eor x5,x5,9'
hash.c: /tmp/cc0sWGJV.s:2362: Error: immediate out of range at operand 3 -- `eor x5,x5,9'
hash.c: /tmp/cc0sWGJV.s:2837: Error: immediate out of range at operand 3 -- `eor x14,x14,9'
hash.c: /tmp/cc0sWGJV.s:2914: Error: immediate out of range at operand 3 -- `eor x14,x14,9'
hash.c: /tmp/cc0sWGJV.s:3051: Error: immediate out of range at operand 3 -- `eor x2,x2,9'
hash.c: /tmp/cc0sWGJV.s:3165: Error: immediate out of range at operand 3 -- `eor x2,x2,9'
hash.c: /tmp/cc0sWGJV.s:3410: Error: immediate out of range at operand 3 -- `eor x12,x12,9'
hash.c: /tmp/cc0sWGJV.s:3503: Error: immediate out of range at operand 3 -- `eor x7,x7,9'
hash.c: /tmp/cc0sWGJV.s:3564: Error: immediate out of range at operand 3 -- `eor x12,x12,9'
hash.c: /tmp/cc0sWGJV.s:3580: Error: immediate out of range at operand 3 -- `eor x7,x7,9'
hash.c: ...

Number of similar (compiler,implementation) pairs: 1, namely:
CompilerImplementations
gcc -march=native -mtune=native -O -fomit-frame-pointer -fwrapv -fPIC -fPIE bi32_armv7m

Compiler output

Implementation: bi32_armv7m
Security model: constbranchindex
Compiler: gcc -march=native -mtune=native -Os -fomit-frame-pointer -fwrapv -fPIC -fPIE
hash.c: /tmp/ccCa8gtG.s: Assembler messages:
hash.c: /tmp/ccCa8gtG.s:368: Error: immediate out of range at operand 3 -- `eor x10,x10,9'
hash.c: /tmp/ccCa8gtG.s:445: Error: immediate out of range at operand 3 -- `eor x10,x10,9'
hash.c: /tmp/ccCa8gtG.s:582: Error: immediate out of range at operand 3 -- `eor x6,x6,9'
hash.c: /tmp/ccCa8gtG.s:696: Error: immediate out of range at operand 3 -- `eor x6,x6,9'
hash.c: /tmp/ccCa8gtG.s:885: Error: immediate out of range at operand 3 -- `eor x15,x15,9'
hash.c: /tmp/ccCa8gtG.s:978: Error: immediate out of range at operand 3 -- `eor x10,x10,9'
hash.c: /tmp/ccCa8gtG.s:1039: Error: immediate out of range at operand 3 -- `eor x15,x15,9'
hash.c: /tmp/ccCa8gtG.s:1055: Error: immediate out of range at operand 3 -- `eor x10,x10,9'
hash.c: /tmp/ccCa8gtG.s:1286: Error: immediate out of range at operand 3 -- `eor x10,x10,9'
hash.c: /tmp/ccCa8gtG.s:1363: Error: immediate out of range at operand 3 -- `eor x10,x10,9'
hash.c: /tmp/ccCa8gtG.s:1501: Error: immediate out of range at operand 3 -- `eor x15,x15,9'
hash.c: /tmp/ccCa8gtG.s:1634: Error: immediate out of range at operand 3 -- `eor x5,x5,9'
hash.c: /tmp/ccCa8gtG.s:1937: Error: immediate out of range at operand 3 -- `eor x13,x13,9'
hash.c: /tmp/ccCa8gtG.s:2014: Error: immediate out of range at operand 3 -- `eor x13,x13,9'
hash.c: /tmp/ccCa8gtG.s:2151: Error: immediate out of range at operand 3 -- `eor x5,x5,9'
hash.c: /tmp/ccCa8gtG.s:2265: Error: immediate out of range at operand 3 -- `eor x5,x5,9'
hash.c: /tmp/ccCa8gtG.s:2547: Error: immediate out of range at operand 3 -- `eor x12,x12,9'
hash.c: /tmp/ccCa8gtG.s:2640: Error: immediate out of range at operand 3 -- `eor x7,x7,9'
hash.c: /tmp/ccCa8gtG.s:2701: Error: immediate out of range at operand 3 -- `eor x12,x12,9'
hash.c: /tmp/ccCa8gtG.s:2717: Error: immediate out of range at operand 3 -- `eor x7,x7,9'
hash.c: /tmp/ccCa8gtG.s:2948: Error: immediate out of range at operand 3 -- `eor x7,x7,9'
hash.c: /tmp/ccCa8gtG.s:3025: Error: immediate out of range at operand 3 -- `eor x7,x7,9'
hash.c: /tmp/ccCa8gtG.s:3163: Error: immediate out of range at operand 3 -- `eor x12,x12,9'
hash.c: /tmp/ccCa8gtG.s:3296: Error: immediate out of range at operand 3 -- `eor x4,x4,9'
hash.c: ...

Number of similar (compiler,implementation) pairs: 1, namely:
CompilerImplementations
gcc -march=native -mtune=native -Os -fomit-frame-pointer -fwrapv -fPIC -fPIE bi32_armv7m

Compiler output

Implementation: bi32_armv7m_small
Security model: constbranchindex
Compiler: gcc -march=native -mtune=native -O2 -fomit-frame-pointer -fwrapv -fPIC -fPIE
permutations.c: /tmp/ccLBr223.s: Assembler messages:
permutations.c: /tmp/ccLBr223.s:26: Error: operand mismatch -- `ldrb x14,[x1],#1'
permutations.c: /tmp/ccLBr223.s:26: Info: did you mean this?
permutations.c: /tmp/ccLBr223.s:26: Info: ldrb w14, [x1], #1
permutations.c: /tmp/ccLBr223.s:41: Error: operand mismatch -- `ldrb x14,[x1],#1'
permutations.c: /tmp/ccLBr223.s:41: Info: did you mean this?
permutations.c: /tmp/ccLBr223.s:41: Info: ldrb w14, [x1], #1

Number of similar (compiler,implementation) pairs: 1, namely:
CompilerImplementations
gcc -march=native -mtune=native -O2 -fomit-frame-pointer -fwrapv -fPIC -fPIE bi32_armv7m_small

Compiler output

Implementation: bi32_armv7m_small
Security model: constbranchindex
Compiler: gcc -march=native -mtune=native -O3 -fomit-frame-pointer -fwrapv -fPIC -fPIE
permutations.c: /tmp/ccfMgwzk.s: Assembler messages:
permutations.c: /tmp/ccfMgwzk.s:26: Error: operand mismatch -- `ldrb x14,[x1],#1'
permutations.c: /tmp/ccfMgwzk.s:26: Info: did you mean this?
permutations.c: /tmp/ccfMgwzk.s:26: Info: ldrb w14, [x1], #1
permutations.c: /tmp/ccfMgwzk.s:41: Error: operand mismatch -- `ldrb x14,[x1],#1'
permutations.c: /tmp/ccfMgwzk.s:41: Info: did you mean this?
permutations.c: /tmp/ccfMgwzk.s:41: Info: ldrb w14, [x1], #1

Number of similar (compiler,implementation) pairs: 1, namely:
CompilerImplementations
gcc -march=native -mtune=native -O3 -fomit-frame-pointer -fwrapv -fPIC -fPIE bi32_armv7m_small

Compiler output

Implementation: bi32_armv7m_small
Security model: constbranchindex
Compiler: gcc -march=native -mtune=native -O -fomit-frame-pointer -fwrapv -fPIC -fPIE
permutations.c: /tmp/ccHDfQuZ.s: Assembler messages:
permutations.c: /tmp/ccHDfQuZ.s:30: Error: operand mismatch -- `ldrb x14,[x1],#1'
permutations.c: /tmp/ccHDfQuZ.s:30: Info: did you mean this?
permutations.c: /tmp/ccHDfQuZ.s:30: Info: ldrb w14, [x1], #1
permutations.c: /tmp/ccHDfQuZ.s:45: Error: operand mismatch -- `ldrb x14,[x1],#1'
permutations.c: /tmp/ccHDfQuZ.s:45: Info: did you mean this?
permutations.c: /tmp/ccHDfQuZ.s:45: Info: ldrb w14, [x1], #1

Number of similar (compiler,implementation) pairs: 1, namely:
CompilerImplementations
gcc -march=native -mtune=native -O -fomit-frame-pointer -fwrapv -fPIC -fPIE bi32_armv7m_small

Compiler output

Implementation: bi32_armv7m_small
Security model: constbranchindex
Compiler: gcc -march=native -mtune=native -Os -fomit-frame-pointer -fwrapv -fPIC -fPIE
permutations.c: /tmp/cc5tt0UX.s: Assembler messages:
permutations.c: /tmp/cc5tt0UX.s:25: Error: operand mismatch -- `ldrb x14,[x1],#1'
permutations.c: /tmp/cc5tt0UX.s:25: Info: did you mean this?
permutations.c: /tmp/cc5tt0UX.s:25: Info: ldrb w14, [x1], #1
permutations.c: /tmp/cc5tt0UX.s:40: Error: operand mismatch -- `ldrb x14,[x1],#1'
permutations.c: /tmp/cc5tt0UX.s:40: Info: did you mean this?
permutations.c: /tmp/cc5tt0UX.s:40: Info: ldrb w14, [x1], #1

Number of similar (compiler,implementation) pairs: 1, namely:
CompilerImplementations
gcc -march=native -mtune=native -Os -fomit-frame-pointer -fwrapv -fPIC -fPIE bi32_armv7m_small

Compiler output

Implementation: T:esp32
Security model: timingleaks
Compiler: clang -mcpu=native -O3 -fomit-frame-pointer -fwrapv -Qunused-arguments -fPIC -fPIE
try.c: /usr/bin/ld: /tmp/try-small-27f5e0.o: in function `doit':
try.c: try-small.c:(.text+0x...): undefined reference to `crypto_hash_asconhashav12_esp32_timingleaks'
try.c: /usr/bin/ld: /tmp/try-small-27f5e0.o: in function `test':
try.c: try-small.c:(.text+0x...): undefined reference to `crypto_hash_asconhashav12_esp32_timingleaks'
try.c: /usr/bin/ld: try-small.c:(.text+0x...): undefined reference to `crypto_hash_asconhashav12_esp32_timingleaks'
try.c: /usr/bin/ld: try-small.c:(.text+0x...): undefined reference to `crypto_hash_asconhashav12_esp32_timingleaks'
try.c: clang: error: linker command failed with exit code 1 (use -v to see invocation)

Number of similar (compiler,implementation) pairs: 1, namely:
CompilerImplementations
clang -mcpu=native -O3 -fomit-frame-pointer -fwrapv -Qunused-arguments -fPIC -fPIE T:esp32

Compiler output

Implementation: T:esp32
Security model: timingleaks
Compiler: gcc -march=native -mtune=native -O2 -fomit-frame-pointer -fwrapv -fPIC -fPIE
try.c: /usr/bin/ld: /tmp/ccZJm0k8.o: in function `doit':
try.c: try-small.c:(.text+0x...): undefined reference to `crypto_hash_asconhashav12_esp32_timingleaks'
try.c: /usr/bin/ld: /tmp/ccZJm0k8.o: in function `test':
try.c: try-small.c:(.text+0x...): undefined reference to `crypto_hash_asconhashav12_esp32_timingleaks'
try.c: /usr/bin/ld: try-small.c:(.text+0x...): undefined reference to `crypto_hash_asconhashav12_esp32_timingleaks'
try.c: /usr/bin/ld: try-small.c:(.text+0x...): undefined reference to `crypto_hash_asconhashav12_esp32_timingleaks'
try.c: collect2: error: ld returned 1 exit status

Number of similar (compiler,implementation) pairs: 1, namely:
CompilerImplementations
gcc -march=native -mtune=native -O2 -fomit-frame-pointer -fwrapv -fPIC -fPIE T:esp32

Compiler output

Implementation: T:esp32
Security model: timingleaks
Compiler: gcc -march=native -mtune=native -O3 -fomit-frame-pointer -fwrapv -fPIC -fPIE
try.c: /usr/bin/ld: /tmp/ccWIBLMG.o: in function `doit':
try.c: try-small.c:(.text+0x...): undefined reference to `crypto_hash_asconhashav12_esp32_timingleaks'
try.c: /usr/bin/ld: /tmp/ccWIBLMG.o: in function `test':
try.c: try-small.c:(.text+0x...): undefined reference to `crypto_hash_asconhashav12_esp32_timingleaks'
try.c: /usr/bin/ld: try-small.c:(.text+0x...): undefined reference to `crypto_hash_asconhashav12_esp32_timingleaks'
try.c: /usr/bin/ld: try-small.c:(.text+0x...): undefined reference to `crypto_hash_asconhashav12_esp32_timingleaks'
try.c: collect2: error: ld returned 1 exit status

Number of similar (compiler,implementation) pairs: 1, namely:
CompilerImplementations
gcc -march=native -mtune=native -O3 -fomit-frame-pointer -fwrapv -fPIC -fPIE T:esp32

Compiler output

Implementation: T:esp32
Security model: timingleaks
Compiler: gcc -march=native -mtune=native -O -fomit-frame-pointer -fwrapv -fPIC -fPIE
try.c: /usr/bin/ld: /tmp/ccCb8AfF.o: in function `doit':
try.c: try-small.c:(.text+0x...): undefined reference to `crypto_hash_asconhashav12_esp32_timingleaks'
try.c: /usr/bin/ld: /tmp/ccCb8AfF.o: in function `test':
try.c: try-small.c:(.text+0x...): undefined reference to `crypto_hash_asconhashav12_esp32_timingleaks'
try.c: /usr/bin/ld: try-small.c:(.text+0x...): undefined reference to `crypto_hash_asconhashav12_esp32_timingleaks'
try.c: /usr/bin/ld: try-small.c:(.text+0x...): undefined reference to `crypto_hash_asconhashav12_esp32_timingleaks'
try.c: collect2: error: ld returned 1 exit status

Number of similar (compiler,implementation) pairs: 1, namely:
CompilerImplementations
gcc -march=native -mtune=native -O -fomit-frame-pointer -fwrapv -fPIC -fPIE T:esp32

Compiler output

Implementation: T:esp32
Security model: timingleaks
Compiler: gcc -march=native -mtune=native -Os -fomit-frame-pointer -fwrapv -fPIC -fPIE
try.c: /usr/bin/ld: /tmp/cczKcdfg.o: in function `doit':
try.c: try-small.c:(.text+0x...): undefined reference to `crypto_hash_asconhashav12_esp32_timingleaks'
try.c: /usr/bin/ld: /tmp/cczKcdfg.o: in function `test':
try.c: try-small.c:(.text+0x...): undefined reference to `crypto_hash_asconhashav12_esp32_timingleaks'
try.c: /usr/bin/ld: try-small.c:(.text+0x...): undefined reference to `crypto_hash_asconhashav12_esp32_timingleaks'
try.c: /usr/bin/ld: try-small.c:(.text+0x...): undefined reference to `crypto_hash_asconhashav12_esp32_timingleaks'
try.c: collect2: error: ld returned 1 exit status

Number of similar (compiler,implementation) pairs: 1, namely:
CompilerImplementations
gcc -march=native -mtune=native -Os -fomit-frame-pointer -fwrapv -fPIC -fPIE T:esp32