Implementation notes: aarch64, pi4b, crypto_aead/aes128n12t8clocv2

Computer: pi4b
Architecture: aarch64
CPU ID: 410fd083
SUPERCOP version: 20211108
Operation: crypto_aead
Primitive: aes128n12t8clocv2
TimeObject sizeTest sizeImplementationCompilerBenchmark dateSUPERCOP version
13248821877 0 036303 784 856T:refclang_-mcpu=native_-O3_-fomit-frame-pointer_-fwrapv_-Qunused-arguments_-fPIC_-fPIE2021111220211108
14864221177 0 032404 800 840T:refgcc_-march=native_-mtune=native_-Os_-fomit-frame-pointer_-fwrapv_-fPIC_-fPIE2021111220211108
15186521915 0 034268 816 848T:refgcc_-march=native_-mtune=native_-O_-fomit-frame-pointer_-fwrapv_-fPIC_-fPIE2021111220211108
15628724279 0 037492 816 864T:refgcc_-march=native_-mtune=native_-O3_-fomit-frame-pointer_-fwrapv_-fPIC_-fPIE2021111220211108
15919721559 0 037904 816 848T:refgcc_-march=native_-mtune=native_-O2_-fomit-frame-pointer_-fwrapv_-fPIC_-fPIE2021111220211108

Compiler output

Implementation: T:aesni
Security model: timingleaks
Compiler: clang -mcpu=native -O3 -fomit-frame-pointer -fwrapv -Qunused-arguments -fPIC -fPIE
encrypt.c: In file included from encrypt.c:5:
encrypt.c: In file included from /usr/lib/llvm-13/lib/clang/13.0.0/include/xmmintrin.h:13:
encrypt.c: /usr/lib/llvm-13/lib/clang/13.0.0/include/mmintrin.h:50:12: error: invalid conversion between vector type '__m64' (vector of 1 'long long' value) and integer type 'int' of different size
encrypt.c: return (__m64)__builtin_ia32_vec_init_v2si(__i, 0);
encrypt.c: ^~~~~~~~~~~~~~~~~~~~~~~~~~~~~~~~~~~~~~~~~~~
encrypt.c: /usr/lib/llvm-13/lib/clang/13.0.0/include/mmintrin.h:129:12: error: invalid conversion between vector type '__m64' (vector of 1 'long long' value) and integer type 'int' of different size
encrypt.c: return (__m64)__builtin_ia32_packsswb((__v4hi)__m1, (__v4hi)__m2);
encrypt.c: ^~~~~~~~~~~~~~~~~~~~~~~~~~~~~~~~~~~~~~~~~~~~~~~~~~~~~~~~~~
encrypt.c: /usr/lib/llvm-13/lib/clang/13.0.0/include/mmintrin.h:159:12: error: invalid conversion between vector type '__m64' (vector of 1 'long long' value) and integer type 'int' of different size
encrypt.c: return (__m64)__builtin_ia32_packssdw((__v2si)__m1, (__v2si)__m2);
encrypt.c: ^~~~~~~~~~~~~~~~~~~~~~~~~~~~~~~~~~~~~~~~~~~~~~~~~~~~~~~~~~
encrypt.c: /usr/lib/llvm-13/lib/clang/13.0.0/include/mmintrin.h:189:12: error: invalid conversion between vector type '__m64' (vector of 1 'long long' value) and integer type 'int' of different size
encrypt.c: return (__m64)__builtin_ia32_packuswb((__v4hi)__m1, (__v4hi)__m2);
encrypt.c: ^~~~~~~~~~~~~~~~~~~~~~~~~~~~~~~~~~~~~~~~~~~~~~~~~~~~~~~~~~
encrypt.c: /usr/lib/llvm-13/lib/clang/13.0.0/include/mmintrin.h:216:12: error: invalid conversion between vector type '__m64' (vector of 1 'long long' value) and integer type 'int' of different size
encrypt.c: return (__m64)__builtin_ia32_punpckhbw((__v8qi)__m1, (__v8qi)__m2);
encrypt.c: ^~~~~~~~~~~~~~~~~~~~~~~~~~~~~~~~~~~~~~~~~~~~~~~~~~~~~~~~~~~
encrypt.c: /usr/lib/llvm-13/lib/clang/13.0.0/include/mmintrin.h:239:12: error: invalid conversion between vector type '__m64' (vector of 1 'long long' value) and integer type 'int' of different size
encrypt.c: return (__m64)__builtin_ia32_punpckhwd((__v4hi)__m1, (__v4hi)__m2);
encrypt.c: ^~~~~~~~~~~~~~~~~~~~~~~~~~~~~~~~~~~~~~~~~~~~~~~~~~~~~~~~~~~
encrypt.c: /usr/lib/llvm-13/lib/clang/13.0.0/include/mmintrin.h:260:12: error: invalid conversion between vector type '__m64' (vector of 1 'long long' value) and integer type 'int' of different size
encrypt.c: return (__m64)__builtin_ia32_punpckhdq((__v2si)__m1, (__v2si)__m2);
encrypt.c: ^~~~~~~~~~~~~~~~~~~~~~~~~~~~~~~~~~~~~~~~~~~~~~~~~~~~~~~~~~~
encrypt.c: /usr/lib/llvm-13/lib/clang/13.0.0/include/mmintrin.h:287:12: error: invalid conversion between vector type '__m64' (vector of 1 'long long' value) and integer type 'int' of different size
encrypt.c: return (__m64)__builtin_ia32_punpcklbw((__v8qi)__m1, (__v8qi)__m2);
encrypt.c: ...

Number of similar (compiler,implementation) pairs: 1, namely:
CompilerImplementations
clang -mcpu=native -O3 -fomit-frame-pointer -fwrapv -Qunused-arguments -fPIC -fPIE T:aesni

Compiler output

Implementation: T:aesni
Security model: timingleaks
Compiler: gcc -march=native -mtune=native -O2 -fomit-frame-pointer -fwrapv -fPIC -fPIE
encrypt.c: encrypt.c:5:10: fatal error: xmmintrin.h: No such file or directory
encrypt.c: 5 | #include <xmmintrin.h> /* SSE instructions and _mm_malloc */
encrypt.c: | ^~~~~~~~~~~~~
encrypt.c: compilation terminated.

Number of similar (compiler,implementation) pairs: 4, namely:
CompilerImplementations
gcc -march=native -mtune=native -O2 -fomit-frame-pointer -fwrapv -fPIC -fPIE T:aesni
gcc -march=native -mtune=native -O3 -fomit-frame-pointer -fwrapv -fPIC -fPIE T:aesni
gcc -march=native -mtune=native -O -fomit-frame-pointer -fwrapv -fPIC -fPIE T:aesni
gcc -march=native -mtune=native -Os -fomit-frame-pointer -fwrapv -fPIC -fPIE T:aesni