Implementation notes: aarch64, pi3bplus, crypto_stream/chacha8

Computer: pi3bplus
Architecture: aarch64
CPU ID: 410fd034
SUPERCOP version: 20210529
Operation: crypto_stream
Primitive: chacha8
TimeObject sizeTest sizeImplementationCompilerBenchmark dateSUPERCOP version
40884604 0 417072 856 808dolbeau/arm-neongcc_-march=native_-mtune=native_-O3_-fomit-frame-pointer_-fwrapv_-fPIC_-fPIE2020083020200826
41053912 0 415055 848 792dolbeau/arm-neongcc_-march=native_-mtune=native_-O2_-fomit-frame-pointer_-fwrapv_-fPIC_-fPIE2020083020200826
41563836 0 116813 768 808dolbeau/arm-neonclang_-mcpu=native_-O3_-fomit-frame-pointer_-fwrapv_-Qunused-arguments_-fPIC_-fPIE2020083020200826
46593324 0 413607 832 784dolbeau/arm-neongcc_-march=native_-mtune=native_-Os_-fomit-frame-pointer_-fwrapv_-fPIC_-fPIE2020083020200826
61352360 0 413487 848 792e/mergedgcc_-march=native_-mtune=native_-O2_-fomit-frame-pointer_-fwrapv_-fPIC_-fPIE2020083020200826
62303212 0 415672 856 808e/mergedgcc_-march=native_-mtune=native_-O3_-fomit-frame-pointer_-fwrapv_-fPIC_-fPIE2020083020200826
62504308 0 415543 848 792dolbeau/arm-neongcc_-march=native_-mtune=native_-O_-fomit-frame-pointer_-fwrapv_-fPIC_-fPIE2020083020200826
66212044 0 412335 832 784e/mergedgcc_-march=native_-mtune=native_-Os_-fomit-frame-pointer_-fwrapv_-fPIC_-fPIE2020083020200826
67142940 0 415416 856 808dolbeau/mipsel-msagcc_-march=native_-mtune=native_-O3_-fomit-frame-pointer_-fwrapv_-fPIC_-fPIE2020083020200826
67812948 0 415416 856 808e/regsgcc_-march=native_-mtune=native_-O3_-fomit-frame-pointer_-fwrapv_-fPIC_-fPIE2020083020200826
67922948 0 415416 856 808e/refgcc_-march=native_-mtune=native_-O3_-fomit-frame-pointer_-fwrapv_-fPIC_-fPIE2020083020200826
77232676 0 115645 768 808e/mergedclang_-mcpu=native_-O3_-fomit-frame-pointer_-fwrapv_-Qunused-arguments_-fPIC_-fPIE2020083020200826
82002444 0 115413 768 808dolbeau/mipsel-msaclang_-mcpu=native_-O3_-fomit-frame-pointer_-fwrapv_-Qunused-arguments_-fPIC_-fPIE2020083020200826
82022444 0 115397 768 808e/refclang_-mcpu=native_-O3_-fomit-frame-pointer_-fwrapv_-Qunused-arguments_-fPIC_-fPIE2020083020200826
83042516 0 115485 768 808e/regsclang_-mcpu=native_-O3_-fomit-frame-pointer_-fwrapv_-Qunused-arguments_-fPIC_-fPIE2020083020200826
141392180 0 413335 848 792e/regsgcc_-march=native_-mtune=native_-O2_-fomit-frame-pointer_-fwrapv_-fPIC_-fPIE2020083020200826
176203732 0 414959 848 792e/mergedgcc_-march=native_-mtune=native_-O_-fomit-frame-pointer_-fwrapv_-fPIC_-fPIE2020083020200826
217251816 0 412111 832 784dolbeau/mipsel-msagcc_-march=native_-mtune=native_-Os_-fomit-frame-pointer_-fwrapv_-fPIC_-fPIE2020083020200826
217261816 0 412095 832 784e/refgcc_-march=native_-mtune=native_-Os_-fomit-frame-pointer_-fwrapv_-fPIC_-fPIE2020083020200826
231051976 0 412239 832 784e/regsgcc_-march=native_-mtune=native_-Os_-fomit-frame-pointer_-fwrapv_-fPIC_-fPIE2020083020200826
234842184 0 413335 848 792dolbeau/mipsel-msagcc_-march=native_-mtune=native_-O2_-fomit-frame-pointer_-fwrapv_-fPIC_-fPIE2020083020200826
235162148 0 413295 848 792e/refgcc_-march=native_-mtune=native_-O2_-fomit-frame-pointer_-fwrapv_-fPIC_-fPIE2020083020200826
259133076 0 414303 848 792e/regsgcc_-march=native_-mtune=native_-O_-fomit-frame-pointer_-fwrapv_-fPIC_-fPIE2020083020200826
317112600 0 413823 848 792e/refgcc_-march=native_-mtune=native_-O_-fomit-frame-pointer_-fwrapv_-fPIC_-fPIE2020083020200826
317752600 0 413839 848 792dolbeau/mipsel-msagcc_-march=native_-mtune=native_-O_-fomit-frame-pointer_-fwrapv_-fPIC_-fPIE2020083020200826

Compiler output

Implementation: amd64-ssse3
Security model: constbranchindex
Compiler: clang -mcpu=native -O3 -fomit-frame-pointer -fwrapv -Qunused-arguments -fPIC -fPIE
chacha.S: chacha.S:19:5: error: unknown token in expression
chacha.S: mov %rsp,%r11
chacha.S: ^
chacha.S: chacha.S:19:5: error: invalid operand
chacha.S: mov %rsp,%r11
chacha.S: ^
chacha.S: chacha.S:20:5: error: invalid token in expression
chacha.S: and $31,%r11
chacha.S: ^
chacha.S: chacha.S:20:5: error: invalid operand
chacha.S: and $31,%r11
chacha.S: ^
chacha.S: chacha.S:21:5: error: invalid token in expression
chacha.S: add $384,%r11
chacha.S: ^
chacha.S: chacha.S:21:5: error: invalid operand
chacha.S: add $384,%r11
chacha.S: ^
chacha.S: chacha.S:22:5: error: unknown token in expression
chacha.S: sub %r11,%rsp
chacha.S: ^
chacha.S: chacha.S:22:5: error: invalid operand
chacha.S: sub %r11,%rsp
chacha.S: ^
chacha.S: chacha.S:23:5: error: unknown token in expression
chacha.S: ...

Number of similar (compiler,implementation) pairs: 1, namely:
CompilerImplementations
clang -mcpu=native -O3 -fomit-frame-pointer -fwrapv -Qunused-arguments -fPIC -fPIE amd64-ssse3

Compiler output

Implementation: amd64-ssse3
Security model: constbranchindex
Compiler: gcc -march=native -mtune=native -O2 -fomit-frame-pointer -fwrapv -fPIC -fPIE
chacha.S: chacha.S: Assembler messages:
chacha.S: chacha.S:19: Error: operand 1 must be an integer register -- `mov %rsp,%r11'
chacha.S: chacha.S:20: Error: operand 1 must be an integer or stack pointer register -- `and $31,%r11'
chacha.S: chacha.S:21: Error: operand 1 must be an integer or stack pointer register -- `add $384,%r11'
chacha.S: chacha.S:22: Error: operand 1 must be an integer or stack pointer register -- `sub %r11,%rsp'
chacha.S: chacha.S:23: Error: operand 1 must be an integer register -- `mov %rdi,%r8'
chacha.S: chacha.S:24: Error: operand 1 must be an integer register -- `mov %rsi,%rsi'
chacha.S: chacha.S:25: Error: operand 1 must be an integer register -- `mov %rsi,%rdi'
chacha.S: chacha.S:26: Error: operand 1 must be an integer register -- `mov %rdx,%rdx'
chacha.S: chacha.S:27: Error: operand 1 must be an integer or stack pointer register -- `cmp $0,%rdx'
chacha.S: chacha.S:29: Error: unknown mnemonic `jbe' -- `jbe ._done'
chacha.S: chacha.S:31: Error: operand 1 must be an integer register -- `mov $0,%rax'
chacha.S: chacha.S:33: Error: operand 1 must be an integer register -- `mov %rdx,%rcx'
chacha.S: chacha.S:35: Error: unknown mnemonic `rep' -- `rep stosb'
chacha.S: chacha.S:37: Error: operand 1 must be an integer or stack pointer register -- `sub %rdx,%rdi'
chacha.S: chacha.S:39: Error: unknown mnemonic `jmp' -- `jmp ._start'
chacha.S: chacha.S:47: Error: operand 1 must be an integer register -- `mov %rsp,%r11'
chacha.S: chacha.S:48: Error: operand 1 must be an integer or stack pointer register -- `and $31,%r11'
chacha.S: chacha.S:49: Error: operand 1 must be an integer or stack pointer register -- `add $384,%r11'
chacha.S: chacha.S:50: Error: operand 1 must be an integer or stack pointer register -- `sub %r11,%rsp'
chacha.S: chacha.S:52: Error: operand 1 must be an integer register -- `mov %rdi,%r8'
chacha.S: chacha.S:54: Error: operand 1 must be an integer register -- `mov %rsi,%rsi'
chacha.S: chacha.S:56: Error: operand 1 must be an integer register -- `mov %rdx,%rdi'
chacha.S: chacha.S:58: Error: operand 1 must be an integer register -- `mov %rcx,%rdx'
chacha.S: chacha.S:60: Error: operand 1 must be an integer or stack pointer register -- `cmp $0,%rdx'
chacha.S: ...

Number of similar (compiler,implementation) pairs: 4, namely:
CompilerImplementations
gcc -march=native -mtune=native -O2 -fomit-frame-pointer -fwrapv -fPIC -fPIE amd64-ssse3
gcc -march=native -mtune=native -O3 -fomit-frame-pointer -fwrapv -fPIC -fPIE amd64-ssse3
gcc -march=native -mtune=native -O -fomit-frame-pointer -fwrapv -fPIC -fPIE amd64-ssse3
gcc -march=native -mtune=native -Os -fomit-frame-pointer -fwrapv -fPIC -fPIE amd64-ssse3

Compiler output

Implementation: T:cryptopp
Security model: timingleaks
Compiler: g++ -march=native -mtune=native -O2 -fomit-frame-pointer -fwrapv -fPIC -fPIE
stream.cpp: stream.cpp:1:10: fatal error: cryptopp/chacha.h: No such file or directory
stream.cpp: #include <cryptopp/chacha.h>
stream.cpp: ^~~~~~~~~~~~~~~~~~~
stream.cpp: compilation terminated.

Number of similar (compiler,implementation) pairs: 4, namely:
CompilerImplementations
g++ -march=native -mtune=native -O2 -fomit-frame-pointer -fwrapv -fPIC -fPIE T:cryptopp
g++ -march=native -mtune=native -O3 -fomit-frame-pointer -fwrapv -fPIC -fPIE T:cryptopp
g++ -march=native -mtune=native -O -fomit-frame-pointer -fwrapv -fPIC -fPIE T:cryptopp
g++ -march=native -mtune=native -Os -fomit-frame-pointer -fwrapv -fPIC -fPIE T:cryptopp

Compiler output

Implementation: goll_gueron
Security model: constbranchindex
Compiler: clang -mcpu=native -O3 -fomit-frame-pointer -fwrapv -Qunused-arguments -fPIC -fPIE
stream.c: In file included from stream.c:11:
stream.c: In file included from /usr/lib/llvm-7/lib/clang/7.0.1/include/immintrin.h:28:
stream.c: /usr/lib/llvm-7/lib/clang/7.0.1/include/mmintrin.h:64:12: error: invalid conversion between vector type '__m64' (vector of 1 'long long' value) and integer type 'int' of different size
stream.c: return (__m64)__builtin_ia32_vec_init_v2si(__i, 0);
stream.c: ^~~~~~~~~~~~~~~~~~~~~~~~~~~~~~~~~~~~~~~~~~~
stream.c: /usr/lib/llvm-7/lib/clang/7.0.1/include/mmintrin.h:143:12: error: invalid conversion between vector type '__m64' (vector of 1 'long long' value) and integer type 'int' of different size
stream.c: return (__m64)__builtin_ia32_packsswb((__v4hi)__m1, (__v4hi)__m2);
stream.c: ^~~~~~~~~~~~~~~~~~~~~~~~~~~~~~~~~~~~~~~~~~~~~~~~~~~~~~~~~~
stream.c: /usr/lib/llvm-7/lib/clang/7.0.1/include/mmintrin.h:173:12: error: invalid conversion between vector type '__m64' (vector of 1 'long long' value) and integer type 'int' of different size
stream.c: return (__m64)__builtin_ia32_packssdw((__v2si)__m1, (__v2si)__m2);
stream.c: ^~~~~~~~~~~~~~~~~~~~~~~~~~~~~~~~~~~~~~~~~~~~~~~~~~~~~~~~~~
stream.c: /usr/lib/llvm-7/lib/clang/7.0.1/include/mmintrin.h:203:12: error: invalid conversion between vector type '__m64' (vector of 1 'long long' value) and integer type 'int' of different size
stream.c: return (__m64)__builtin_ia32_packuswb((__v4hi)__m1, (__v4hi)__m2);
stream.c: ^~~~~~~~~~~~~~~~~~~~~~~~~~~~~~~~~~~~~~~~~~~~~~~~~~~~~~~~~~
stream.c: /usr/lib/llvm-7/lib/clang/7.0.1/include/mmintrin.h:230:12: error: invalid conversion between vector type '__m64' (vector of 1 'long long' value) and integer type 'int' of different size
stream.c: return (__m64)__builtin_ia32_punpckhbw((__v8qi)__m1, (__v8qi)__m2);
stream.c: ^~~~~~~~~~~~~~~~~~~~~~~~~~~~~~~~~~~~~~~~~~~~~~~~~~~~~~~~~~~
stream.c: /usr/lib/llvm-7/lib/clang/7.0.1/include/mmintrin.h:253:12: error: invalid conversion between vector type '__m64' (vector of 1 'long long' value) and integer type 'int' of different size
stream.c: return (__m64)__builtin_ia32_punpckhwd((__v4hi)__m1, (__v4hi)__m2);
stream.c: ^~~~~~~~~~~~~~~~~~~~~~~~~~~~~~~~~~~~~~~~~~~~~~~~~~~~~~~~~~~
stream.c: /usr/lib/llvm-7/lib/clang/7.0.1/include/mmintrin.h:274:12: error: invalid conversion between vector type '__m64' (vector of 1 'long long' value) and integer type 'int' of different size
stream.c: return (__m64)__builtin_ia32_punpckhdq((__v2si)__m1, (__v2si)__m2);
stream.c: ^~~~~~~~~~~~~~~~~~~~~~~~~~~~~~~~~~~~~~~~~~~~~~~~~~~~~~~~~~~
stream.c: /usr/lib/llvm-7/lib/clang/7.0.1/include/mmintrin.h:301:12: error: invalid conversion between vector type '__m64' (vector of 1 'long long' value) and integer type 'int' of different size
stream.c: return (__m64)__builtin_ia32_punpcklbw((__v8qi)__m1, (__v8qi)__m2);
stream.c: ...

Number of similar (compiler,implementation) pairs: 1, namely:
CompilerImplementations
clang -mcpu=native -O3 -fomit-frame-pointer -fwrapv -Qunused-arguments -fPIC -fPIE goll_gueron

Compiler output

Implementation: goll_gueron
Security model: constbranchindex
Compiler: gcc -march=native -mtune=native -O2 -fomit-frame-pointer -fwrapv -fPIC -fPIE
stream.c: stream.c:11:10: fatal error: immintrin.h: No such file or directory
stream.c: #include <immintrin.h>
stream.c: ^~~~~~~~~~~~~
stream.c: compilation terminated.

Number of similar (compiler,implementation) pairs: 4, namely:
CompilerImplementations
gcc -march=native -mtune=native -O2 -fomit-frame-pointer -fwrapv -fPIC -fPIE goll_gueron
gcc -march=native -mtune=native -O3 -fomit-frame-pointer -fwrapv -fPIC -fPIE goll_gueron
gcc -march=native -mtune=native -O -fomit-frame-pointer -fwrapv -fPIC -fPIE goll_gueron
gcc -march=native -mtune=native -Os -fomit-frame-pointer -fwrapv -fPIC -fPIE goll_gueron

Compiler output

Implementation: krovetz/avx2
Security model: constbranchindex
Compiler: clang -mcpu=native -O3 -fomit-frame-pointer -fwrapv -Qunused-arguments -fPIC -fPIE
stream.c: In file included from stream.c:8:
stream.c: In file included from /usr/lib/llvm-7/lib/clang/7.0.1/include/immintrin.h:28:
stream.c: /usr/lib/llvm-7/lib/clang/7.0.1/include/mmintrin.h:64:12: error: invalid conversion between vector type '__m64' (vector of 1 'long long' value) and integer type 'int' of different size
stream.c: return (__m64)__builtin_ia32_vec_init_v2si(__i, 0);
stream.c: ^~~~~~~~~~~~~~~~~~~~~~~~~~~~~~~~~~~~~~~~~~~
stream.c: /usr/lib/llvm-7/lib/clang/7.0.1/include/mmintrin.h:143:12: error: invalid conversion between vector type '__m64' (vector of 1 'long long' value) and integer type 'int' of different size
stream.c: return (__m64)__builtin_ia32_packsswb((__v4hi)__m1, (__v4hi)__m2);
stream.c: ^~~~~~~~~~~~~~~~~~~~~~~~~~~~~~~~~~~~~~~~~~~~~~~~~~~~~~~~~~
stream.c: /usr/lib/llvm-7/lib/clang/7.0.1/include/mmintrin.h:173:12: error: invalid conversion between vector type '__m64' (vector of 1 'long long' value) and integer type 'int' of different size
stream.c: return (__m64)__builtin_ia32_packssdw((__v2si)__m1, (__v2si)__m2);
stream.c: ^~~~~~~~~~~~~~~~~~~~~~~~~~~~~~~~~~~~~~~~~~~~~~~~~~~~~~~~~~
stream.c: /usr/lib/llvm-7/lib/clang/7.0.1/include/mmintrin.h:203:12: error: invalid conversion between vector type '__m64' (vector of 1 'long long' value) and integer type 'int' of different size
stream.c: return (__m64)__builtin_ia32_packuswb((__v4hi)__m1, (__v4hi)__m2);
stream.c: ^~~~~~~~~~~~~~~~~~~~~~~~~~~~~~~~~~~~~~~~~~~~~~~~~~~~~~~~~~
stream.c: /usr/lib/llvm-7/lib/clang/7.0.1/include/mmintrin.h:230:12: error: invalid conversion between vector type '__m64' (vector of 1 'long long' value) and integer type 'int' of different size
stream.c: return (__m64)__builtin_ia32_punpckhbw((__v8qi)__m1, (__v8qi)__m2);
stream.c: ^~~~~~~~~~~~~~~~~~~~~~~~~~~~~~~~~~~~~~~~~~~~~~~~~~~~~~~~~~~
stream.c: /usr/lib/llvm-7/lib/clang/7.0.1/include/mmintrin.h:253:12: error: invalid conversion between vector type '__m64' (vector of 1 'long long' value) and integer type 'int' of different size
stream.c: return (__m64)__builtin_ia32_punpckhwd((__v4hi)__m1, (__v4hi)__m2);
stream.c: ^~~~~~~~~~~~~~~~~~~~~~~~~~~~~~~~~~~~~~~~~~~~~~~~~~~~~~~~~~~
stream.c: /usr/lib/llvm-7/lib/clang/7.0.1/include/mmintrin.h:274:12: error: invalid conversion between vector type '__m64' (vector of 1 'long long' value) and integer type 'int' of different size
stream.c: return (__m64)__builtin_ia32_punpckhdq((__v2si)__m1, (__v2si)__m2);
stream.c: ^~~~~~~~~~~~~~~~~~~~~~~~~~~~~~~~~~~~~~~~~~~~~~~~~~~~~~~~~~~
stream.c: /usr/lib/llvm-7/lib/clang/7.0.1/include/mmintrin.h:301:12: error: invalid conversion between vector type '__m64' (vector of 1 'long long' value) and integer type 'int' of different size
stream.c: return (__m64)__builtin_ia32_punpcklbw((__v8qi)__m1, (__v8qi)__m2);
stream.c: ...

Number of similar (compiler,implementation) pairs: 1, namely:
CompilerImplementations
clang -mcpu=native -O3 -fomit-frame-pointer -fwrapv -Qunused-arguments -fPIC -fPIE krovetz/avx2

Compiler output

Implementation: krovetz/avx2
Security model: constbranchindex
Compiler: gcc -march=native -mtune=native -O2 -fomit-frame-pointer -fwrapv -fPIC -fPIE
stream.c: stream.c:8:10: fatal error: immintrin.h: No such file or directory
stream.c: #include <immintrin.h>
stream.c: ^~~~~~~~~~~~~
stream.c: compilation terminated.

Number of similar (compiler,implementation) pairs: 4, namely:
CompilerImplementations
gcc -march=native -mtune=native -O2 -fomit-frame-pointer -fwrapv -fPIC -fPIE krovetz/avx2
gcc -march=native -mtune=native -O3 -fomit-frame-pointer -fwrapv -fPIC -fPIE krovetz/avx2
gcc -march=native -mtune=native -O -fomit-frame-pointer -fwrapv -fPIC -fPIE krovetz/avx2
gcc -march=native -mtune=native -Os -fomit-frame-pointer -fwrapv -fPIC -fPIE krovetz/avx2

Compiler output

Implementation: krovetz/vec128
Security model: constbranchindex
Compiler: clang -mcpu=native -O3 -fomit-frame-pointer -fwrapv -Qunused-arguments -fPIC -fPIE
stream.c: stream.c:80:2: error: -- Implementation supports only machines with neon, altivec or SSE2
stream.c: #error -- Implementation supports only machines with neon, altivec or SSE2
stream.c: ^
stream.c: stream.c:151:14: warning: implicit declaration of function 'NONCE' is invalid in C99 [-Wimplicit-function-declaration]
stream.c: vec s3 = NONCE(np);
stream.c: ^
stream.c: stream.c:151:9: error: initializing 'vec' (vector of 4 'unsigned int' values) with an expression of incompatible type 'int'
stream.c: vec s3 = NONCE(np);
stream.c: ^ ~~~~~~~~~
stream.c: stream.c:152:36: error: use of undeclared identifier 'VBPI'
stream.c: for (iters = 0; iters < inlen/(BPI*64); iters++) {
stream.c: ^
stream.c: stream.c:91:19: note: expanded from macro 'BPI'
stream.c: #define BPI (VBPI + GPR_TOO) /* Blocks computed per loop iteration */
stream.c: ^
stream.c: stream.c:152:36: error: use of undeclared identifier 'GPR_TOO'
stream.c: stream.c:91:26: note: expanded from macro 'BPI'
stream.c: #define BPI (VBPI + GPR_TOO) /* Blocks computed per loop iteration */
stream.c: ^
stream.c: stream.c:155:19: error: use of undeclared identifier 'ONE'
stream.c: v7 = v3 + ONE;
stream.c: ^
stream.c: stream.c:176:13: warning: implicit declaration of function 'ROTW16' is invalid in C99 [-Wimplicit-function-declaration]
stream.c: DQROUND_VECTORS(v0,v1,v2,v3)
stream.c: ^
stream.c: ...

Number of similar (compiler,implementation) pairs: 1, namely:
CompilerImplementations
clang -mcpu=native -O3 -fomit-frame-pointer -fwrapv -Qunused-arguments -fPIC -fPIE krovetz/vec128

Compiler output

Implementation: krovetz/vec128
Security model: constbranchindex
Compiler: gcc -march=native -mtune=native -O2 -fomit-frame-pointer -fwrapv -fPIC -fPIE
stream.c: stream.c:80:2: error: #error -- Implementation supports only machines with neon, altivec or SSE2
stream.c: #error -- Implementation supports only machines with neon, altivec or SSE2
stream.c: ^~~~~
stream.c: stream.c: In function 'crypto_stream_chacha8_krovetz_vec128_constbranchindex_xor':
stream.c: stream.c:151:14: warning: implicit declaration of function 'NONCE' [-Wimplicit-function-declaration]
stream.c: vec s3 = NONCE(np);
stream.c: ^~~~~
stream.c: stream.c:151:14: error: incompatible types when initializing type 'vec' {aka '__vector(4) unsigned int'} using type 'int'
stream.c: stream.c:91:19: error: 'VBPI' undeclared (first use in this function); did you mean 'BPI'?
stream.c: #define BPI (VBPI + GPR_TOO) /* Blocks computed per loop iteration */
stream.c: ^~~~
stream.c: stream.c:152:36: note: in expansion of macro 'BPI'
stream.c: for (iters = 0; iters < inlen/(BPI*64); iters++) {
stream.c: ^~~
stream.c: stream.c:91:19: note: each undeclared identifier is reported only once for each function it appears in
stream.c: #define BPI (VBPI + GPR_TOO) /* Blocks computed per loop iteration */
stream.c: ^~~~
stream.c: stream.c:152:36: note: in expansion of macro 'BPI'
stream.c: for (iters = 0; iters < inlen/(BPI*64); iters++) {
stream.c: ^~~
stream.c: stream.c:91:26: error: 'GPR_TOO' undeclared (first use in this function)
stream.c: #define BPI (VBPI + GPR_TOO) /* Blocks computed per loop iteration */
stream.c: ^~~~~~~
stream.c: stream.c:152:36: note: in expansion of macro 'BPI'
stream.c: for (iters = 0; iters < inlen/(BPI*64); iters++) {
stream.c: ...

Number of similar (compiler,implementation) pairs: 4, namely:
CompilerImplementations
gcc -march=native -mtune=native -O2 -fomit-frame-pointer -fwrapv -fPIC -fPIE krovetz/vec128
gcc -march=native -mtune=native -O3 -fomit-frame-pointer -fwrapv -fPIC -fPIE krovetz/vec128
gcc -march=native -mtune=native -O -fomit-frame-pointer -fwrapv -fPIC -fPIE krovetz/vec128
gcc -march=native -mtune=native -Os -fomit-frame-pointer -fwrapv -fPIC -fPIE krovetz/vec128