Implementation notes: aarch64, pi3aplus, crypto_dh/kumjacfp127g

Computer: pi3aplus
Microarchitecture: aarch64; A53 (410fd034)
Architecture: aarch64
CPU ID: 410fd034
SUPERCOP version: 20221122
Operation: crypto_dh
Primitive: kumjacfp127g

Compiler output

Implementation: T:v01/var
Security model: timingleaks
Compiler: clang -mcpu=native -O3 -fomit-frame-pointer -fwrapv -Qunused-arguments -fPIC -fPIE
divisor_aadd.s: divisor_aadd.s:7:8: error: unknown token in expression
divisor_aadd.s: pushq %r12
divisor_aadd.s: ^
divisor_aadd.s: divisor_aadd.s:7:8: error: invalid operand
divisor_aadd.s: pushq %r12
divisor_aadd.s: ^
divisor_aadd.s: divisor_aadd.s:8:8: error: unknown token in expression
divisor_aadd.s: pushq %rbp
divisor_aadd.s: ^
divisor_aadd.s: divisor_aadd.s:8:8: error: invalid operand
divisor_aadd.s: pushq %rbp
divisor_aadd.s: ^
divisor_aadd.s: divisor_aadd.s:9:7: error: unknown token in expression
divisor_aadd.s: movq %rsi, %rbp
divisor_aadd.s: ^
divisor_aadd.s: divisor_aadd.s:9:7: error: invalid operand
divisor_aadd.s: movq %rsi, %rbp
divisor_aadd.s: ^
divisor_aadd.s: divisor_aadd.s:10:8: error: unknown token in expression
divisor_aadd.s: movq (%rdi), %r12
divisor_aadd.s: ^
divisor_aadd.s: divisor_aadd.s:10:7: error: invalid operand
divisor_aadd.s: movq (%rdi), %r12
divisor_aadd.s: ^
divisor_aadd.s: divisor_aadd.s:11:8: error: unknown token in expression
divisor_aadd.s: ...

Number of similar (compiler,implementation) pairs: 13, namely:
CompilerImplementations
clang -mcpu=native -O3 -fomit-frame-pointer -fwrapv -Qunused-arguments -fPIC -fPIE T:v01/var T:v01/w4s01 T:v01/w4s02 T:v01/w4s04 T:v01/w4s08 T:v01/w4s16 T:v01/w4s32 T:v01/w8s01 T:v01/w8s02 T:v01/w8s04 T:v01/w8s08 T:v01/w8s16 T:v01/w8s32

Compiler output

Implementation: T:v01/var
Security model: timingleaks
Compiler: gcc -march=native -mtune=native -O2 -fomit-frame-pointer -fwrapv -fPIC -fPIE
divisor_aadd.s: divisor_aadd.s: Assembler messages:
divisor_aadd.s: divisor_aadd.s:7: Error: unknown mnemonic `pushq' -- `pushq %r12'
divisor_aadd.s: divisor_aadd.s:8: Error: unknown mnemonic `pushq' -- `pushq %rbp'
divisor_aadd.s: divisor_aadd.s:9: Error: unknown mnemonic `movq' -- `movq %rsi,%rbp'
divisor_aadd.s: divisor_aadd.s:10: Error: unknown mnemonic `movq' -- `movq (%rdi),%r12'
divisor_aadd.s: divisor_aadd.s:11: Error: unknown mnemonic `subq' -- `subq (%rbp),%r12'
divisor_aadd.s: divisor_aadd.s:12: Error: unknown mnemonic `movq' -- `movq 8(%rdi),%rsi'
divisor_aadd.s: divisor_aadd.s:13: Error: unknown mnemonic `sbbq' -- `sbbq 8(%rbp),%rsi'
divisor_aadd.s: divisor_aadd.s:14: Error: unknown mnemonic `btrq' -- `btrq $63,%rsi'
divisor_aadd.s: divisor_aadd.s:15: Error: unknown mnemonic `sbbq' -- `sbbq $0,%r12'
divisor_aadd.s: divisor_aadd.s:16: Error: unknown mnemonic `movq' -- `movq %r12,8*0+8*32(%rdi)'
divisor_aadd.s: divisor_aadd.s:17: Error: unknown mnemonic `sbbq' -- `sbbq $0,%rsi'
divisor_aadd.s: divisor_aadd.s:18: Error: unknown mnemonic `movq' -- `movq %rsi,8*1+8*32(%rdi)'
divisor_aadd.s: divisor_aadd.s:19: Error: unknown mnemonic `movq' -- `movq 16(%rdi),%r12'
divisor_aadd.s: divisor_aadd.s:20: Error: unknown mnemonic `subq' -- `subq 16(%rbp),%r12'
divisor_aadd.s: divisor_aadd.s:21: Error: unknown mnemonic `movq' -- `movq 24(%rdi),%rsi'
divisor_aadd.s: divisor_aadd.s:22: Error: unknown mnemonic `sbbq' -- `sbbq 24(%rbp),%rsi'
divisor_aadd.s: divisor_aadd.s:23: Error: unknown mnemonic `btrq' -- `btrq $63,%rsi'
divisor_aadd.s: divisor_aadd.s:24: Error: unknown mnemonic `sbbq' -- `sbbq $0,%r12'
divisor_aadd.s: divisor_aadd.s:25: Error: unknown mnemonic `movq' -- `movq %r12,8*0+8*34(%rdi)'
divisor_aadd.s: divisor_aadd.s:26: Error: unknown mnemonic `sbbq' -- `sbbq $0,%rsi'
divisor_aadd.s: divisor_aadd.s:27: Error: unknown mnemonic `movq' -- `movq %rsi,8*1+8*34(%rdi)'
divisor_aadd.s: divisor_aadd.s:28: Error: unknown mnemonic `movq' -- `movq 32(%rdi),%r12'
divisor_aadd.s: divisor_aadd.s:29: Error: unknown mnemonic `subq' -- `subq 32(%rbp),%r12'
divisor_aadd.s: divisor_aadd.s:30: Error: unknown mnemonic `movq' -- `movq 40(%rdi),%rsi'
divisor_aadd.s: ...

Number of similar (compiler,implementation) pairs: 51, namely:
CompilerImplementations
gcc -march=native -mtune=native -O2 -fomit-frame-pointer -fwrapv -fPIC -fPIE T:v01/var
gcc -march=native -mtune=native -O3 -fomit-frame-pointer -fwrapv -fPIC -fPIE T:v01/var
gcc -march=native -mtune=native -O -fomit-frame-pointer -fwrapv -fPIC -fPIE T:v01/var
gcc -march=native -mtune=native -Os -fomit-frame-pointer -fwrapv -fPIC -fPIE T:v01/var
gcc -march=native -mtune=native -O2 -fomit-frame-pointer -fwrapv -fPIC -fPIE T:v01/w4s01
gcc -march=native -mtune=native -O3 -fomit-frame-pointer -fwrapv -fPIC -fPIE T:v01/w4s01
gcc -march=native -mtune=native -O -fomit-frame-pointer -fwrapv -fPIC -fPIE T:v01/w4s01
gcc -march=native -mtune=native -Os -fomit-frame-pointer -fwrapv -fPIC -fPIE T:v01/w4s01
gcc -march=native -mtune=native -O2 -fomit-frame-pointer -fwrapv -fPIC -fPIE T:v01/w4s02
gcc -march=native -mtune=native -O3 -fomit-frame-pointer -fwrapv -fPIC -fPIE T:v01/w4s02
gcc -march=native -mtune=native -O -fomit-frame-pointer -fwrapv -fPIC -fPIE T:v01/w4s02
gcc -march=native -mtune=native -Os -fomit-frame-pointer -fwrapv -fPIC -fPIE T:v01/w4s02
gcc -march=native -mtune=native -O2 -fomit-frame-pointer -fwrapv -fPIC -fPIE T:v01/w4s04
gcc -march=native -mtune=native -O3 -fomit-frame-pointer -fwrapv -fPIC -fPIE T:v01/w4s04
gcc -march=native -mtune=native -O -fomit-frame-pointer -fwrapv -fPIC -fPIE T:v01/w4s04
gcc -march=native -mtune=native -Os -fomit-frame-pointer -fwrapv -fPIC -fPIE T:v01/w4s04
gcc -march=native -mtune=native -O2 -fomit-frame-pointer -fwrapv -fPIC -fPIE T:v01/w4s08
gcc -march=native -mtune=native -O3 -fomit-frame-pointer -fwrapv -fPIC -fPIE T:v01/w4s08
gcc -march=native -mtune=native -O -fomit-frame-pointer -fwrapv -fPIC -fPIE T:v01/w4s08
gcc -march=native -mtune=native -Os -fomit-frame-pointer -fwrapv -fPIC -fPIE T:v01/w4s08
gcc -march=native -mtune=native -O2 -fomit-frame-pointer -fwrapv -fPIC -fPIE T:v01/w4s16
gcc -march=native -mtune=native -O3 -fomit-frame-pointer -fwrapv -fPIC -fPIE T:v01/w4s16
gcc -march=native -mtune=native -O -fomit-frame-pointer -fwrapv -fPIC -fPIE T:v01/w4s16
gcc -march=native -mtune=native -Os -fomit-frame-pointer -fwrapv -fPIC -fPIE T:v01/w4s16
gcc -march=native -mtune=native -O2 -fomit-frame-pointer -fwrapv -fPIC -fPIE T:v01/w4s32
gcc -march=native -mtune=native -O3 -fomit-frame-pointer -fwrapv -fPIC -fPIE T:v01/w4s32
gcc -march=native -mtune=native -O -fomit-frame-pointer -fwrapv -fPIC -fPIE T:v01/w4s32
gcc -march=native -mtune=native -Os -fomit-frame-pointer -fwrapv -fPIC -fPIE T:v01/w4s32
gcc -march=native -mtune=native -O2 -fomit-frame-pointer -fwrapv -fPIC -fPIE T:v01/w8s01
gcc -march=native -mtune=native -O3 -fomit-frame-pointer -fwrapv -fPIC -fPIE T:v01/w8s01
gcc -march=native -mtune=native -O -fomit-frame-pointer -fwrapv -fPIC -fPIE T:v01/w8s01
gcc -march=native -mtune=native -Os -fomit-frame-pointer -fwrapv -fPIC -fPIE T:v01/w8s01
gcc -march=native -mtune=native -O2 -fomit-frame-pointer -fwrapv -fPIC -fPIE T:v01/w8s02
gcc -march=native -mtune=native -O3 -fomit-frame-pointer -fwrapv -fPIC -fPIE T:v01/w8s02
gcc -march=native -mtune=native -O -fomit-frame-pointer -fwrapv -fPIC -fPIE T:v01/w8s02
gcc -march=native -mtune=native -Os -fomit-frame-pointer -fwrapv -fPIC -fPIE T:v01/w8s02
gcc -march=native -mtune=native -O2 -fomit-frame-pointer -fwrapv -fPIC -fPIE T:v01/w8s04
gcc -march=native -mtune=native -O3 -fomit-frame-pointer -fwrapv -fPIC -fPIE T:v01/w8s04
gcc -march=native -mtune=native -O -fomit-frame-pointer -fwrapv -fPIC -fPIE T:v01/w8s04
gcc -march=native -mtune=native -Os -fomit-frame-pointer -fwrapv -fPIC -fPIE T:v01/w8s04
gcc -march=native -mtune=native -O2 -fomit-frame-pointer -fwrapv -fPIC -fPIE T:v01/w8s08
gcc -march=native -mtune=native -O3 -fomit-frame-pointer -fwrapv -fPIC -fPIE T:v01/w8s08
gcc -march=native -mtune=native -O -fomit-frame-pointer -fwrapv -fPIC -fPIE T:v01/w8s08
gcc -march=native -mtune=native -Os -fomit-frame-pointer -fwrapv -fPIC -fPIE T:v01/w8s08
gcc -march=native -mtune=native -O2 -fomit-frame-pointer -fwrapv -fPIC -fPIE T:v01/w8s16
gcc -march=native -mtune=native -O3 -fomit-frame-pointer -fwrapv -fPIC -fPIE T:v01/w8s16
gcc -march=native -mtune=native -O -fomit-frame-pointer -fwrapv -fPIC -fPIE T:v01/w8s16
gcc -march=native -mtune=native -Os -fomit-frame-pointer -fwrapv -fPIC -fPIE T:v01/w8s16
gcc -march=native -mtune=native -O2 -fomit-frame-pointer -fwrapv -fPIC -fPIE T:v01/w8s32
gcc -march=native -mtune=native -O3 -fomit-frame-pointer -fwrapv -fPIC -fPIE T:v01/w8s32
gcc -march=native -mtune=native -Os -fomit-frame-pointer -fwrapv -fPIC -fPIE T:v01/w8s32

Compiler output

Implementation: T:v01/w8s32
Security model: timingleaks
Compiler: gcc -march=native -mtune=native -O -fomit-frame-pointer -fwrapv -fPIC -fPIE
test.c: gcc: fatal error: Killed signal terminated program cc1
test.c: compilation terminated.

Number of similar (compiler,implementation) pairs: 1, namely:
CompilerImplementations
gcc -march=native -mtune=native -O -fomit-frame-pointer -fwrapv -fPIC -fPIE T:v01/w8s32