Implementation notes: aarch64, minimac, crypto_hash/xoodyakv1

Computer: minimac
Architecture: aarch64
CPU ID: unknown CPU ID
SUPERCOP version: 20210529
Operation: crypto_hash
Primitive: xoodyakv1
TimeObject sizeTest sizeImplementationCompilerBenchmark dateSUPERCOP version
30933? ? ?? ? ?T:xkcp/plain-uagcc_-march=native_-mtune=native_-O2_-fomit-frame-pointer_-fwrapv_-fPIC_-fPIE2021040220210326
31065? ? ?? ? ?T:xkcp/plain-uaclang_-mcpu=native_-O3_-fomit-frame-pointer_-fwrapv_-Qunused-arguments_-fPIC_-fPIE2021053020210529
33465? ? ?? ? ?T:xkcp/plain-uagcc_-march=native_-mtune=native_-O_-fomit-frame-pointer_-fwrapv_-fPIC_-fPIE2021040220210326
36666? ? ?? ? ?T:xkcp/plain-uagcc_-march=native_-mtune=native_-Os_-fomit-frame-pointer_-fwrapv_-fPIC_-fPIE2021040220210326
37999? ? ?? ? ?T:xkcp/plain-uagcc_-march=native_-mtune=native_-O3_-fomit-frame-pointer_-fwrapv_-fPIC_-fPIE2021040220210326
81063? ? ?? ? ?T:refclang_-mcpu=native_-O3_-fomit-frame-pointer_-fwrapv_-Qunused-arguments_-fPIC_-fPIE2021053020210529
82263? ? ?? ? ?T:refgcc_-march=native_-mtune=native_-O3_-fomit-frame-pointer_-fwrapv_-fPIC_-fPIE2021040220210326
145195? ? ?? ? ?T:refgcc_-march=native_-mtune=native_-O2_-fomit-frame-pointer_-fwrapv_-fPIC_-fPIE2021040220210326
148261? ? ?? ? ?T:refgcc_-march=native_-mtune=native_-Os_-fomit-frame-pointer_-fwrapv_-fPIC_-fPIE2021040220210326
197059? ? ?? ? ?T:refgcc_-march=native_-mtune=native_-O_-fomit-frame-pointer_-fwrapv_-fPIC_-fPIE2021040220210326
3853050? ? ?? ? ?T:refcppg++_-march=native_-mtune=native_-O3_-fomit-frame-pointer_-fwrapv_-fPIC_-fPIE2021040220210326
4009577? ? ?? ? ?T:refcppg++_-march=native_-mtune=native_-O2_-fomit-frame-pointer_-fwrapv_-fPIC_-fPIE2021040220210326
4269300? ? ?? ? ?T:refcppg++_-march=native_-mtune=native_-Os_-fomit-frame-pointer_-fwrapv_-fPIC_-fPIE2021040220210326
4272233? ? ?? ? ?T:refcppg++_-march=native_-mtune=native_-O_-fomit-frame-pointer_-fwrapv_-fPIC_-fPIE2021040220210326

Compiler output

Implementation: T:ref
Security model: timingleaks
Compiler: clang -mcpu=native -O3 -fomit-frame-pointer -fwrapv -Qunused-arguments -fPIC -fPIE
try.c: ld: warning: object file (/Users/djb/supercop-20210529/supercop-data/minimac/aarch64/lib/kernelrandombytes.o) was built for newer macOS version (11.3) than being linked (11.0)
try.c: ld: warning: object file (/Users/djb/supercop-20210529/supercop-data/minimac/aarch64/lib/cpucycles.o) was built for newer macOS version (11.3) than being linked (11.0)
try.c: ld: warning: could not create compact unwind for _init: registers 21 and 22 not saved contiguously in frame
try.c: ld: warning: object file (/Users/djb/supercop-20210529/supercop-data/minimac/aarch64/lib/kernelrandombytes.o) was built for newer macOS version (11.3) than being linked (11.0)ld: warning: object file (/Users/djb/supercop-20210529/supercop-data/minimac/aarch64/lib/cpucycles.o) was built for newer macOS version (11.3) than being linked (11.0)
try.c:
try.c: ld: warning: could not create compact unwind for _init: registers 21 and 22 not saved contiguously in frame
measure.c: ld: warning: object file (/Users/djb/supercop-20210529/supercop-data/minimac/aarch64/lib/kernelrandombytes.o) was built for newer macOS version (11.3) than being linked (11.0)
measure.c: ld: warning: object file (/Users/djb/supercop-20210529/supercop-data/minimac/aarch64/lib/cpucycles.o) was built for newer macOS version (11.3) than being linked (11.0)
measure.c: ld: warning: could not create compact unwind for _init: registers 21 and 22 not saved contiguously in frame

Number of similar (compiler,implementation) pairs: 1, namely:
CompilerImplementations
clang -mcpu=native -O3 -fomit-frame-pointer -fwrapv -Qunused-arguments -fPIC -fPIE T:ref

Compiler output

Implementation: T:xkcp/ARMv6
Security model: timingleaks
Compiler: clang -mcpu=native -O3 -fomit-frame-pointer -fwrapv -Qunused-arguments -fPIC -fPIE
Xoodoo-uf-armv6-le-gcc.s: Xoodoo-uf-armv6-le-gcc.s:1:1: error: unexpected token at start of statement
Xoodoo-uf-armv6-le-gcc.s: @
Xoodoo-uf-armv6-le-gcc.s: ^
Xoodoo-uf-armv6-le-gcc.s: Xoodoo-uf-armv6-le-gcc.s:2:1: error: unexpected token at start of statement
Xoodoo-uf-armv6-le-gcc.s: @ The eXtended Keccak Code Package (XKCP)
Xoodoo-uf-armv6-le-gcc.s: ^
Xoodoo-uf-armv6-le-gcc.s: Xoodoo-uf-armv6-le-gcc.s:3:1: error: unexpected token at start of statement
Xoodoo-uf-armv6-le-gcc.s: @ https:
Xoodoo-uf-armv6-le-gcc.s: ^
Xoodoo-uf-armv6-le-gcc.s: Xoodoo-uf-armv6-le-gcc.s:4:1: error: unexpected token at start of statement
Xoodoo-uf-armv6-le-gcc.s: @
Xoodoo-uf-armv6-le-gcc.s: ^
Xoodoo-uf-armv6-le-gcc.s: Xoodoo-uf-armv6-le-gcc.s:5:1: error: unexpected token at start of statement
Xoodoo-uf-armv6-le-gcc.s: @ The Xoodoo permutation, designed by Joan Daemen, Seth Hoffert, Gilles Van Assche and Ronny Van Keer.
Xoodoo-uf-armv6-le-gcc.s: ^
Xoodoo-uf-armv6-le-gcc.s: Xoodoo-uf-armv6-le-gcc.s:6:1: error: unexpected token at start of statement
Xoodoo-uf-armv6-le-gcc.s: @
Xoodoo-uf-armv6-le-gcc.s: ^
Xoodoo-uf-armv6-le-gcc.s: Xoodoo-uf-armv6-le-gcc.s:7:1: error: unexpected token at start of statement
Xoodoo-uf-armv6-le-gcc.s: @ Implementation by Ronny Van Keer, hereby denoted as "the implementer".
Xoodoo-uf-armv6-le-gcc.s: ^
Xoodoo-uf-armv6-le-gcc.s: Xoodoo-uf-armv6-le-gcc.s:8:1: error: unexpected token at start of statement
Xoodoo-uf-armv6-le-gcc.s: @
Xoodoo-uf-armv6-le-gcc.s: ^
Xoodoo-uf-armv6-le-gcc.s: Xoodoo-uf-armv6-le-gcc.s:9:1: error: unexpected token at start of statement
Xoodoo-uf-armv6-le-gcc.s: ...

Number of similar (compiler,implementation) pairs: 1, namely:
CompilerImplementations
clang -mcpu=native -O3 -fomit-frame-pointer -fwrapv -Qunused-arguments -fPIC -fPIE T:xkcp/ARMv6

Compiler output

Implementation: T:xkcp/ARMv6
Security model: timingleaks
Compiler: gcc -march=native -mtune=native -O2 -fomit-frame-pointer -fwrapv -fPIC -fPIE
Xoodoo-uf-armv6-le-gcc.s: Xoodoo-uf-armv6-le-gcc.s:1:1: error: unexpected token at start of statement
Xoodoo-uf-armv6-le-gcc.s: @
Xoodoo-uf-armv6-le-gcc.s: ^
Xoodoo-uf-armv6-le-gcc.s: Xoodoo-uf-armv6-le-gcc.s:2:1: error: unexpected token at start of statement
Xoodoo-uf-armv6-le-gcc.s: @ The eXtended Keccak Code Package (XKCP)
Xoodoo-uf-armv6-le-gcc.s: ^
Xoodoo-uf-armv6-le-gcc.s: Xoodoo-uf-armv6-le-gcc.s:3:1: error: unexpected token at start of statement
Xoodoo-uf-armv6-le-gcc.s: @ https://github.com/XKCP/XKCP
Xoodoo-uf-armv6-le-gcc.s: ^
Xoodoo-uf-armv6-le-gcc.s: Xoodoo-uf-armv6-le-gcc.s:4:1: error: unexpected token at start of statement
Xoodoo-uf-armv6-le-gcc.s: @
Xoodoo-uf-armv6-le-gcc.s: ^
Xoodoo-uf-armv6-le-gcc.s: Xoodoo-uf-armv6-le-gcc.s:5:1: error: unexpected token at start of statement
Xoodoo-uf-armv6-le-gcc.s: @ The Xoodoo permutation, designed by Joan Daemen, Seth Hoffert, Gilles Van Assche and Ronny Van Keer.
Xoodoo-uf-armv6-le-gcc.s: ^
Xoodoo-uf-armv6-le-gcc.s: Xoodoo-uf-armv6-le-gcc.s:6:1: error: unexpected token at start of statement
Xoodoo-uf-armv6-le-gcc.s: @
Xoodoo-uf-armv6-le-gcc.s: ^
Xoodoo-uf-armv6-le-gcc.s: Xoodoo-uf-armv6-le-gcc.s:7:1: error: unexpected token at start of statement
Xoodoo-uf-armv6-le-gcc.s: @ Implementation by Ronny Van Keer, hereby denoted as "the implementer".
Xoodoo-uf-armv6-le-gcc.s: ^
Xoodoo-uf-armv6-le-gcc.s: Xoodoo-uf-armv6-le-gcc.s:8:1: error: unexpected token at start of statement
Xoodoo-uf-armv6-le-gcc.s: @
Xoodoo-uf-armv6-le-gcc.s: ^
Xoodoo-uf-armv6-le-gcc.s: Xoodoo-uf-armv6-le-gcc.s:9:1: error: unexpected token at start of statement
Xoodoo-uf-armv6-le-gcc.s: ...

Number of similar (compiler,implementation) pairs: 4, namely:
CompilerImplementations
gcc -march=native -mtune=native -O2 -fomit-frame-pointer -fwrapv -fPIC -fPIE T:xkcp/ARMv6
gcc -march=native -mtune=native -O3 -fomit-frame-pointer -fwrapv -fPIC -fPIE T:xkcp/ARMv6
gcc -march=native -mtune=native -O -fomit-frame-pointer -fwrapv -fPIC -fPIE T:xkcp/ARMv6
gcc -march=native -mtune=native -Os -fomit-frame-pointer -fwrapv -fPIC -fPIE T:xkcp/ARMv6

Compiler output

Implementation: T:xkcp/ARMv6M
Security model: timingleaks
Compiler: clang -mcpu=native -O3 -fomit-frame-pointer -fwrapv -Qunused-arguments -fPIC -fPIE
Xoodoo-u1-armv6m-le-gcc.s: Xoodoo-u1-armv6m-le-gcc.s:1:1: error: unexpected token at start of statement
Xoodoo-u1-armv6m-le-gcc.s: @
Xoodoo-u1-armv6m-le-gcc.s: ^
Xoodoo-u1-armv6m-le-gcc.s: Xoodoo-u1-armv6m-le-gcc.s:2:1: error: unexpected token at start of statement
Xoodoo-u1-armv6m-le-gcc.s: @ The eXtended Keccak Code Package (XKCP)
Xoodoo-u1-armv6m-le-gcc.s: ^
Xoodoo-u1-armv6m-le-gcc.s: Xoodoo-u1-armv6m-le-gcc.s:3:1: error: unexpected token at start of statement
Xoodoo-u1-armv6m-le-gcc.s: @ https:
Xoodoo-u1-armv6m-le-gcc.s: ^
Xoodoo-u1-armv6m-le-gcc.s: Xoodoo-u1-armv6m-le-gcc.s:4:1: error: unexpected token at start of statement
Xoodoo-u1-armv6m-le-gcc.s: @
Xoodoo-u1-armv6m-le-gcc.s: ^
Xoodoo-u1-armv6m-le-gcc.s: Xoodoo-u1-armv6m-le-gcc.s:5:1: error: unexpected token at start of statement
Xoodoo-u1-armv6m-le-gcc.s: @ The Xoodoo permutation, designed by Joan Daemen, Seth Hoffert, Gilles Van Assche and Ronny Van Keer.
Xoodoo-u1-armv6m-le-gcc.s: ^
Xoodoo-u1-armv6m-le-gcc.s: Xoodoo-u1-armv6m-le-gcc.s:6:1: error: unexpected token at start of statement
Xoodoo-u1-armv6m-le-gcc.s: @
Xoodoo-u1-armv6m-le-gcc.s: ^
Xoodoo-u1-armv6m-le-gcc.s: Xoodoo-u1-armv6m-le-gcc.s:7:1: error: unexpected token at start of statement
Xoodoo-u1-armv6m-le-gcc.s: @ Implementation by Ronny Van Keer, hereby denoted as "the implementer".
Xoodoo-u1-armv6m-le-gcc.s: ^
Xoodoo-u1-armv6m-le-gcc.s: Xoodoo-u1-armv6m-le-gcc.s:8:1: error: unexpected token at start of statement
Xoodoo-u1-armv6m-le-gcc.s: @
Xoodoo-u1-armv6m-le-gcc.s: ^
Xoodoo-u1-armv6m-le-gcc.s: Xoodoo-u1-armv6m-le-gcc.s:9:1: error: unexpected token at start of statement
Xoodoo-u1-armv6m-le-gcc.s: ...

Number of similar (compiler,implementation) pairs: 1, namely:
CompilerImplementations
clang -mcpu=native -O3 -fomit-frame-pointer -fwrapv -Qunused-arguments -fPIC -fPIE T:xkcp/ARMv6M

Compiler output

Implementation: T:xkcp/ARMv6M
Security model: timingleaks
Compiler: gcc -march=native -mtune=native -O2 -fomit-frame-pointer -fwrapv -fPIC -fPIE
Xoodoo-u1-armv6m-le-gcc.s: Xoodoo-u1-armv6m-le-gcc.s:1:1: error: unexpected token at start of statement
Xoodoo-u1-armv6m-le-gcc.s: @
Xoodoo-u1-armv6m-le-gcc.s: ^
Xoodoo-u1-armv6m-le-gcc.s: Xoodoo-u1-armv6m-le-gcc.s:2:1: error: unexpected token at start of statement
Xoodoo-u1-armv6m-le-gcc.s: @ The eXtended Keccak Code Package (XKCP)
Xoodoo-u1-armv6m-le-gcc.s: ^
Xoodoo-u1-armv6m-le-gcc.s: Xoodoo-u1-armv6m-le-gcc.s:3:1: error: unexpected token at start of statement
Xoodoo-u1-armv6m-le-gcc.s: @ https://github.com/XKCP/XKCP
Xoodoo-u1-armv6m-le-gcc.s: ^
Xoodoo-u1-armv6m-le-gcc.s: Xoodoo-u1-armv6m-le-gcc.s:4:1: error: unexpected token at start of statement
Xoodoo-u1-armv6m-le-gcc.s: @
Xoodoo-u1-armv6m-le-gcc.s: ^
Xoodoo-u1-armv6m-le-gcc.s: Xoodoo-u1-armv6m-le-gcc.s:5:1: error: unexpected token at start of statement
Xoodoo-u1-armv6m-le-gcc.s: @ The Xoodoo permutation, designed by Joan Daemen, Seth Hoffert, Gilles Van Assche and Ronny Van Keer.
Xoodoo-u1-armv6m-le-gcc.s: ^
Xoodoo-u1-armv6m-le-gcc.s: Xoodoo-u1-armv6m-le-gcc.s:6:1: error: unexpected token at start of statement
Xoodoo-u1-armv6m-le-gcc.s: @
Xoodoo-u1-armv6m-le-gcc.s: ^
Xoodoo-u1-armv6m-le-gcc.s: Xoodoo-u1-armv6m-le-gcc.s:7:1: error: unexpected token at start of statement
Xoodoo-u1-armv6m-le-gcc.s: @ Implementation by Ronny Van Keer, hereby denoted as "the implementer".
Xoodoo-u1-armv6m-le-gcc.s: ^
Xoodoo-u1-armv6m-le-gcc.s: Xoodoo-u1-armv6m-le-gcc.s:8:1: error: unexpected token at start of statement
Xoodoo-u1-armv6m-le-gcc.s: @
Xoodoo-u1-armv6m-le-gcc.s: ^
Xoodoo-u1-armv6m-le-gcc.s: Xoodoo-u1-armv6m-le-gcc.s:9:1: error: unexpected token at start of statement
Xoodoo-u1-armv6m-le-gcc.s: ...

Number of similar (compiler,implementation) pairs: 4, namely:
CompilerImplementations
gcc -march=native -mtune=native -O2 -fomit-frame-pointer -fwrapv -fPIC -fPIE T:xkcp/ARMv6M
gcc -march=native -mtune=native -O3 -fomit-frame-pointer -fwrapv -fPIC -fPIE T:xkcp/ARMv6M
gcc -march=native -mtune=native -O -fomit-frame-pointer -fwrapv -fPIC -fPIE T:xkcp/ARMv6M
gcc -march=native -mtune=native -Os -fomit-frame-pointer -fwrapv -fPIC -fPIE T:xkcp/ARMv6M

Compiler output

Implementation: T:xkcp/ARMv7M
Security model: timingleaks
Compiler: clang -mcpu=native -O3 -fomit-frame-pointer -fwrapv -Qunused-arguments -fPIC -fPIE
Xoodoo-uf-armv7m-le-gcc.s: Xoodoo-uf-armv7m-le-gcc.s:1:1: error: unexpected token at start of statement
Xoodoo-uf-armv7m-le-gcc.s: @
Xoodoo-uf-armv7m-le-gcc.s: ^
Xoodoo-uf-armv7m-le-gcc.s: Xoodoo-uf-armv7m-le-gcc.s:2:1: error: unexpected token at start of statement
Xoodoo-uf-armv7m-le-gcc.s: @ The eXtended Keccak Code Package (XKCP)
Xoodoo-uf-armv7m-le-gcc.s: ^
Xoodoo-uf-armv7m-le-gcc.s: Xoodoo-uf-armv7m-le-gcc.s:3:1: error: unexpected token at start of statement
Xoodoo-uf-armv7m-le-gcc.s: @ https:
Xoodoo-uf-armv7m-le-gcc.s: ^
Xoodoo-uf-armv7m-le-gcc.s: Xoodoo-uf-armv7m-le-gcc.s:4:1: error: unexpected token at start of statement
Xoodoo-uf-armv7m-le-gcc.s: @
Xoodoo-uf-armv7m-le-gcc.s: ^
Xoodoo-uf-armv7m-le-gcc.s: Xoodoo-uf-armv7m-le-gcc.s:5:1: error: unexpected token at start of statement
Xoodoo-uf-armv7m-le-gcc.s: @ The Xoodoo permutation, designed by Joan Daemen, Seth Hoffert, Gilles Van Assche and Ronny Van Keer.
Xoodoo-uf-armv7m-le-gcc.s: ^
Xoodoo-uf-armv7m-le-gcc.s: Xoodoo-uf-armv7m-le-gcc.s:6:1: error: unexpected token at start of statement
Xoodoo-uf-armv7m-le-gcc.s: @
Xoodoo-uf-armv7m-le-gcc.s: ^
Xoodoo-uf-armv7m-le-gcc.s: Xoodoo-uf-armv7m-le-gcc.s:7:1: error: unexpected token at start of statement
Xoodoo-uf-armv7m-le-gcc.s: @ Implementation by Ronny Van Keer, hereby denoted as "the implementer".
Xoodoo-uf-armv7m-le-gcc.s: ^
Xoodoo-uf-armv7m-le-gcc.s: Xoodoo-uf-armv7m-le-gcc.s:8:1: error: unexpected token at start of statement
Xoodoo-uf-armv7m-le-gcc.s: @
Xoodoo-uf-armv7m-le-gcc.s: ^
Xoodoo-uf-armv7m-le-gcc.s: Xoodoo-uf-armv7m-le-gcc.s:9:1: error: unexpected token at start of statement
Xoodoo-uf-armv7m-le-gcc.s: ...

Number of similar (compiler,implementation) pairs: 1, namely:
CompilerImplementations
clang -mcpu=native -O3 -fomit-frame-pointer -fwrapv -Qunused-arguments -fPIC -fPIE T:xkcp/ARMv7M

Compiler output

Implementation: T:xkcp/ARMv7M
Security model: timingleaks
Compiler: gcc -march=native -mtune=native -O2 -fomit-frame-pointer -fwrapv -fPIC -fPIE
Xoodoo-uf-armv7m-le-gcc.s: Xoodoo-uf-armv7m-le-gcc.s:1:1: error: unexpected token at start of statement
Xoodoo-uf-armv7m-le-gcc.s: @
Xoodoo-uf-armv7m-le-gcc.s: ^
Xoodoo-uf-armv7m-le-gcc.s: Xoodoo-uf-armv7m-le-gcc.s:2:1: error: unexpected token at start of statement
Xoodoo-uf-armv7m-le-gcc.s: @ The eXtended Keccak Code Package (XKCP)
Xoodoo-uf-armv7m-le-gcc.s: ^
Xoodoo-uf-armv7m-le-gcc.s: Xoodoo-uf-armv7m-le-gcc.s:3:1: error: unexpected token at start of statement
Xoodoo-uf-armv7m-le-gcc.s: @ https://github.com/XKCP/XKCP
Xoodoo-uf-armv7m-le-gcc.s: ^
Xoodoo-uf-armv7m-le-gcc.s: Xoodoo-uf-armv7m-le-gcc.s:4:1: error: unexpected token at start of statement
Xoodoo-uf-armv7m-le-gcc.s: @
Xoodoo-uf-armv7m-le-gcc.s: ^
Xoodoo-uf-armv7m-le-gcc.s: Xoodoo-uf-armv7m-le-gcc.s:5:1: error: unexpected token at start of statement
Xoodoo-uf-armv7m-le-gcc.s: @ The Xoodoo permutation, designed by Joan Daemen, Seth Hoffert, Gilles Van Assche and Ronny Van Keer.
Xoodoo-uf-armv7m-le-gcc.s: ^
Xoodoo-uf-armv7m-le-gcc.s: Xoodoo-uf-armv7m-le-gcc.s:6:1: error: unexpected token at start of statement
Xoodoo-uf-armv7m-le-gcc.s: @
Xoodoo-uf-armv7m-le-gcc.s: ^
Xoodoo-uf-armv7m-le-gcc.s: Xoodoo-uf-armv7m-le-gcc.s:7:1: error: unexpected token at start of statement
Xoodoo-uf-armv7m-le-gcc.s: @ Implementation by Ronny Van Keer, hereby denoted as "the implementer".
Xoodoo-uf-armv7m-le-gcc.s: ^
Xoodoo-uf-armv7m-le-gcc.s: Xoodoo-uf-armv7m-le-gcc.s:8:1: error: unexpected token at start of statement
Xoodoo-uf-armv7m-le-gcc.s: @
Xoodoo-uf-armv7m-le-gcc.s: ^
Xoodoo-uf-armv7m-le-gcc.s: Xoodoo-uf-armv7m-le-gcc.s:9:1: error: unexpected token at start of statement
Xoodoo-uf-armv7m-le-gcc.s: ...

Number of similar (compiler,implementation) pairs: 4, namely:
CompilerImplementations
gcc -march=native -mtune=native -O2 -fomit-frame-pointer -fwrapv -fPIC -fPIE T:xkcp/ARMv7M
gcc -march=native -mtune=native -O3 -fomit-frame-pointer -fwrapv -fPIC -fPIE T:xkcp/ARMv7M
gcc -march=native -mtune=native -O -fomit-frame-pointer -fwrapv -fPIC -fPIE T:xkcp/ARMv7M
gcc -march=native -mtune=native -Os -fomit-frame-pointer -fwrapv -fPIC -fPIE T:xkcp/ARMv7M

Compiler output

Implementation: T:xkcp/AVR8
Security model: timingleaks
Compiler: clang -mcpu=native -O3 -fomit-frame-pointer -fwrapv -Qunused-arguments -fPIC -fPIE
Xoodoo-avr8-u1.s: Xoodoo-avr8-u1.s:49:5: error: unrecognized instruction mnemonic, did you mean: fmov, mov, movi, movk, movn, movz, smov, umov?
Xoodoo-avr8-u1.s: movw 30, r24
Xoodoo-avr8-u1.s: ^
Xoodoo-avr8-u1.s: Xoodoo-avr8-u1.s:50:5: error: unrecognized instruction mnemonic, did you mean: ld1, ld2, ld3, ld4, ldp, ldr, sli?
Xoodoo-avr8-u1.s: ldi r23, 3*4/2 ; clear state (8 bytes / 2 lanes) per iteration
Xoodoo-avr8-u1.s: ^
Xoodoo-avr8-u1.s: Xoodoo-avr8-u1.s:52:10: error: unknown token in expression
Xoodoo-avr8-u1.s: st z+, 1
Xoodoo-avr8-u1.s: ^
Xoodoo-avr8-u1.s: Xoodoo-avr8-u1.s:53:10: error: unknown token in expression
Xoodoo-avr8-u1.s: st z+, 1
Xoodoo-avr8-u1.s: ^
Xoodoo-avr8-u1.s: Xoodoo-avr8-u1.s:54:10: error: unknown token in expression
Xoodoo-avr8-u1.s: st z+, 1
Xoodoo-avr8-u1.s: ^
Xoodoo-avr8-u1.s: Xoodoo-avr8-u1.s:55:10: error: unknown token in expression
Xoodoo-avr8-u1.s: st z+, 1
Xoodoo-avr8-u1.s: ^
Xoodoo-avr8-u1.s: Xoodoo-avr8-u1.s:56:10: error: unknown token in expression
Xoodoo-avr8-u1.s: st z+, 1
Xoodoo-avr8-u1.s: ^
Xoodoo-avr8-u1.s: Xoodoo-avr8-u1.s:57:10: error: unknown token in expression
Xoodoo-avr8-u1.s: st z+, 1
Xoodoo-avr8-u1.s: ^
Xoodoo-avr8-u1.s: Xoodoo-avr8-u1.s:58:10: error: unknown token in expression
Xoodoo-avr8-u1.s: ...

Number of similar (compiler,implementation) pairs: 1, namely:
CompilerImplementations
clang -mcpu=native -O3 -fomit-frame-pointer -fwrapv -Qunused-arguments -fPIC -fPIE T:xkcp/AVR8

Compiler output

Implementation: T:xkcp/AVR8
Security model: timingleaks
Compiler: gcc -march=native -mtune=native -O2 -fomit-frame-pointer -fwrapv -fPIC -fPIE
Xoodoo-avr8-u1.s: Xoodoo-avr8-u1.s:49:5: error: unrecognized instruction mnemonic, did you mean: fmov, mov, movi, movk, movn, movz, smov, umov?
Xoodoo-avr8-u1.s: movw rZ, r24
Xoodoo-avr8-u1.s: ^
Xoodoo-avr8-u1.s: Xoodoo-avr8-u1.s:50:5: error: unrecognized instruction mnemonic, did you mean: ld1, ld2, ld3, ld4, ldp, ldr, sli?
Xoodoo-avr8-u1.s: ldi r23, 3*4/2 ; clear state (8 bytes / 2 lanes) per iteration
Xoodoo-avr8-u1.s: ^
Xoodoo-avr8-u1.s: Xoodoo-avr8-u1.s:52:15: error: unknown token in expression
Xoodoo-avr8-u1.s: st z+, zero
Xoodoo-avr8-u1.s: ^
Xoodoo-avr8-u1.s: Xoodoo-avr8-u1.s:53:15: error: unknown token in expression
Xoodoo-avr8-u1.s: st z+, zero
Xoodoo-avr8-u1.s: ^
Xoodoo-avr8-u1.s: Xoodoo-avr8-u1.s:54:15: error: unknown token in expression
Xoodoo-avr8-u1.s: st z+, zero
Xoodoo-avr8-u1.s: ^
Xoodoo-avr8-u1.s: Xoodoo-avr8-u1.s:55:15: error: unknown token in expression
Xoodoo-avr8-u1.s: st z+, zero
Xoodoo-avr8-u1.s: ^
Xoodoo-avr8-u1.s: Xoodoo-avr8-u1.s:56:15: error: unknown token in expression
Xoodoo-avr8-u1.s: st z+, zero
Xoodoo-avr8-u1.s: ^
Xoodoo-avr8-u1.s: Xoodoo-avr8-u1.s:57:15: error: unknown token in expression
Xoodoo-avr8-u1.s: st z+, zero
Xoodoo-avr8-u1.s: ^
Xoodoo-avr8-u1.s: Xoodoo-avr8-u1.s:58:15: error: unknown token in expression
Xoodoo-avr8-u1.s: ...

Number of similar (compiler,implementation) pairs: 4, namely:
CompilerImplementations
gcc -march=native -mtune=native -O2 -fomit-frame-pointer -fwrapv -fPIC -fPIE T:xkcp/AVR8
gcc -march=native -mtune=native -O3 -fomit-frame-pointer -fwrapv -fPIC -fPIE T:xkcp/AVR8
gcc -march=native -mtune=native -O -fomit-frame-pointer -fwrapv -fPIC -fPIE T:xkcp/AVR8
gcc -march=native -mtune=native -Os -fomit-frame-pointer -fwrapv -fPIC -fPIE T:xkcp/AVR8

Compiler output

Implementation: T:xkcp/AVX512
Security model: timingleaks
Compiler: clang -mcpu=native -O3 -fomit-frame-pointer -fwrapv -Qunused-arguments -fPIC -fPIE
Xoodoo-SIMD512.c: In file included from Xoodoo-SIMD512.c:22:
Xoodoo-SIMD512.c: In file included from /Library/Developer/CommandLineTools/usr/lib/clang/12.0.5/include/smmintrin.h:13:
Xoodoo-SIMD512.c: In file included from /Library/Developer/CommandLineTools/usr/lib/clang/12.0.5/include/tmmintrin.h:13:
Xoodoo-SIMD512.c: In file included from /Library/Developer/CommandLineTools/usr/lib/clang/12.0.5/include/pmmintrin.h:13:
Xoodoo-SIMD512.c: In file included from /Library/Developer/CommandLineTools/usr/lib/clang/12.0.5/include/emmintrin.h:13:
Xoodoo-SIMD512.c: In file included from /Library/Developer/CommandLineTools/usr/lib/clang/12.0.5/include/xmmintrin.h:13:
Xoodoo-SIMD512.c: /Library/Developer/CommandLineTools/usr/lib/clang/12.0.5/include/mmintrin.h:50:12: error: invalid conversion between vector type '__m64' (vector of 1 'long long' value) and integer type 'int' of different size
Xoodoo-SIMD512.c: return (__m64)__builtin_ia32_vec_init_v2si(__i, 0);
Xoodoo-SIMD512.c: ^~~~~~~~~~~~~~~~~~~~~~~~~~~~~~~~~~~~~~~~~~~
Xoodoo-SIMD512.c: /Library/Developer/CommandLineTools/usr/lib/clang/12.0.5/include/mmintrin.h:129:12: error: invalid conversion between vector type '__m64' (vector of 1 'long long' value) and integer type 'int' of different size
Xoodoo-SIMD512.c: return (__m64)__builtin_ia32_packsswb((__v4hi)__m1, (__v4hi)__m2);
Xoodoo-SIMD512.c: ^~~~~~~~~~~~~~~~~~~~~~~~~~~~~~~~~~~~~~~~~~~~~~~~~~~~~~~~~~
Xoodoo-SIMD512.c: /Library/Developer/CommandLineTools/usr/lib/clang/12.0.5/include/mmintrin.h:159:12: error: invalid conversion between vector type '__m64' (vector of 1 'long long' value) and integer type 'int' of different size
Xoodoo-SIMD512.c: return (__m64)__builtin_ia32_packssdw((__v2si)__m1, (__v2si)__m2);
Xoodoo-SIMD512.c: ^~~~~~~~~~~~~~~~~~~~~~~~~~~~~~~~~~~~~~~~~~~~~~~~~~~~~~~~~~
Xoodoo-SIMD512.c: /Library/Developer/CommandLineTools/usr/lib/clang/12.0.5/include/mmintrin.h:189:12: error: invalid conversion between vector type '__m64' (vector of 1 'long long' value) and integer type 'int' of different size
Xoodoo-SIMD512.c: return (__m64)__builtin_ia32_packuswb((__v4hi)__m1, (__v4hi)__m2);
Xoodoo-SIMD512.c: ^~~~~~~~~~~~~~~~~~~~~~~~~~~~~~~~~~~~~~~~~~~~~~~~~~~~~~~~~~
Xoodoo-SIMD512.c: /Library/Developer/CommandLineTools/usr/lib/clang/12.0.5/include/mmintrin.h:216:12: error: invalid conversion between vector type '__m64' (vector of 1 'long long' value) and integer type 'int' of different size
Xoodoo-SIMD512.c: return (__m64)__builtin_ia32_punpckhbw((__v8qi)__m1, (__v8qi)__m2);
Xoodoo-SIMD512.c: ^~~~~~~~~~~~~~~~~~~~~~~~~~~~~~~~~~~~~~~~~~~~~~~~~~~~~~~~~~~
Xoodoo-SIMD512.c: /Library/Developer/CommandLineTools/usr/lib/clang/12.0.5/include/mmintrin.h:239:12: error: invalid conversion between vector type '__m64' (vector of 1 'long long' value) and integer type 'int' of different size
Xoodoo-SIMD512.c: return (__m64)__builtin_ia32_punpckhwd((__v4hi)__m1, (__v4hi)__m2);
Xoodoo-SIMD512.c: ^~~~~~~~~~~~~~~~~~~~~~~~~~~~~~~~~~~~~~~~~~~~~~~~~~~~~~~~~~~
Xoodoo-SIMD512.c: /Library/Developer/CommandLineTools/usr/lib/clang/12.0.5/include/mmintrin.h:260:12: error: invalid conversion between vector type '__m64' (vector of 1 'long long' value) and integer type 'int' of different size
Xoodoo-SIMD512.c: ...

Number of similar (compiler,implementation) pairs: 1, namely:
CompilerImplementations
clang -mcpu=native -O3 -fomit-frame-pointer -fwrapv -Qunused-arguments -fPIC -fPIE T:xkcp/AVX512

Compiler output

Implementation: T:xkcp/AVX512
Security model: timingleaks
Compiler: gcc -march=native -mtune=native -O2 -fomit-frame-pointer -fwrapv -fPIC -fPIE
Xoodoo-SIMD512.c: Xoodoo-SIMD512.c:22:10: fatal error: smmintrin.h: No such file or directory
Xoodoo-SIMD512.c: 22 | #include <smmintrin.h>
Xoodoo-SIMD512.c: | ^~~~~~~~~~~~~
Xoodoo-SIMD512.c: compilation terminated.

Number of similar (compiler,implementation) pairs: 4, namely:
CompilerImplementations
gcc -march=native -mtune=native -O2 -fomit-frame-pointer -fwrapv -fPIC -fPIE T:xkcp/AVX512
gcc -march=native -mtune=native -O3 -fomit-frame-pointer -fwrapv -fPIC -fPIE T:xkcp/AVX512
gcc -march=native -mtune=native -O -fomit-frame-pointer -fwrapv -fPIC -fPIE T:xkcp/AVX512
gcc -march=native -mtune=native -Os -fomit-frame-pointer -fwrapv -fPIC -fPIE T:xkcp/AVX512

Compiler output

Implementation: T:xkcp/SSE2
Security model: timingleaks
Compiler: clang -mcpu=native -O3 -fomit-frame-pointer -fwrapv -Qunused-arguments -fPIC -fPIE
Xoodoo-SIMD128.c: In file included from Xoodoo-SIMD128.c:22:
Xoodoo-SIMD128.c: In file included from /Library/Developer/CommandLineTools/usr/lib/clang/12.0.5/include/emmintrin.h:13:
Xoodoo-SIMD128.c: In file included from /Library/Developer/CommandLineTools/usr/lib/clang/12.0.5/include/xmmintrin.h:13:
Xoodoo-SIMD128.c: /Library/Developer/CommandLineTools/usr/lib/clang/12.0.5/include/mmintrin.h:50:12: error: invalid conversion between vector type '__m64' (vector of 1 'long long' value) and integer type 'int' of different size
Xoodoo-SIMD128.c: return (__m64)__builtin_ia32_vec_init_v2si(__i, 0);
Xoodoo-SIMD128.c: ^~~~~~~~~~~~~~~~~~~~~~~~~~~~~~~~~~~~~~~~~~~
Xoodoo-SIMD128.c: /Library/Developer/CommandLineTools/usr/lib/clang/12.0.5/include/mmintrin.h:129:12: error: invalid conversion between vector type '__m64' (vector of 1 'long long' value) and integer type 'int' of different size
Xoodoo-SIMD128.c: return (__m64)__builtin_ia32_packsswb((__v4hi)__m1, (__v4hi)__m2);
Xoodoo-SIMD128.c: ^~~~~~~~~~~~~~~~~~~~~~~~~~~~~~~~~~~~~~~~~~~~~~~~~~~~~~~~~~
Xoodoo-SIMD128.c: /Library/Developer/CommandLineTools/usr/lib/clang/12.0.5/include/mmintrin.h:159:12: error: invalid conversion between vector type '__m64' (vector of 1 'long long' value) and integer type 'int' of different size
Xoodoo-SIMD128.c: return (__m64)__builtin_ia32_packssdw((__v2si)__m1, (__v2si)__m2);
Xoodoo-SIMD128.c: ^~~~~~~~~~~~~~~~~~~~~~~~~~~~~~~~~~~~~~~~~~~~~~~~~~~~~~~~~~
Xoodoo-SIMD128.c: /Library/Developer/CommandLineTools/usr/lib/clang/12.0.5/include/mmintrin.h:189:12: error: invalid conversion between vector type '__m64' (vector of 1 'long long' value) and integer type 'int' of different size
Xoodoo-SIMD128.c: return (__m64)__builtin_ia32_packuswb((__v4hi)__m1, (__v4hi)__m2);
Xoodoo-SIMD128.c: ^~~~~~~~~~~~~~~~~~~~~~~~~~~~~~~~~~~~~~~~~~~~~~~~~~~~~~~~~~
Xoodoo-SIMD128.c: /Library/Developer/CommandLineTools/usr/lib/clang/12.0.5/include/mmintrin.h:216:12: error: invalid conversion between vector type '__m64' (vector of 1 'long long' value) and integer type 'int' of different size
Xoodoo-SIMD128.c: return (__m64)__builtin_ia32_punpckhbw((__v8qi)__m1, (__v8qi)__m2);
Xoodoo-SIMD128.c: ^~~~~~~~~~~~~~~~~~~~~~~~~~~~~~~~~~~~~~~~~~~~~~~~~~~~~~~~~~~
Xoodoo-SIMD128.c: /Library/Developer/CommandLineTools/usr/lib/clang/12.0.5/include/mmintrin.h:239:12: error: invalid conversion between vector type '__m64' (vector of 1 'long long' value) and integer type 'int' of different size
Xoodoo-SIMD128.c: return (__m64)__builtin_ia32_punpckhwd((__v4hi)__m1, (__v4hi)__m2);
Xoodoo-SIMD128.c: ^~~~~~~~~~~~~~~~~~~~~~~~~~~~~~~~~~~~~~~~~~~~~~~~~~~~~~~~~~~
Xoodoo-SIMD128.c: /Library/Developer/CommandLineTools/usr/lib/clang/12.0.5/include/mmintrin.h:260:12: error: invalid conversion between vector type '__m64' (vector of 1 'long long' value) and integer type 'int' of different size
Xoodoo-SIMD128.c: return (__m64)__builtin_ia32_punpckhdq((__v2si)__m1, (__v2si)__m2);
Xoodoo-SIMD128.c: ^~~~~~~~~~~~~~~~~~~~~~~~~~~~~~~~~~~~~~~~~~~~~~~~~~~~~~~~~~~
Xoodoo-SIMD128.c: /Library/Developer/CommandLineTools/usr/lib/clang/12.0.5/include/mmintrin.h:287:12: error: invalid conversion between vector type '__m64' (vector of 1 'long long' value) and integer type 'int' of different size
Xoodoo-SIMD128.c: ...

Number of similar (compiler,implementation) pairs: 1, namely:
CompilerImplementations
clang -mcpu=native -O3 -fomit-frame-pointer -fwrapv -Qunused-arguments -fPIC -fPIE T:xkcp/SSE2

Compiler output

Implementation: T:xkcp/SSE2
Security model: timingleaks
Compiler: gcc -march=native -mtune=native -O2 -fomit-frame-pointer -fwrapv -fPIC -fPIE
Xoodoo-SIMD128.c: Xoodoo-SIMD128.c:22:10: fatal error: emmintrin.h: No such file or directory
Xoodoo-SIMD128.c: 22 | #include <emmintrin.h>
Xoodoo-SIMD128.c: | ^~~~~~~~~~~~~
Xoodoo-SIMD128.c: compilation terminated.

Number of similar (compiler,implementation) pairs: 4, namely:
CompilerImplementations
gcc -march=native -mtune=native -O2 -fomit-frame-pointer -fwrapv -fPIC -fPIE T:xkcp/SSE2
gcc -march=native -mtune=native -O3 -fomit-frame-pointer -fwrapv -fPIC -fPIE T:xkcp/SSE2
gcc -march=native -mtune=native -O -fomit-frame-pointer -fwrapv -fPIC -fPIE T:xkcp/SSE2
gcc -march=native -mtune=native -Os -fomit-frame-pointer -fwrapv -fPIC -fPIE T:xkcp/SSE2

Compiler output

Implementation: T:xkcp/plain-ua
Security model: timingleaks
Compiler: clang -mcpu=native -O3 -fomit-frame-pointer -fwrapv -Qunused-arguments -fPIC -fPIE
try.c: ld: warning: object file (/Users/djb/supercop-20210529/supercop-data/minimac/aarch64/lib/kernelrandombytes.o) was built for newer macOS version (11.3) than being linked (11.0)
try.c: ld: warning: object file (/Users/djb/supercop-20210529/supercop-data/minimac/aarch64/lib/cpucycles.o) was built for newer macOS version (11.3) than being linked (11.0)
try.c: ld: warning: could not create compact unwind for _init: registers 21 and 22 not saved contiguously in frame
try.c: ld: warning: object file (/Users/djb/supercop-20210529/supercop-data/minimac/aarch64/lib/kernelrandombytes.o) was built for newer macOS version (11.3) than being linked (11.0)
try.c: ld: warning: object file (/Users/djb/supercop-20210529/supercop-data/minimac/aarch64/lib/cpucycles.o) was built for newer macOS version (11.3) than being linked (11.0)
try.c: ld: warning: could not create compact unwind for _init: registers 21 and 22 not saved contiguously in frame
measure.c: ld: warning: object file (/Users/djb/supercop-20210529/supercop-data/minimac/aarch64/lib/kernelrandombytes.o) was built for newer macOS version (11.3) than being linked (11.0)
measure.c: ld: warning: object file (/Users/djb/supercop-20210529/supercop-data/minimac/aarch64/lib/cpucycles.o) was built for newer macOS version (11.3) than being linked (11.0)
measure.c: ld: warning: could not create compact unwind for _init: registers 21 and 22 not saved contiguously in frame

Number of similar (compiler,implementation) pairs: 1, namely:
CompilerImplementations
clang -mcpu=native -O3 -fomit-frame-pointer -fwrapv -Qunused-arguments -fPIC -fPIE T:xkcp/plain-ua