Implementation notes: aarch64, minimac, crypto_hash/gimli24v1

Computer: minimac
Architecture: aarch64
CPU ID: unknown CPU ID
SUPERCOP version: 20210529
Operation: crypto_hash
Primitive: gimli24v1
TimeObject sizeTest sizeImplementationCompilerBenchmark dateSUPERCOP version
35998? ? ?? ? ?T:littleendianclang_-mcpu=native_-O3_-fomit-frame-pointer_-fwrapv_-Qunused-arguments_-fPIC_-fPIE2021053020210529
51598? ? ?? ? ?T:littleendiangcc_-march=native_-mtune=native_-O3_-fomit-frame-pointer_-fwrapv_-fPIC_-fPIE2021040220210326
64664? ? ?? ? ?T:littleendiangcc_-march=native_-mtune=native_-O_-fomit-frame-pointer_-fwrapv_-fPIC_-fPIE2021040220210326
64931? ? ?? ? ?T:littleendiangcc_-march=native_-mtune=native_-O2_-fomit-frame-pointer_-fwrapv_-fPIC_-fPIE2021040220210326
75197? ? ?? ? ?T:littleendiangcc_-march=native_-mtune=native_-Os_-fomit-frame-pointer_-fwrapv_-fPIC_-fPIE2021040220210326
101730? ? ?? ? ?T:refgcc_-march=native_-mtune=native_-O2_-fomit-frame-pointer_-fwrapv_-fPIC_-fPIE2021040220210326
101996? ? ?? ? ?T:refgcc_-march=native_-mtune=native_-O3_-fomit-frame-pointer_-fwrapv_-fPIC_-fPIE2021040220210326
104263? ? ?? ? ?T:refclang_-mcpu=native_-O3_-fomit-frame-pointer_-fwrapv_-Qunused-arguments_-fPIC_-fPIE2021053020210529
193326? ? ?? ? ?T:refgcc_-march=native_-mtune=native_-Os_-fomit-frame-pointer_-fwrapv_-fPIC_-fPIE2021040220210326
196259? ? ?? ? ?T:refgcc_-march=native_-mtune=native_-O_-fomit-frame-pointer_-fwrapv_-fPIC_-fPIE2021040220210326

Compiler output

Implementation: T:littleendian
Security model: timingleaks
Compiler: clang -mcpu=native -O3 -fomit-frame-pointer -fwrapv -Qunused-arguments -fPIC -fPIE
try.c: ld: warning: object file (/Users/djb/supercop-20210529/supercop-data/minimac/aarch64/lib/kernelrandombytes.o) was built for newer macOS version (11.3) than being linked (11.0)
try.c: ld: warning: object file (/Users/djb/supercop-20210529/supercop-data/minimac/aarch64/lib/cpucycles.o) was built for newer macOS version (11.3) than being linked (11.0)
try.c: ld: warning: could not create compact unwind for _init: registers 21 and 22 not saved contiguously in frame
try.c: ld: warning: object file (/Users/djb/supercop-20210529/supercop-data/minimac/aarch64/lib/kernelrandombytes.o) was built for newer macOS version (11.3) than being linked (11.0)
try.c: ld: warning: object file (/Users/djb/supercop-20210529/supercop-data/minimac/aarch64/lib/cpucycles.o) was built for newer macOS version (11.3) than being linked (11.0)
try.c: ld: warning: could not create compact unwind for _init: registers 21 and 22 not saved contiguously in frame
measure.c: ld: warning: object file (/Users/djb/supercop-20210529/supercop-data/minimac/aarch64/lib/kernelrandombytes.o) was built for newer macOS version (11.3) than being linked (11.0)
measure.c: ld: warning: object file (/Users/djb/supercop-20210529/supercop-data/minimac/aarch64/lib/cpucycles.o) was built for newer macOS version (11.3) than being linked (11.0)
measure.c: ld: warning: could not create compact unwind for _init: registers 21 and 22 not saved contiguously in frame

Number of similar (compiler,implementation) pairs: 2, namely:
CompilerImplementations
clang -mcpu=native -O3 -fomit-frame-pointer -fwrapv -Qunused-arguments -fPIC -fPIE T:littleendian T:ref

Compiler output

Implementation: T:sse
Security model: timingleaks
Compiler: clang -mcpu=native -O3 -fomit-frame-pointer -fwrapv -Qunused-arguments -fPIC -fPIE
gimli_hash.c: In file included from gimli_hash.c:5:
gimli_hash.c: In file included from ./gimli.inc:1:
gimli_hash.c: In file included from /Library/Developer/CommandLineTools/usr/lib/clang/12.0.5/include/x86intrin.h:15:
gimli_hash.c: In file included from /Library/Developer/CommandLineTools/usr/lib/clang/12.0.5/include/immintrin.h:15:
gimli_hash.c: /Library/Developer/CommandLineTools/usr/lib/clang/12.0.5/include/mmintrin.h:50:12: error: invalid conversion between vector type '__m64' (vector of 1 'long long' value) and integer type 'int' of different size
gimli_hash.c: return (__m64)__builtin_ia32_vec_init_v2si(__i, 0);
gimli_hash.c: ^~~~~~~~~~~~~~~~~~~~~~~~~~~~~~~~~~~~~~~~~~~
gimli_hash.c: /Library/Developer/CommandLineTools/usr/lib/clang/12.0.5/include/mmintrin.h:129:12: error: invalid conversion between vector type '__m64' (vector of 1 'long long' value) and integer type 'int' of different size
gimli_hash.c: return (__m64)__builtin_ia32_packsswb((__v4hi)__m1, (__v4hi)__m2);
gimli_hash.c: ^~~~~~~~~~~~~~~~~~~~~~~~~~~~~~~~~~~~~~~~~~~~~~~~~~~~~~~~~~
gimli_hash.c: /Library/Developer/CommandLineTools/usr/lib/clang/12.0.5/include/mmintrin.h:159:12: error: invalid conversion between vector type '__m64' (vector of 1 'long long' value) and integer type 'int' of different size
gimli_hash.c: return (__m64)__builtin_ia32_packssdw((__v2si)__m1, (__v2si)__m2);
gimli_hash.c: ^~~~~~~~~~~~~~~~~~~~~~~~~~~~~~~~~~~~~~~~~~~~~~~~~~~~~~~~~~
gimli_hash.c: /Library/Developer/CommandLineTools/usr/lib/clang/12.0.5/include/mmintrin.h:189:12: error: invalid conversion between vector type '__m64' (vector of 1 'long long' value) and integer type 'int' of different size
gimli_hash.c: return (__m64)__builtin_ia32_packuswb((__v4hi)__m1, (__v4hi)__m2);
gimli_hash.c: ^~~~~~~~~~~~~~~~~~~~~~~~~~~~~~~~~~~~~~~~~~~~~~~~~~~~~~~~~~
gimli_hash.c: /Library/Developer/CommandLineTools/usr/lib/clang/12.0.5/include/mmintrin.h:216:12: error: invalid conversion between vector type '__m64' (vector of 1 'long long' value) and integer type 'int' of different size
gimli_hash.c: return (__m64)__builtin_ia32_punpckhbw((__v8qi)__m1, (__v8qi)__m2);
gimli_hash.c: ^~~~~~~~~~~~~~~~~~~~~~~~~~~~~~~~~~~~~~~~~~~~~~~~~~~~~~~~~~~
gimli_hash.c: /Library/Developer/CommandLineTools/usr/lib/clang/12.0.5/include/mmintrin.h:239:12: error: invalid conversion between vector type '__m64' (vector of 1 'long long' value) and integer type 'int' of different size
gimli_hash.c: return (__m64)__builtin_ia32_punpckhwd((__v4hi)__m1, (__v4hi)__m2);
gimli_hash.c: ^~~~~~~~~~~~~~~~~~~~~~~~~~~~~~~~~~~~~~~~~~~~~~~~~~~~~~~~~~~
gimli_hash.c: /Library/Developer/CommandLineTools/usr/lib/clang/12.0.5/include/mmintrin.h:260:12: error: invalid conversion between vector type '__m64' (vector of 1 'long long' value) and integer type 'int' of different size
gimli_hash.c: return (__m64)__builtin_ia32_punpckhdq((__v2si)__m1, (__v2si)__m2);
gimli_hash.c: ^~~~~~~~~~~~~~~~~~~~~~~~~~~~~~~~~~~~~~~~~~~~~~~~~~~~~~~~~~~
gimli_hash.c: ...

Number of similar (compiler,implementation) pairs: 2, namely:
CompilerImplementations
clang -mcpu=native -O3 -fomit-frame-pointer -fwrapv -Qunused-arguments -fPIC -fPIE T:sse T:ssealt

Compiler output

Implementation: T:sse
Security model: timingleaks
Compiler: gcc -march=native -mtune=native -O2 -fomit-frame-pointer -fwrapv -fPIC -fPIE
gimli_hash.c: In file included from gimli_hash.c:5:
gimli_hash.c: gimli.inc:1:10: fatal error: x86intrin.h: No such file or directory
gimli_hash.c: 1 | #include <x86intrin.h>
gimli_hash.c: | ^~~~~~~~~~~~~
gimli_hash.c: compilation terminated.

Number of similar (compiler,implementation) pairs: 8, namely:
CompilerImplementations
gcc -march=native -mtune=native -O2 -fomit-frame-pointer -fwrapv -fPIC -fPIE T:sse
gcc -march=native -mtune=native -O3 -fomit-frame-pointer -fwrapv -fPIC -fPIE T:sse
gcc -march=native -mtune=native -O -fomit-frame-pointer -fwrapv -fPIC -fPIE T:sse
gcc -march=native -mtune=native -Os -fomit-frame-pointer -fwrapv -fPIC -fPIE T:sse
gcc -march=native -mtune=native -O2 -fomit-frame-pointer -fwrapv -fPIC -fPIE T:ssealt
gcc -march=native -mtune=native -O3 -fomit-frame-pointer -fwrapv -fPIC -fPIE T:ssealt
gcc -march=native -mtune=native -O -fomit-frame-pointer -fwrapv -fPIC -fPIE T:ssealt
gcc -march=native -mtune=native -Os -fomit-frame-pointer -fwrapv -fPIC -fPIE T:ssealt