Implementation notes: aarch64, minimac, crypto_encrypt/ronald1024

Computer: minimac
Architecture: aarch64
CPU ID: unknown CPU ID
SUPERCOP version: 20210529
Operation: crypto_encrypt
Primitive: ronald1024

Compiler output

Implementation: T:openssl
Security model: timingleaks
Compiler: clang -mcpu=native -O3 -fomit-frame-pointer -fwrapv -Qunused-arguments -fPIC -fPIE
keypair.c: keypair.c:2:10: fatal error: 'openssl/rsa.h' file not found
keypair.c: #include <openssl/rsa.h>
keypair.c: ^~~~~~~~~~~~~~~
keypair.c: 1 error generated.

Number of similar (compiler,implementation) pairs: 1, namely:
CompilerImplementations
clang -mcpu=native -O3 -fomit-frame-pointer -fwrapv -Qunused-arguments -fPIC -fPIE T:openssl

Compiler output

Implementation: T:openssl
Security model: timingleaks
Compiler: gcc -march=native -mtune=native -O2 -fomit-frame-pointer -fwrapv -fPIC -fPIE
keypair.c: keypair.c:2:10: fatal error: openssl/rsa.h: No such file or directory
keypair.c: 2 | #include <openssl/rsa.h>
keypair.c: | ^~~~~~~~~~~~~~~
keypair.c: compilation terminated.

Number of similar (compiler,implementation) pairs: 4, namely:
CompilerImplementations
gcc -march=native -mtune=native -O2 -fomit-frame-pointer -fwrapv -fPIC -fPIE T:openssl
gcc -march=native -mtune=native -O3 -fomit-frame-pointer -fwrapv -fPIC -fPIE T:openssl
gcc -march=native -mtune=native -O -fomit-frame-pointer -fwrapv -fPIC -fPIE T:openssl
gcc -march=native -mtune=native -Os -fomit-frame-pointer -fwrapv -fPIC -fPIE T:openssl

Compiler output

Implementation: T:opensslnew
Security model: timingleaks
Compiler: clang -mcpu=native -O3 -fomit-frame-pointer -fwrapv -Qunused-arguments -fPIC -fPIE
keypair.c: keypair.c:2:10: fatal error: 'openssl/bn.h' file not found
keypair.c: #include <openssl/bn.h>
keypair.c: ^~~~~~~~~~~~~~
keypair.c: 1 error generated.

Number of similar (compiler,implementation) pairs: 1, namely:
CompilerImplementations
clang -mcpu=native -O3 -fomit-frame-pointer -fwrapv -Qunused-arguments -fPIC -fPIE T:opensslnew

Compiler output

Implementation: T:opensslnew
Security model: timingleaks
Compiler: gcc -march=native -mtune=native -O2 -fomit-frame-pointer -fwrapv -fPIC -fPIE
keypair.c: keypair.c:2:10: fatal error: openssl/bn.h: No such file or directory
keypair.c: 2 | #include <openssl/bn.h>
keypair.c: | ^~~~~~~~~~~~~~
keypair.c: compilation terminated.

Number of similar (compiler,implementation) pairs: 4, namely:
CompilerImplementations
gcc -march=native -mtune=native -O2 -fomit-frame-pointer -fwrapv -fPIC -fPIE T:opensslnew
gcc -march=native -mtune=native -O3 -fomit-frame-pointer -fwrapv -fPIC -fPIE T:opensslnew
gcc -march=native -mtune=native -O -fomit-frame-pointer -fwrapv -fPIC -fPIE T:opensslnew
gcc -march=native -mtune=native -Os -fomit-frame-pointer -fwrapv -fPIC -fPIE T:opensslnew