Implementation notes: aarch64, minimac, crypto_encrypt/r5nd1pke0d

Computer: minimac
Architecture: aarch64
CPU ID: unknown CPU ID
SUPERCOP version: 20210529
Operation: crypto_encrypt
Primitive: r5nd1pke0d

Compiler output

Implementation: T:avx2
Security model: timingleaks
Compiler: clang -mcpu=native -O3 -fomit-frame-pointer -fwrapv -Qunused-arguments -fPIC -fPIE
a_fixed.c: In file included from a_fixed.c:10:
a_fixed.c: In file included from ./a_fixed.h:13:
a_fixed.c: ./r5_parameter_sets.h:140:2: warning: AVX2 not supported by platform [-W#warnings]
a_fixed.c: #warning AVX2 not supported by platform
a_fixed.c: ^
a_fixed.c: 1 warning generated.
a_random.c: In file included from a_random.c:10:
a_random.c: In file included from ./a_random.h:13:
a_random.c: ./r5_parameter_sets.h:140:2: warning: AVX2 not supported by platform [-W#warnings]
a_random.c: #warning AVX2 not supported by platform
a_random.c: ^
a_random.c: 1 warning generated.
cca_encrypt.c: In file included from cca_encrypt.c:12:
cca_encrypt.c: In file included from ./cca_encrypt.h:14:
cca_encrypt.c: ./r5_parameter_sets.h:140:2: warning: AVX2 not supported by platform [-W#warnings]
cca_encrypt.c: #warning AVX2 not supported by platform
cca_encrypt.c: ^
cca_encrypt.c: 1 warning generated.
cpa_kem.c: In file included from cpa_kem.c:11:
cpa_kem.c: In file included from ./cpa_kem.h:13:
cpa_kem.c: ./r5_parameter_sets.h:140:2: warning: AVX2 not supported by platform [-W#warnings]
cpa_kem.c: #warning AVX2 not supported by platform
cpa_kem.c: ^
cpa_kem.c: 1 warning generated.
drbg.c: In file included from drbg.c:18:
drbg.c: In file included from ./drbg.h:13:
drbg.c: ./r5_parameter_sets.h:140:2: warning: AVX2 not supported by platform [-W#warnings]
drbg.c: #warning AVX2 not supported by platform
drbg.c: ^
drbg.c: 1 warning generated.
matmul.c: In file included from matmul.c:8:
matmul.c: In file included from ./matmul.h:8:
matmul.c: ./r5_parameter_sets.h:140:2: warning: AVX2 not supported by platform [-W#warnings]
matmul.c: #warning AVX2 not supported by platform
matmul.c: ^
matmul.c: 1 warning generated.
matmul_avx2.c: In file included from matmul_avx2.c:8:
matmul_avx2.c: In file included from ./matmul.h:8:
matmul_avx2.c: ./r5_parameter_sets.h:140:2: warning: AVX2 not supported by platform [-W#warnings]
matmul_avx2.c: #warning AVX2 not supported by platform
matmul_avx2.c: ^
matmul_avx2.c: 1 warning generated.
matmul_cm.c: In file included from matmul_cm.c:7:
matmul_cm.c: In file included from ./matmul.h:8:
matmul_cm.c: ./r5_parameter_sets.h:140:2: warning: AVX2 not supported by platform [-W#warnings]
matmul_cm.c: #warning AVX2 not supported by platform
matmul_cm.c: ^
matmul_cm.c: 1 warning generated.
probe_cm.c: In file included from probe_cm.c:6:
probe_cm.c: ./r5_parameter_sets.h:140:2: warning: AVX2 not supported by platform [-W#warnings]
probe_cm.c: #warning AVX2 not supported by platform
probe_cm.c: ^
probe_cm.c: 1 warning generated.
r5_cca_kem.c: In file included from r5_cca_kem.c:7:
r5_cca_kem.c: ./r5_parameter_sets.h:140:2: warning: AVX2 not supported by platform [-W#warnings]
r5_cca_kem.c: #warning AVX2 not supported by platform
r5_cca_kem.c: ^
r5_cca_kem.c: 1 warning generated.
r5_cca_pke.c: In file included from r5_cca_pke.c:12:
r5_cca_pke.c: ./r5_parameter_sets.h:140:2: warning: AVX2 not supported by platform [-W#warnings]
r5_cca_pke.c: #warning AVX2 not supported by platform
r5_cca_pke.c: ^
r5_cca_pke.c: 1 warning generated.
r5_cpa_kem.c: In file included from r5_cpa_kem.c:9:
r5_cpa_kem.c: ./r5_parameter_sets.h:140:2: warning: AVX2 not supported by platform [-W#warnings]
r5_cpa_kem.c: #warning AVX2 not supported by platform
r5_cpa_kem.c: ^
r5_cpa_kem.c: 1 warning generated.
r5_cpa_pke_n1.c: In file included from r5_cpa_pke_n1.c:6:
r5_cpa_pke_n1.c: ./r5_parameter_sets.h:140:2: warning: AVX2 not supported by platform [-W#warnings]
r5_cpa_pke_n1.c: #warning AVX2 not supported by platform
r5_cpa_pke_n1.c: ^
r5_cpa_pke_n1.c: 1 warning generated.
r5_cpa_pke_nd.c: In file included from r5_cpa_pke_nd.c:7:
r5_cpa_pke_nd.c: ./r5_parameter_sets.h:140:2: warning: AVX2 not supported by platform [-W#warnings]
r5_cpa_pke_nd.c: #warning AVX2 not supported by platform
r5_cpa_pke_nd.c: ^
r5_cpa_pke_nd.c: 1 warning generated.
r5_dem.c: In file included from r5_dem.c:11:
r5_dem.c: ./r5_parameter_sets.h:140:2: warning: AVX2 not supported by platform [-W#warnings]
r5_dem.c: #warning AVX2 not supported by platform
r5_dem.c: ^
r5_dem.c: r5_dem.c:17:10: fatal error: 'openssl/evp.h' file not found
r5_dem.c: #include <openssl/evp.h>
r5_dem.c: ^~~~~~~~~~~~~~~
r5_dem.c: 1 warning and 1 error generated.

Number of similar (compiler,implementation) pairs: 1, namely:
CompilerImplementations
clang -mcpu=native -O3 -fomit-frame-pointer -fwrapv -Qunused-arguments -fPIC -fPIE T:avx2

Compiler output

Implementation: T:avx2
Security model: timingleaks
Compiler: gcc -march=native -mtune=native -O2 -fomit-frame-pointer -fwrapv -fPIC -fPIE
a_fixed.c: In file included from a_fixed.h:13,
a_fixed.c: from a_fixed.c:10:
a_fixed.c: r5_parameter_sets.h:140:2: warning: #warning AVX2 not supported by platform [-Wcpp]
a_fixed.c: 140 | #warning AVX2 not supported by platform
a_fixed.c: | ^~~~~~~
a_random.c: In file included from a_random.h:13,
a_random.c: from a_random.c:10:
a_random.c: r5_parameter_sets.h:140:2: warning: #warning AVX2 not supported by platform [-Wcpp]
a_random.c: 140 | #warning AVX2 not supported by platform
a_random.c: | ^~~~~~~
cca_encrypt.c: In file included from cca_encrypt.h:14,
cca_encrypt.c: from cca_encrypt.c:12:
cca_encrypt.c: r5_parameter_sets.h:140:2: warning: #warning AVX2 not supported by platform [-Wcpp]
cca_encrypt.c: 140 | #warning AVX2 not supported by platform
cca_encrypt.c: | ^~~~~~~
cpa_kem.c: In file included from cpa_kem.h:13,
cpa_kem.c: from cpa_kem.c:11:
cpa_kem.c: r5_parameter_sets.h:140:2: warning: #warning AVX2 not supported by platform [-Wcpp]
cpa_kem.c: 140 | #warning AVX2 not supported by platform
cpa_kem.c: | ^~~~~~~
drbg.c: In file included from drbg.h:13,
drbg.c: from drbg.c:18:
drbg.c: r5_parameter_sets.h:140:2: warning: #warning AVX2 not supported by platform [-Wcpp]
drbg.c: 140 | #warning AVX2 not supported by platform
drbg.c: | ^~~~~~~
matmul.c: In file included from matmul.h:8,
matmul.c: from matmul.c:8:
matmul.c: r5_parameter_sets.h:140:2: warning: #warning AVX2 not supported by platform [-Wcpp]
matmul.c: 140 | #warning AVX2 not supported by platform
matmul.c: | ^~~~~~~
matmul_avx2.c: In file included from matmul.h:8,
matmul_avx2.c: from matmul_avx2.c:8:
matmul_avx2.c: r5_parameter_sets.h:140:2: warning: #warning AVX2 not supported by platform [-Wcpp]
matmul_avx2.c: 140 | #warning AVX2 not supported by platform
matmul_avx2.c: | ^~~~~~~
matmul_cm.c: In file included from matmul.h:8,
matmul_cm.c: from matmul_cm.c:7:
matmul_cm.c: r5_parameter_sets.h:140:2: warning: #warning AVX2 not supported by platform [-Wcpp]
matmul_cm.c: 140 | #warning AVX2 not supported by platform
matmul_cm.c: | ^~~~~~~
probe_cm.c: In file included from probe_cm.c:6:
probe_cm.c: r5_parameter_sets.h:140:2: warning: #warning AVX2 not supported by platform [-Wcpp]
probe_cm.c: 140 | #warning AVX2 not supported by platform
probe_cm.c: | ^~~~~~~
r5_cca_kem.c: In file included from r5_cca_kem.c:7:
r5_cca_kem.c: r5_parameter_sets.h:140:2: warning: #warning AVX2 not supported by platform [-Wcpp]
r5_cca_kem.c: 140 | #warning AVX2 not supported by platform
r5_cca_kem.c: | ^~~~~~~
r5_cca_pke.c: In file included from r5_cca_pke.c:12:
r5_cca_pke.c: r5_parameter_sets.h:140:2: warning: #warning AVX2 not supported by platform [-Wcpp]
r5_cca_pke.c: 140 | #warning AVX2 not supported by platform
r5_cca_pke.c: | ^~~~~~~
r5_cpa_kem.c: In file included from r5_cpa_kem.c:9:
r5_cpa_kem.c: r5_parameter_sets.h:140:2: warning: #warning AVX2 not supported by platform [-Wcpp]
r5_cpa_kem.c: 140 | #warning AVX2 not supported by platform
r5_cpa_kem.c: | ^~~~~~~
r5_cpa_pke_n1.c: In file included from r5_cpa_pke_n1.c:6:
r5_cpa_pke_n1.c: r5_parameter_sets.h:140:2: warning: #warning AVX2 not supported by platform [-Wcpp]
r5_cpa_pke_n1.c: 140 | #warning AVX2 not supported by platform
r5_cpa_pke_n1.c: | ^~~~~~~
r5_cpa_pke_nd.c: In file included from r5_cpa_pke_nd.c:7:
r5_cpa_pke_nd.c: r5_parameter_sets.h:140:2: warning: #warning AVX2 not supported by platform [-Wcpp]
r5_cpa_pke_nd.c: 140 | #warning AVX2 not supported by platform
r5_cpa_pke_nd.c: | ^~~~~~~
r5_dem.c: In file included from r5_dem.c:11:
r5_dem.c: r5_parameter_sets.h:140:2: warning: #warning AVX2 not supported by platform [-Wcpp]
r5_dem.c: 140 | #warning AVX2 not supported by platform
r5_dem.c: | ^~~~~~~
r5_dem.c: r5_dem.c:17:10: fatal error: openssl/evp.h: No such file or directory
r5_dem.c: 17 | #include <openssl/evp.h>
r5_dem.c: | ^~~~~~~~~~~~~~~
r5_dem.c: compilation terminated.

Number of similar (compiler,implementation) pairs: 4, namely:
CompilerImplementations
gcc -march=native -mtune=native -O2 -fomit-frame-pointer -fwrapv -fPIC -fPIE T:avx2
gcc -march=native -mtune=native -O3 -fomit-frame-pointer -fwrapv -fPIC -fPIE T:avx2
gcc -march=native -mtune=native -O -fomit-frame-pointer -fwrapv -fPIC -fPIE T:avx2
gcc -march=native -mtune=native -Os -fomit-frame-pointer -fwrapv -fPIC -fPIE T:avx2

Compiler output

Implementation: T:opt
Security model: timingleaks
Compiler: clang -mcpu=native -O3 -fomit-frame-pointer -fwrapv -Qunused-arguments -fPIC -fPIE
r5_dem.c: r5_dem.c:17:10: fatal error: 'openssl/evp.h' file not found
r5_dem.c: #include <openssl/evp.h>
r5_dem.c: ^~~~~~~~~~~~~~~
r5_dem.c: 1 error generated.

Number of similar (compiler,implementation) pairs: 1, namely:
CompilerImplementations
clang -mcpu=native -O3 -fomit-frame-pointer -fwrapv -Qunused-arguments -fPIC -fPIE T:opt

Compiler output

Implementation: T:opt
Security model: timingleaks
Compiler: gcc -march=native -mtune=native -O2 -fomit-frame-pointer -fwrapv -fPIC -fPIE
r5_dem.c: r5_dem.c:17:10: fatal error: openssl/evp.h: No such file or directory
r5_dem.c: 17 | #include <openssl/evp.h>
r5_dem.c: | ^~~~~~~~~~~~~~~
r5_dem.c: compilation terminated.

Number of similar (compiler,implementation) pairs: 4, namely:
CompilerImplementations
gcc -march=native -mtune=native -O2 -fomit-frame-pointer -fwrapv -fPIC -fPIE T:opt
gcc -march=native -mtune=native -O3 -fomit-frame-pointer -fwrapv -fPIC -fPIE T:opt
gcc -march=native -mtune=native -O -fomit-frame-pointer -fwrapv -fPIC -fPIE T:opt
gcc -march=native -mtune=native -Os -fomit-frame-pointer -fwrapv -fPIC -fPIE T:opt

Compiler output

Implementation: T:ref
Security model: timingleaks
Compiler: clang -mcpu=native -O3 -fomit-frame-pointer -fwrapv -Qunused-arguments -fPIC -fPIE
r5_dem.c: r5_dem.c:16:10: fatal error: 'openssl/evp.h' file not found
r5_dem.c: #include <openssl/evp.h>
r5_dem.c: ^~~~~~~~~~~~~~~
r5_dem.c: 1 error generated.

Number of similar (compiler,implementation) pairs: 1, namely:
CompilerImplementations
clang -mcpu=native -O3 -fomit-frame-pointer -fwrapv -Qunused-arguments -fPIC -fPIE T:ref

Compiler output

Implementation: T:ref
Security model: timingleaks
Compiler: gcc -march=native -mtune=native -O2 -fomit-frame-pointer -fwrapv -fPIC -fPIE
r5_dem.c: r5_dem.c:16:10: fatal error: openssl/evp.h: No such file or directory
r5_dem.c: 16 | #include <openssl/evp.h>
r5_dem.c: | ^~~~~~~~~~~~~~~
r5_dem.c: compilation terminated.

Number of similar (compiler,implementation) pairs: 4, namely:
CompilerImplementations
gcc -march=native -mtune=native -O2 -fomit-frame-pointer -fwrapv -fPIC -fPIE T:ref
gcc -march=native -mtune=native -O3 -fomit-frame-pointer -fwrapv -fPIC -fPIE T:ref
gcc -march=native -mtune=native -O -fomit-frame-pointer -fwrapv -fPIC -fPIE T:ref
gcc -march=native -mtune=native -Os -fomit-frame-pointer -fwrapv -fPIC -fPIE T:ref