Implementation notes: aarch64, minimac, crypto_encrypt/ntruees1087ep1

Computer: minimac
Architecture: aarch64
CPU ID: unknown CPU ID
SUPERCOP version: 20210529
Operation: crypto_encrypt
Primitive: ntruees1087ep1

Compiler output

Implementation: T:ref
Security model: timingleaks
Compiler: clang -mcpu=native -O3 -fomit-frame-pointer -fwrapv -Qunused-arguments -fPIC -fPIE
ntru_crypto_ntru_mult_coeffs_simd.c: In file included from ntru_crypto_ntru_mult_coeffs_simd.c:3:
ntru_crypto_ntru_mult_coeffs_simd.c: In file included from /Library/Developer/CommandLineTools/usr/lib/clang/12.0.5/include/immintrin.h:15:
ntru_crypto_ntru_mult_coeffs_simd.c: /Library/Developer/CommandLineTools/usr/lib/clang/12.0.5/include/mmintrin.h:50:12: error: invalid conversion between vector type '__m64' (vector of 1 'long long' value) and integer type 'int' of different size
ntru_crypto_ntru_mult_coeffs_simd.c: return (__m64)__builtin_ia32_vec_init_v2si(__i, 0);
ntru_crypto_ntru_mult_coeffs_simd.c: ^~~~~~~~~~~~~~~~~~~~~~~~~~~~~~~~~~~~~~~~~~~
ntru_crypto_ntru_mult_coeffs_simd.c: /Library/Developer/CommandLineTools/usr/lib/clang/12.0.5/include/mmintrin.h:129:12: error: invalid conversion between vector type '__m64' (vector of 1 'long long' value) and integer type 'int' of different size
ntru_crypto_ntru_mult_coeffs_simd.c: return (__m64)__builtin_ia32_packsswb((__v4hi)__m1, (__v4hi)__m2);
ntru_crypto_ntru_mult_coeffs_simd.c: ^~~~~~~~~~~~~~~~~~~~~~~~~~~~~~~~~~~~~~~~~~~~~~~~~~~~~~~~~~
ntru_crypto_ntru_mult_coeffs_simd.c: /Library/Developer/CommandLineTools/usr/lib/clang/12.0.5/include/mmintrin.h:159:12: error: invalid conversion between vector type '__m64' (vector of 1 'long long' value) and integer type 'int' of different size
ntru_crypto_ntru_mult_coeffs_simd.c: return (__m64)__builtin_ia32_packssdw((__v2si)__m1, (__v2si)__m2);
ntru_crypto_ntru_mult_coeffs_simd.c: ^~~~~~~~~~~~~~~~~~~~~~~~~~~~~~~~~~~~~~~~~~~~~~~~~~~~~~~~~~
ntru_crypto_ntru_mult_coeffs_simd.c: /Library/Developer/CommandLineTools/usr/lib/clang/12.0.5/include/mmintrin.h:189:12: error: invalid conversion between vector type '__m64' (vector of 1 'long long' value) and integer type 'int' of different size
ntru_crypto_ntru_mult_coeffs_simd.c: return (__m64)__builtin_ia32_packuswb((__v4hi)__m1, (__v4hi)__m2);
ntru_crypto_ntru_mult_coeffs_simd.c: ^~~~~~~~~~~~~~~~~~~~~~~~~~~~~~~~~~~~~~~~~~~~~~~~~~~~~~~~~~
ntru_crypto_ntru_mult_coeffs_simd.c: /Library/Developer/CommandLineTools/usr/lib/clang/12.0.5/include/mmintrin.h:216:12: error: invalid conversion between vector type '__m64' (vector of 1 'long long' value) and integer type 'int' of different size
ntru_crypto_ntru_mult_coeffs_simd.c: return (__m64)__builtin_ia32_punpckhbw((__v8qi)__m1, (__v8qi)__m2);
ntru_crypto_ntru_mult_coeffs_simd.c: ^~~~~~~~~~~~~~~~~~~~~~~~~~~~~~~~~~~~~~~~~~~~~~~~~~~~~~~~~~~
ntru_crypto_ntru_mult_coeffs_simd.c: /Library/Developer/CommandLineTools/usr/lib/clang/12.0.5/include/mmintrin.h:239:12: error: invalid conversion between vector type '__m64' (vector of 1 'long long' value) and integer type 'int' of different size
ntru_crypto_ntru_mult_coeffs_simd.c: return (__m64)__builtin_ia32_punpckhwd((__v4hi)__m1, (__v4hi)__m2);
ntru_crypto_ntru_mult_coeffs_simd.c: ^~~~~~~~~~~~~~~~~~~~~~~~~~~~~~~~~~~~~~~~~~~~~~~~~~~~~~~~~~~
ntru_crypto_ntru_mult_coeffs_simd.c: /Library/Developer/CommandLineTools/usr/lib/clang/12.0.5/include/mmintrin.h:260:12: error: invalid conversion between vector type '__m64' (vector of 1 'long long' value) and integer type 'int' of different size
ntru_crypto_ntru_mult_coeffs_simd.c: return (__m64)__builtin_ia32_punpckhdq((__v2si)__m1, (__v2si)__m2);
ntru_crypto_ntru_mult_coeffs_simd.c: ^~~~~~~~~~~~~~~~~~~~~~~~~~~~~~~~~~~~~~~~~~~~~~~~~~~~~~~~~~~
ntru_crypto_ntru_mult_coeffs_simd.c: /Library/Developer/CommandLineTools/usr/lib/clang/12.0.5/include/mmintrin.h:287:12: error: invalid conversion between vector type '__m64' (vector of 1 'long long' value) and integer type 'int' of different size
ntru_crypto_ntru_mult_coeffs_simd.c: return (__m64)__builtin_ia32_punpcklbw((__v8qi)__m1, (__v8qi)__m2);
ntru_crypto_ntru_mult_coeffs_simd.c: ...

Number of similar (compiler,implementation) pairs: 1, namely:
CompilerImplementations
clang -mcpu=native -O3 -fomit-frame-pointer -fwrapv -Qunused-arguments -fPIC -fPIE T:ref

Compiler output

Implementation: T:ref
Security model: timingleaks
Compiler: gcc -march=native -mtune=native -O2 -fomit-frame-pointer -fwrapv -fPIC -fPIE
ntru_crypto_ntru_mult_coeffs_simd.c: ntru_crypto_ntru_mult_coeffs_simd.c:3:10: fatal error: immintrin.h: No such file or directory
ntru_crypto_ntru_mult_coeffs_simd.c: 3 | #include <immintrin.h>
ntru_crypto_ntru_mult_coeffs_simd.c: | ^~~~~~~~~~~~~
ntru_crypto_ntru_mult_coeffs_simd.c: compilation terminated.

Number of similar (compiler,implementation) pairs: 4, namely:
CompilerImplementations
gcc -march=native -mtune=native -O2 -fomit-frame-pointer -fwrapv -fPIC -fPIE T:ref
gcc -march=native -mtune=native -O3 -fomit-frame-pointer -fwrapv -fPIC -fPIE T:ref
gcc -march=native -mtune=native -O -fomit-frame-pointer -fwrapv -fPIC -fPIE T:ref
gcc -march=native -mtune=native -Os -fomit-frame-pointer -fwrapv -fPIC -fPIE T:ref