Implementation notes: aarch64, minimac, crypto_encrypt/lotus128

Computer: minimac
Architecture: aarch64
CPU ID: unknown CPU ID
SUPERCOP version: 20210529
Operation: crypto_encrypt
Primitive: lotus128

Compiler output

Implementation: T:avx2
Security model: timingleaks
Compiler: clang -mcpu=native -O3 -fomit-frame-pointer -fwrapv -Qunused-arguments -fPIC -fPIE
cpa-pke_opt.c: In file included from cpa-pke_opt.c:9:
cpa-pke_opt.c: ./crypto.h:9:10: fatal error: 'openssl/evp.h' file not found
cpa-pke_opt.c: #include <openssl/evp.h>
cpa-pke_opt.c: ^~~~~~~~~~~~~~~
cpa-pke_opt.c: 1 error generated.

Number of similar (compiler,implementation) pairs: 2, namely:
CompilerImplementations
clang -mcpu=native -O3 -fomit-frame-pointer -fwrapv -Qunused-arguments -fPIC -fPIE T:avx2 T:opt

Compiler output

Implementation: T:avx2
Security model: timingleaks
Compiler: gcc -march=native -mtune=native -O2 -fomit-frame-pointer -fwrapv -fPIC -fPIE
cpa-pke_opt.c: In file included from cpa-pke_opt.c:9:
cpa-pke_opt.c: crypto.h:9:10: fatal error: openssl/evp.h: No such file or directory
cpa-pke_opt.c: 9 | #include <openssl/evp.h>
cpa-pke_opt.c: | ^~~~~~~~~~~~~~~
cpa-pke_opt.c: compilation terminated.

Number of similar (compiler,implementation) pairs: 8, namely:
CompilerImplementations
gcc -march=native -mtune=native -O2 -fomit-frame-pointer -fwrapv -fPIC -fPIE T:avx2
gcc -march=native -mtune=native -O3 -fomit-frame-pointer -fwrapv -fPIC -fPIE T:avx2
gcc -march=native -mtune=native -O -fomit-frame-pointer -fwrapv -fPIC -fPIE T:avx2
gcc -march=native -mtune=native -Os -fomit-frame-pointer -fwrapv -fPIC -fPIE T:avx2
gcc -march=native -mtune=native -O2 -fomit-frame-pointer -fwrapv -fPIC -fPIE T:opt
gcc -march=native -mtune=native -O3 -fomit-frame-pointer -fwrapv -fPIC -fPIE T:opt
gcc -march=native -mtune=native -O -fomit-frame-pointer -fwrapv -fPIC -fPIE T:opt
gcc -march=native -mtune=native -Os -fomit-frame-pointer -fwrapv -fPIC -fPIE T:opt

Compiler output

Implementation: T:ref
Security model: timingleaks
Compiler: clang -mcpu=native -O3 -fomit-frame-pointer -fwrapv -Qunused-arguments -fPIC -fPIE
cpa-pke.c: In file included from cpa-pke.c:9:
cpa-pke.c: ./crypto.h:9:10: fatal error: 'openssl/evp.h' file not found
cpa-pke.c: #include <openssl/evp.h>
cpa-pke.c: ^~~~~~~~~~~~~~~
cpa-pke.c: 1 error generated.

Number of similar (compiler,implementation) pairs: 1, namely:
CompilerImplementations
clang -mcpu=native -O3 -fomit-frame-pointer -fwrapv -Qunused-arguments -fPIC -fPIE T:ref

Compiler output

Implementation: T:ref
Security model: timingleaks
Compiler: gcc -march=native -mtune=native -O2 -fomit-frame-pointer -fwrapv -fPIC -fPIE
cpa-pke.c: In file included from cpa-pke.c:9:
cpa-pke.c: crypto.h:9:10: fatal error: openssl/evp.h: No such file or directory
cpa-pke.c: 9 | #include <openssl/evp.h>
cpa-pke.c: | ^~~~~~~~~~~~~~~
cpa-pke.c: compilation terminated.

Number of similar (compiler,implementation) pairs: 4, namely:
CompilerImplementations
gcc -march=native -mtune=native -O2 -fomit-frame-pointer -fwrapv -fPIC -fPIE T:ref
gcc -march=native -mtune=native -O3 -fomit-frame-pointer -fwrapv -fPIC -fPIE T:ref
gcc -march=native -mtune=native -O -fomit-frame-pointer -fwrapv -fPIC -fPIE T:ref
gcc -march=native -mtune=native -Os -fomit-frame-pointer -fwrapv -fPIC -fPIE T:ref