Implementation notes: aarch64, minimac, crypto_aead/kiasueq128v1

Computer: minimac
Architecture: aarch64
CPU ID: unknown CPU ID
SUPERCOP version: 20210529
Operation: crypto_aead
Primitive: kiasueq128v1
TimeObject sizeTest sizeImplementationCompilerBenchmark dateSUPERCOP version
161861? ? ?? ? ?T:refgcc_-march=native_-mtune=native_-O3_-fomit-frame-pointer_-fwrapv_-fPIC_-fPIE2021040220210326
190926? ? ?? ? ?T:refclang_-mcpu=native_-O3_-fomit-frame-pointer_-fwrapv_-Qunused-arguments_-fPIC_-fPIE2021053020210529
207192? ? ?? ? ?T:refgcc_-march=native_-mtune=native_-O2_-fomit-frame-pointer_-fwrapv_-fPIC_-fPIE2021040220210326
209592? ? ?? ? ?T:refgcc_-march=native_-mtune=native_-Os_-fomit-frame-pointer_-fwrapv_-fPIC_-fPIE2021040220210326
210792? ? ?? ? ?T:refgcc_-march=native_-mtune=native_-O_-fomit-frame-pointer_-fwrapv_-fPIC_-fPIE2021040220210326

Compiler output

Implementation: T:bitslice
Security model: timingleaks
Compiler: clang -mcpu=native -O3 -fomit-frame-pointer -fwrapv -Qunused-arguments -fPIC -fPIE
kiasu.c: kiasu.c:259:17: error: unknown type name 'block'
kiasu.c: void printBlock(block B) {
kiasu.c: ^
kiasu.c: kiasu.c:262:14: error: expected expression
kiasu.c: *(block *)tag=B;
kiasu.c: ^
kiasu.c: kiasu.c:262:7: error: use of undeclared identifier 'block'; did you mean 'lockf'?
kiasu.c: *(block *)tag=B;
kiasu.c: ^~~~~
kiasu.c: lockf
kiasu.c: /Library/Developer/CommandLineTools/SDKs/MacOSX.sdk/usr/include/unistd.h:569:6: note: 'lockf' declared here
kiasu.c: int lockf(int, int, off_t) __DARWIN_ALIAS_C(lockf);
kiasu.c: ^
kiasu.c: kiasu.c:324:15: error: unknown type name 'block'
kiasu.c: ALIGN(16) block ta[BPI]; /* 8 blocks for parallel processing */
kiasu.c: ^
kiasu.c: kiasu.c:326:21: error: unknown type name 'block'
kiasu.c: ALIGN(16) const block* adp; /* Pointer to the blocks to process */
kiasu.c: ^
kiasu.c: kiasu.c:338:17: error: expected expression
kiasu.c: adp=(block *)M1;
kiasu.c: ^
kiasu.c: kiasu.c:338:10: error: use of undeclared identifier 'block'; did you mean 'lockf'?
kiasu.c: adp=(block *)M1;
kiasu.c: ^~~~~
kiasu.c: ...

Number of similar (compiler,implementation) pairs: 1, namely:
CompilerImplementations
clang -mcpu=native -O3 -fomit-frame-pointer -fwrapv -Qunused-arguments -fPIC -fPIE T:bitslice

Compiler output

Implementation: T:bitslice
Security model: timingleaks
Compiler: gcc -march=native -mtune=native -O2 -fomit-frame-pointer -fwrapv -fPIC -fPIE
kiasu.c: kiasu.c:259:17: error: unknown type name 'block'
kiasu.c: 259 | void printBlock(block B) {
kiasu.c: | ^~~~~
kiasu.c: kiasu.c: In function 'XLS':
kiasu.c: kiasu.c:324:15: error: unknown type name 'block'
kiasu.c: 324 | ALIGN(16) block ta[BPI]; /* 8 blocks for parallel processing */
kiasu.c: | ^~~~~
kiasu.c: kiasu.c:326:21: error: unknown type name 'block'
kiasu.c: 326 | ALIGN(16) const block* adp; /* Pointer to the blocks to process */
kiasu.c: | ^~~~~
kiasu.c: kiasu.c:338:10: error: 'block' undeclared (first use in this function)
kiasu.c: 338 | adp=(block *)M1;
kiasu.c: | ^~~~~
kiasu.c: kiasu.c:338:10: note: each undeclared identifier is reported only once for each function it appears in
kiasu.c: kiasu.c:338:17: error: expected expression before ')' token
kiasu.c: 338 | adp=(block *)M1;
kiasu.c: | ^
kiasu.c: kiasu.c:368:17: error: expected expression before ')' token
kiasu.c: 368 | adp=(block *)Xp1;
kiasu.c: | ^
kiasu.c: kiasu.c:399:17: error: expected expression before ')' token
kiasu.c: 399 | adp=(block *)Yp1;
kiasu.c: | ^
kiasu.c: kiasu.c: In function 'kiasu_aead_encrypt':
kiasu.c: kiasu.c:443:15: error: unknown type name 'block'
kiasu.c: ...

Number of similar (compiler,implementation) pairs: 4, namely:
CompilerImplementations
gcc -march=native -mtune=native -O2 -fomit-frame-pointer -fwrapv -fPIC -fPIE T:bitslice
gcc -march=native -mtune=native -O3 -fomit-frame-pointer -fwrapv -fPIC -fPIE T:bitslice
gcc -march=native -mtune=native -O -fomit-frame-pointer -fwrapv -fPIC -fPIE T:bitslice
gcc -march=native -mtune=native -Os -fomit-frame-pointer -fwrapv -fPIC -fPIE T:bitslice

Compiler output

Implementation: T:opt
Security model: timingleaks
Compiler: clang -mcpu=native -O3 -fomit-frame-pointer -fwrapv -Qunused-arguments -fPIC -fPIE
kiasu.c: In file included from kiasu.c:26:
kiasu.c: In file included from /Library/Developer/CommandLineTools/usr/lib/clang/12.0.5/include/xmmintrin.h:13:
kiasu.c: /Library/Developer/CommandLineTools/usr/lib/clang/12.0.5/include/mmintrin.h:50:12: error: invalid conversion between vector type '__m64' (vector of 1 'long long' value) and integer type 'int' of different size
kiasu.c: return (__m64)__builtin_ia32_vec_init_v2si(__i, 0);
kiasu.c: ^~~~~~~~~~~~~~~~~~~~~~~~~~~~~~~~~~~~~~~~~~~
kiasu.c: /Library/Developer/CommandLineTools/usr/lib/clang/12.0.5/include/mmintrin.h:129:12: error: invalid conversion between vector type '__m64' (vector of 1 'long long' value) and integer type 'int' of different size
kiasu.c: return (__m64)__builtin_ia32_packsswb((__v4hi)__m1, (__v4hi)__m2);
kiasu.c: ^~~~~~~~~~~~~~~~~~~~~~~~~~~~~~~~~~~~~~~~~~~~~~~~~~~~~~~~~~
kiasu.c: /Library/Developer/CommandLineTools/usr/lib/clang/12.0.5/include/mmintrin.h:159:12: error: invalid conversion between vector type '__m64' (vector of 1 'long long' value) and integer type 'int' of different size
kiasu.c: return (__m64)__builtin_ia32_packssdw((__v2si)__m1, (__v2si)__m2);
kiasu.c: ^~~~~~~~~~~~~~~~~~~~~~~~~~~~~~~~~~~~~~~~~~~~~~~~~~~~~~~~~~
kiasu.c: /Library/Developer/CommandLineTools/usr/lib/clang/12.0.5/include/mmintrin.h:189:12: error: invalid conversion between vector type '__m64' (vector of 1 'long long' value) and integer type 'int' of different size
kiasu.c: return (__m64)__builtin_ia32_packuswb((__v4hi)__m1, (__v4hi)__m2);
kiasu.c: ^~~~~~~~~~~~~~~~~~~~~~~~~~~~~~~~~~~~~~~~~~~~~~~~~~~~~~~~~~
kiasu.c: /Library/Developer/CommandLineTools/usr/lib/clang/12.0.5/include/mmintrin.h:216:12: error: invalid conversion between vector type '__m64' (vector of 1 'long long' value) and integer type 'int' of different size
kiasu.c: return (__m64)__builtin_ia32_punpckhbw((__v8qi)__m1, (__v8qi)__m2);
kiasu.c: ^~~~~~~~~~~~~~~~~~~~~~~~~~~~~~~~~~~~~~~~~~~~~~~~~~~~~~~~~~~
kiasu.c: /Library/Developer/CommandLineTools/usr/lib/clang/12.0.5/include/mmintrin.h:239:12: error: invalid conversion between vector type '__m64' (vector of 1 'long long' value) and integer type 'int' of different size
kiasu.c: return (__m64)__builtin_ia32_punpckhwd((__v4hi)__m1, (__v4hi)__m2);
kiasu.c: ^~~~~~~~~~~~~~~~~~~~~~~~~~~~~~~~~~~~~~~~~~~~~~~~~~~~~~~~~~~
kiasu.c: /Library/Developer/CommandLineTools/usr/lib/clang/12.0.5/include/mmintrin.h:260:12: error: invalid conversion between vector type '__m64' (vector of 1 'long long' value) and integer type 'int' of different size
kiasu.c: return (__m64)__builtin_ia32_punpckhdq((__v2si)__m1, (__v2si)__m2);
kiasu.c: ^~~~~~~~~~~~~~~~~~~~~~~~~~~~~~~~~~~~~~~~~~~~~~~~~~~~~~~~~~~
kiasu.c: /Library/Developer/CommandLineTools/usr/lib/clang/12.0.5/include/mmintrin.h:287:12: error: invalid conversion between vector type '__m64' (vector of 1 'long long' value) and integer type 'int' of different size
kiasu.c: return (__m64)__builtin_ia32_punpcklbw((__v8qi)__m1, (__v8qi)__m2);
kiasu.c: ...

Number of similar (compiler,implementation) pairs: 1, namely:
CompilerImplementations
clang -mcpu=native -O3 -fomit-frame-pointer -fwrapv -Qunused-arguments -fPIC -fPIE T:opt

Compiler output

Implementation: T:opt
Security model: timingleaks
Compiler: gcc -march=native -mtune=native -O2 -fomit-frame-pointer -fwrapv -fPIC -fPIE
kiasu.c: kiasu.c:26:10: fatal error: xmmintrin.h: No such file or directory
kiasu.c: 26 | #include <xmmintrin.h> /* SSE instructions and _mm_malloc */
kiasu.c: | ^~~~~~~~~~~~~
kiasu.c: compilation terminated.

Number of similar (compiler,implementation) pairs: 4, namely:
CompilerImplementations
gcc -march=native -mtune=native -O2 -fomit-frame-pointer -fwrapv -fPIC -fPIE T:opt
gcc -march=native -mtune=native -O3 -fomit-frame-pointer -fwrapv -fPIC -fPIE T:opt
gcc -march=native -mtune=native -O -fomit-frame-pointer -fwrapv -fPIC -fPIE T:opt
gcc -march=native -mtune=native -Os -fomit-frame-pointer -fwrapv -fPIC -fPIE T:opt

Compiler output

Implementation: T:ref
Security model: timingleaks
Compiler: clang -mcpu=native -O3 -fomit-frame-pointer -fwrapv -Qunused-arguments -fPIC -fPIE
try.c: ld: warning: object file (/Users/djb/supercop-20210529/supercop-data/minimac/aarch64/lib/kernelrandombytes.o) was built for newer macOS version (11.3) than being linked (11.0)
try.c: ld: warning: object file (/Users/djb/supercop-20210529/supercop-data/minimac/aarch64/lib/cpucycles.o) was built for newer macOS version (11.3) than being linked (11.0)
try.c: ld: warning: could not create compact unwind for _init: registers 21 and 22 not saved contiguously in frame
try.c: ld: warning: object file (/Users/djb/supercop-20210529/supercop-data/minimac/aarch64/lib/kernelrandombytes.o) was built for newer macOS version (11.3) than being linked (11.0)
try.c: ld: warning: object file (/Users/djb/supercop-20210529/supercop-data/minimac/aarch64/lib/cpucycles.o) was built for newer macOS version (11.3) than being linked (11.0)
try.c: ld: warning: could not create compact unwind for _init: registers 21 and 22 not saved contiguously in frame
measure.c: ld: warning: object file (/Users/djb/supercop-20210529/supercop-data/minimac/aarch64/lib/kernelrandombytes.o) was built for newer macOS version (11.3) than being linked (11.0)
measure.c: ld: warning: object file (/Users/djb/supercop-20210529/supercop-data/minimac/aarch64/lib/cpucycles.o) was built for newer macOS version (11.3) than being linked (11.0)
measure.c: ld: warning: could not create compact unwind for _init: registers 21 and 22 not saved contiguously in frame

Number of similar (compiler,implementation) pairs: 1, namely:
CompilerImplementations
clang -mcpu=native -O3 -fomit-frame-pointer -fwrapv -Qunused-arguments -fPIC -fPIE T:ref