Implementation notes: aarch64, gcc185, crypto_sign/rainbow5640

Computer: gcc185
Microarchitecture: aarch64; Skylark (503f0002)
Architecture: aarch64
CPU ID: 503f0002
SUPERCOP version: 20230530
Operation: crypto_sign
Primitive: rainbow5640

Compiler output

Implementation: T:ref
Security model: timingleaks
Compiler: clang++ -march=native -O2 -fomit-frame-pointer -fwrapv -Qunused-arguments -fPIC -fPIE
rainbow_w-test.cpp: In file included from rainbow_w-test.cpp:6:
rainbow_w-test.cpp: In file included from ./rainbow_w.h:7:
rainbow_w-test.cpp: In file included from ./bqas.h:5:
rainbow_w-test.cpp: In file included from ./gfv.h:3:
rainbow_w-test.cpp: /usr/lib64/clang/15.0.7/include/emmintrin.h:14:2: error: "This header is only meant to be used on x86 and x64 architecture"
rainbow_w-test.cpp: #error "This header is only meant to be used on x86 and x64 architecture"
rainbow_w-test.cpp: ^
rainbow_w-test.cpp: In file included from rainbow_w-test.cpp:6:
rainbow_w-test.cpp: In file included from ./rainbow_w.h:7:
rainbow_w-test.cpp: In file included from ./bqas.h:5:
rainbow_w-test.cpp: In file included from ./gfv.h:3:
rainbow_w-test.cpp: In file included from /usr/lib64/clang/15.0.7/include/emmintrin.h:17:
rainbow_w-test.cpp: /usr/lib64/clang/15.0.7/include/xmmintrin.h:14:2: error: "This header is only meant to be used on x86 and x64 architecture"
rainbow_w-test.cpp: #error "This header is only meant to be used on x86 and x64 architecture"
rainbow_w-test.cpp: ^
rainbow_w-test.cpp: In file included from rainbow_w-test.cpp:6:
rainbow_w-test.cpp: In file included from ./rainbow_w.h:7:
rainbow_w-test.cpp: In file included from ./bqas.h:5:
rainbow_w-test.cpp: In file included from ./gfv.h:3:
rainbow_w-test.cpp: In file included from /usr/lib64/clang/15.0.7/include/emmintrin.h:17:
rainbow_w-test.cpp: In file included from /usr/lib64/clang/15.0.7/include/xmmintrin.h:17:
rainbow_w-test.cpp: /usr/lib64/clang/15.0.7/include/mmintrin.h:14:2: error: "This header is only meant to be used on x86 and x64 architecture"
rainbow_w-test.cpp: #error "This header is only meant to be used on x86 and x64 architecture"
rainbow_w-test.cpp: ^
rainbow_w-test.cpp: /usr/lib64/clang/15.0.7/include/mmintrin.h:37:5: error: use of undeclared identifier '__builtin_ia32_emms'; did you mean '__builtin_isless'?
rainbow_w-test.cpp: ...

Number of similar (compiler,implementation) pairs: 4, namely:
CompilerImplementations
clang++ -march=native -O2 -fomit-frame-pointer -fwrapv -Qunused-arguments -fPIC -fPIE T:ref
clang++ -march=native -O3 -fomit-frame-pointer -fwrapv -Qunused-arguments -fPIC -fPIE T:ref
clang++ -march=native -O -fomit-frame-pointer -fwrapv -Qunused-arguments -fPIC -fPIE T:ref
clang++ -march=native -Os -fomit-frame-pointer -fwrapv -Qunused-arguments -fPIC -fPIE T:ref

Compiler output

Implementation: T:ref
Security model: timingleaks
Compiler: g++ -march=native -mtune=native -O2 -fomit-frame-pointer -fwrapv -fPIC -fPIE
rainbow_w-test.cpp: In file included from bqas.h:5,
rainbow_w-test.cpp: from rainbow_w.h:7,
rainbow_w-test.cpp: from rainbow_w-test.cpp:6:
rainbow_w-test.cpp: gfv.h:3:10: fatal error: emmintrin.h: No such file or directory
rainbow_w-test.cpp: #include <emmintrin.h>
rainbow_w-test.cpp: ^~~~~~~~~~~~~
rainbow_w-test.cpp: compilation terminated.

Number of similar (compiler,implementation) pairs: 4, namely:
CompilerImplementations
g++ -march=native -mtune=native -O2 -fomit-frame-pointer -fwrapv -fPIC -fPIE T:ref
g++ -march=native -mtune=native -O3 -fomit-frame-pointer -fwrapv -fPIC -fPIE T:ref
g++ -march=native -mtune=native -O -fomit-frame-pointer -fwrapv -fPIC -fPIE T:ref
g++ -march=native -mtune=native -Os -fomit-frame-pointer -fwrapv -fPIC -fPIE T:ref