Implementation notes: aarch64, gcc185, crypto_aead/twine80n6t4clocv3

Computer: gcc185
Architecture: aarch64
CPU ID: 503f0002
SUPERCOP version: 20211108
Operation: crypto_aead
Primitive: twine80n6t4clocv3
TimeObject sizeTest sizeImplementationCompilerBenchmark dateSUPERCOP version
10675506528 0 29222888 824 1168T:refclang_-mcpu=native_-O3_-fomit-frame-pointer_-fwrapv_-Qunused-arguments_-fPIC_-fPIE2021110920211108
12384906274 0 420478 848 1152T:refgcc_-march=native_-mtune=native_-O2_-fomit-frame-pointer_-fwrapv_-fPIC_-fPIE2021110920211108
19440307642 0 422958 848 1168T:refgcc_-march=native_-mtune=native_-O3_-fomit-frame-pointer_-fwrapv_-fPIC_-fPIE2021110920211108
23070306054 0 420254 848 1152T:refgcc_-march=native_-mtune=native_-O_-fomit-frame-pointer_-fwrapv_-fPIC_-fPIE2021110920211108
23466305528 0 418734 832 1144T:refgcc_-march=native_-mtune=native_-Os_-fomit-frame-pointer_-fwrapv_-fPIC_-fPIE2021110920211108

Compiler output

Implementation: T:vperm
Security model: timingleaks
Compiler: clang -mcpu=native -O3 -fomit-frame-pointer -fwrapv -Qunused-arguments -fPIC -fPIE
cloc.c: In file included from cloc.c:5:
cloc.c: In file included from ./cloc.h:2:
cloc.c: In file included from ./common.h:4:
cloc.c: In file included from /usr/lib64/clang/12.0.1/include/xmmintrin.h:13:
cloc.c: /usr/lib64/clang/12.0.1/include/mmintrin.h:50:12: error: invalid conversion between vector type '__m64' (vector of 1 'long long' value) and integer type 'int' of different size
cloc.c: return (__m64)__builtin_ia32_vec_init_v2si(__i, 0);
cloc.c: ^~~~~~~~~~~~~~~~~~~~~~~~~~~~~~~~~~~~~~~~~~~
cloc.c: /usr/lib64/clang/12.0.1/include/mmintrin.h:129:12: error: invalid conversion between vector type '__m64' (vector of 1 'long long' value) and integer type 'int' of different size
cloc.c: return (__m64)__builtin_ia32_packsswb((__v4hi)__m1, (__v4hi)__m2);
cloc.c: ^~~~~~~~~~~~~~~~~~~~~~~~~~~~~~~~~~~~~~~~~~~~~~~~~~~~~~~~~~
cloc.c: /usr/lib64/clang/12.0.1/include/mmintrin.h:159:12: error: invalid conversion between vector type '__m64' (vector of 1 'long long' value) and integer type 'int' of different size
cloc.c: return (__m64)__builtin_ia32_packssdw((__v2si)__m1, (__v2si)__m2);
cloc.c: ^~~~~~~~~~~~~~~~~~~~~~~~~~~~~~~~~~~~~~~~~~~~~~~~~~~~~~~~~~
cloc.c: /usr/lib64/clang/12.0.1/include/mmintrin.h:189:12: error: invalid conversion between vector type '__m64' (vector of 1 'long long' value) and integer type 'int' of different size
cloc.c: return (__m64)__builtin_ia32_packuswb((__v4hi)__m1, (__v4hi)__m2);
cloc.c: ^~~~~~~~~~~~~~~~~~~~~~~~~~~~~~~~~~~~~~~~~~~~~~~~~~~~~~~~~~
cloc.c: /usr/lib64/clang/12.0.1/include/mmintrin.h:216:12: error: invalid conversion between vector type '__m64' (vector of 1 'long long' value) and integer type 'int' of different size
cloc.c: return (__m64)__builtin_ia32_punpckhbw((__v8qi)__m1, (__v8qi)__m2);
cloc.c: ^~~~~~~~~~~~~~~~~~~~~~~~~~~~~~~~~~~~~~~~~~~~~~~~~~~~~~~~~~~
cloc.c: /usr/lib64/clang/12.0.1/include/mmintrin.h:239:12: error: invalid conversion between vector type '__m64' (vector of 1 'long long' value) and integer type 'int' of different size
cloc.c: return (__m64)__builtin_ia32_punpckhwd((__v4hi)__m1, (__v4hi)__m2);
cloc.c: ^~~~~~~~~~~~~~~~~~~~~~~~~~~~~~~~~~~~~~~~~~~~~~~~~~~~~~~~~~~
cloc.c: /usr/lib64/clang/12.0.1/include/mmintrin.h:260:12: error: invalid conversion between vector type '__m64' (vector of 1 'long long' value) and integer type 'int' of different size
cloc.c: return (__m64)__builtin_ia32_punpckhdq((__v2si)__m1, (__v2si)__m2);
cloc.c: ^~~~~~~~~~~~~~~~~~~~~~~~~~~~~~~~~~~~~~~~~~~~~~~~~~~~~~~~~~~
cloc.c: ...

Number of similar (compiler,implementation) pairs: 1, namely:
CompilerImplementations
clang -mcpu=native -O3 -fomit-frame-pointer -fwrapv -Qunused-arguments -fPIC -fPIE T:vperm

Compiler output

Implementation: T:vperm
Security model: timingleaks
Compiler: gcc -march=native -mtune=native -O2 -fomit-frame-pointer -fwrapv -fPIC -fPIE
cloc.c: In file included from cloc.h:2,
cloc.c: from cloc.c:5:
cloc.c: common.h:4:10: fatal error: xmmintrin.h: No such file or directory
cloc.c: #include <xmmintrin.h>
cloc.c: ^~~~~~~~~~~~~
cloc.c: compilation terminated.

Number of similar (compiler,implementation) pairs: 4, namely:
CompilerImplementations
gcc -march=native -mtune=native -O2 -fomit-frame-pointer -fwrapv -fPIC -fPIE T:vperm
gcc -march=native -mtune=native -O3 -fomit-frame-pointer -fwrapv -fPIC -fPIE T:vperm
gcc -march=native -mtune=native -O -fomit-frame-pointer -fwrapv -fPIC -fPIE T:vperm
gcc -march=native -mtune=native -Os -fomit-frame-pointer -fwrapv -fPIC -fPIE T:vperm