Test results for aarch64, cfarm425, crypto_hash/asconxofav12

[Page version: 20261005 22:53:57]

Measurements for aarch64, cfarm425, crypto_hash Test results for aarch64, cfarm425, crypto_hash Test results for crypto_hash/asconxofav12
Computer: cfarm425
Microarchitecture: aarch64; Cortex-A76 (413fd0c1)
Architecture: aarch64
CPU ID: 413fd0c1
SUPERCOP version: 20261004
Operation: crypto_hash
Primitive: asconxofav12
TimeObject sizeTest sizeImplementationCompilerBenchmark dateSUPERCOP version
155633544 0 023084 1200 1416opt64gcc -march=native -mtune=native -O3 -fwrapv -fPIC -fPIE -gdwarf-4 -Wall2026100520261004
181134376 0 023900 1200 1416refgcc -march=native -mtune=native -O3 -fwrapv -fPIC -fPIE -gdwarf-4 -Wall2026100520261004
19876620 0 020132 1200 1416opt64_lowsizegcc -march=native -mtune=native -O3 -fwrapv -fPIC -fPIE -gdwarf-4 -Wall2026100520261004
220344980 0 024524 1200 1416opt32gcc -march=native -mtune=native -O3 -fwrapv -fPIC -fPIE -gdwarf-4 -Wall2026100520261004
25356660 0 020164 1200 1416opt32_lowsizegcc -march=native -mtune=native -O3 -fwrapv -fPIC -fPIE -gdwarf-4 -Wall2026100520261004
558927884 0 027404 1208 1416bi32gcc -march=native -mtune=native -O3 -fwrapv -fPIC -fPIE -gdwarf-4 -Wall2026100520261004
567032548 0 022148 1216 1416bi32_lowreggcc -march=native -mtune=native -O3 -fwrapv -fPIC -fPIE -gdwarf-4 -Wall2026100520261004
583951312 0 020884 1208 1416bi32_lowsizegcc -march=native -mtune=native -O3 -fwrapv -fPIC -fPIE -gdwarf-4 -Wall2026100520261004
1214162288 0 021492 1208 1416bi8gcc -march=native -mtune=native -O3 -fwrapv -fPIC -fPIE -gdwarf-4 -Wall2026100520261004
1934042188 0 021724 1200 1416opt8gcc -march=native -mtune=native -O3 -fwrapv -fPIC -fPIE -gdwarf-4 -Wall2026100520261004
1951551788 0 021300 1200 1416opt8_lowsizegcc -march=native -mtune=native -O3 -fwrapv -fPIC -fPIE -gdwarf-4 -Wall2026100520261004

Compiler output


permutations.c: /tmp/ccE2YmAA.s: Assembler messages:
permutations.c: /tmp/ccE2YmAA.s:181: Error: immediate out of range at operand 3 -- `eor x13,x13,225'
permutations.c: /tmp/ccE2YmAA.s:287: Error: immediate out of range at operand 3 -- `eor x13,x13,210'
permutations.c: /tmp/ccE2YmAA.s:393: Error: immediate out of range at operand 3 -- `eor x13,x13,195'
permutations.c: /tmp/ccE2YmAA.s:499: Error: immediate out of range at operand 3 -- `eor x13,x13,180'
permutations.c: /tmp/ccE2YmAA.s:605: Error: immediate out of range at operand 3 -- `eor x13,x13,165'
permutations.c: /tmp/ccE2YmAA.s:711: Error: immediate out of range at operand 3 -- `eor x13,x13,150'
permutations.c: /tmp/ccE2YmAA.s:817: Error: immediate out of range at operand 3 -- `eor x13,x13,135'
permutations.c: /tmp/ccE2YmAA.s:1029: Error: immediate out of range at operand 3 -- `eor x13,x13,105'
permutations.c: /tmp/ccE2YmAA.s:1135: Error: immediate out of range at operand 3 -- `eor x13,x13,90'
permutations.c: /tmp/ccE2YmAA.s:1241: Error: immediate out of range at operand 3 -- `eor x13,x13,75'
permutations.c: /tmp/ccE2YmAA.s:1410: Error: immediate out of range at operand 3 -- `eor x13,x13,180'
permutations.c: /tmp/ccE2YmAA.s:1524: Error: immediate out of range at operand 3 -- `eor x13,x13,165'
permutations.c: /tmp/ccE2YmAA.s:1630: Error: immediate out of range at operand 3 -- `eor x13,x13,150'
permutations.c: /tmp/ccE2YmAA.s:1736: Error: immediate out of range at operand 3 -- `eor x13,x13,135'
permutations.c: /tmp/ccE2YmAA.s:1948: Error: immediate out of range at operand 3 -- `eor x13,x13,105'
permutations.c: /tmp/ccE2YmAA.s:2054: Error: immediate out of range at operand 3 -- `eor x13,x13,90'
permutations.c: /tmp/ccE2YmAA.s:2160: Error: immediate out of range at operand 3 -- `eor x13,x13,75'

Number of similar (implementation,compiler) pairs: 1, namely:
ImplementationCompiler
armv6gcc -march=native -mtune=native -O3 -fwrapv -fPIC -fPIE -gdwarf-4 -Wall (16.2.0)

Compiler output


permutations.c: /tmp/ccscJlp1.s: Assembler messages:
permutations.c: /tmp/ccscJlp1.s:126: Error: expected a register at operand 2 -- `sub x1,#15'

Number of similar (implementation,compiler) pairs: 1, namely:
ImplementationCompiler
armv6_lowsizegcc -march=native -mtune=native -O3 -fwrapv -fPIC -fPIE -gdwarf-4 -Wall (16.2.0)

Compiler output


hash.c: In file included from permutations.h:11,
hash.c:                  from hash.c:4:
hash.c: In function 'ROUND_LOOP',
hash.c:     inlined from 'PROUNDS' at round.h:348:54,
hash.c:     inlined from 'P' at permutations.h:70:48,
hash.c:     inlined from 'ascon_absorb' at hash.c:54:5,
hash.c:     inlined from 'crypto_hash_asconxofav12_armv6m_constbranchindex' at hash.c:84:3:
hash.c: round.h:12:3: error: impossible constraint in 'asm'
hash.c:    12 |   __asm__ __volatile__(
hash.c:       |   ^~~~~~~
hash.c: In function 'ROUND_LOOP',
hash.c:     inlined from 'PROUNDS' at round.h:348:54,
hash.c:     inlined from 'P' at permutations.h:70:48,
hash.c:     inlined from 'ascon_squeeze' at hash.c:67:3,
hash.c:     inlined from 'crypto_hash_asconxofav12_armv6m_constbranchindex' at hash.c:85:3:
hash.c: round.h:12:3: error: impossible constraint in 'asm'
hash.c:    12 |   __asm__ __volatile__(
hash.c:       |   ^~~~~~~
hash.c: In function 'ROUND_LOOP',
hash.c:     inlined from 'PROUNDS' at round.h:348:54,
hash.c:     inlined from 'P' at permutations.h:70:48,
hash.c:     inlined from 'ascon_squeeze' at hash.c:71:5,
hash.c:     inlined from 'crypto_hash_asconxofav12_armv6m_constbranchindex' at hash.c:85:3:
hash.c: round.h:12:3: error: impossible constraint in 'asm'
hash.c:    12 |   __asm__ __volatile__(
hash.c: ...

Number of similar (implementation,compiler) pairs: 1, namely:
ImplementationCompiler
armv6mgcc -march=native -mtune=native -O3 -fwrapv -fPIC -fPIE -gdwarf-4 -Wall (16.2.0)

Compiler output


permutations.c: In file included from permutations.h:11,
permutations.c:                  from permutations.c:1:
permutations.c: In function 'ROUND_LOOP',
permutations.c:     inlined from 'PROUNDS' at round.h:348:54,
permutations.c:     inlined from 'P' at permutations.c:27:36:
permutations.c: round.h:12:3: error: impossible constraint in 'asm'
permutations.c:    12 |   __asm__ __volatile__(
permutations.c:       |   ^~~~~~~

Number of similar (implementation,compiler) pairs: 1, namely:
ImplementationCompiler
armv6m_lowsizegcc -march=native -mtune=native -O3 -fwrapv -fPIC -fPIE -gdwarf-4 -Wall (16.2.0)

Compiler output


permutations.c: /tmp/ccQXqRJ7.s: Assembler messages:
permutations.c: /tmp/ccQXqRJ7.s:179: Error: immediate out of range at operand 3 -- `eor x13,x13,225'
permutations.c: /tmp/ccQXqRJ7.s:283: Error: immediate out of range at operand 3 -- `eor x13,x13,210'
permutations.c: /tmp/ccQXqRJ7.s:387: Error: immediate out of range at operand 3 -- `eor x13,x13,195'
permutations.c: /tmp/ccQXqRJ7.s:491: Error: immediate out of range at operand 3 -- `eor x13,x13,180'
permutations.c: /tmp/ccQXqRJ7.s:595: Error: immediate out of range at operand 3 -- `eor x13,x13,165'
permutations.c: /tmp/ccQXqRJ7.s:699: Error: immediate out of range at operand 3 -- `eor x13,x13,150'
permutations.c: /tmp/ccQXqRJ7.s:803: Error: immediate out of range at operand 3 -- `eor x13,x13,135'
permutations.c: /tmp/ccQXqRJ7.s:1011: Error: immediate out of range at operand 3 -- `eor x13,x13,105'
permutations.c: /tmp/ccQXqRJ7.s:1115: Error: immediate out of range at operand 3 -- `eor x13,x13,90'
permutations.c: /tmp/ccQXqRJ7.s:1219: Error: immediate out of range at operand 3 -- `eor x13,x13,75'
permutations.c: /tmp/ccQXqRJ7.s:1386: Error: immediate out of range at operand 3 -- `eor x13,x13,180'
permutations.c: /tmp/ccQXqRJ7.s:1498: Error: immediate out of range at operand 3 -- `eor x13,x13,165'
permutations.c: /tmp/ccQXqRJ7.s:1602: Error: immediate out of range at operand 3 -- `eor x13,x13,150'
permutations.c: /tmp/ccQXqRJ7.s:1706: Error: immediate out of range at operand 3 -- `eor x13,x13,135'
permutations.c: /tmp/ccQXqRJ7.s:1914: Error: immediate out of range at operand 3 -- `eor x13,x13,105'
permutations.c: /tmp/ccQXqRJ7.s:2018: Error: immediate out of range at operand 3 -- `eor x13,x13,90'
permutations.c: /tmp/ccQXqRJ7.s:2122: Error: immediate out of range at operand 3 -- `eor x13,x13,75'

Number of similar (implementation,compiler) pairs: 1, namely:
ImplementationCompiler
armv7mgcc -march=native -mtune=native -O3 -fwrapv -fPIC -fPIE -gdwarf-4 -Wall (16.2.0)

Compiler output


permutations.c: /tmp/ccKGZfqJ.s: Assembler messages:
permutations.c: /tmp/ccKGZfqJ.s:122: Error: expected a register at operand 2 -- `sub x1,#15'

Number of similar (implementation,compiler) pairs: 1, namely:
ImplementationCompiler
armv7m_lowsizegcc -march=native -mtune=native -O3 -fwrapv -fPIC -fPIE -gdwarf-4 -Wall (16.2.0)

Compiler output


permutations.c: /tmp/cccb4KlL.s: Assembler messages:
permutations.c: /tmp/cccb4KlL.s:122: Error: expected a register at operand 2 -- `sub x1,#15'

Number of similar (implementation,compiler) pairs: 1, namely:
ImplementationCompiler
armv7m_smallgcc -march=native -mtune=native -O3 -fwrapv -fPIC -fPIE -gdwarf-4 -Wall (16.2.0)

Compiler output


ascon.S: ascon.S:1:10: fatal error: xtensa/coreasm.h: No such file or directory
ascon.S:     1 | #include <xtensa/coreasm.h>
ascon.S:       |          ^~~~~~~~~~~~~~~~~~
ascon.S: compilation terminated.

Number of similar (implementation,compiler) pairs: 1, namely:
ImplementationCompiler
T:asm_esp32gcc -march=native -mtune=native -O3 -fwrapv -fPIC -fPIE -gdwarf-4 -Wall (16.2.0)

Compiler output


permutations.c: /tmp/ccRvgi8A.s: Assembler messages:
permutations.c: /tmp/ccRvgi8A.s:162: Error: immediate out of range at operand 3 -- `eor x13,x13,9'
permutations.c: /tmp/ccRvgi8A.s:266: Error: immediate out of range at operand 3 -- `eor x8,x8,9'
permutations.c: /tmp/ccRvgi8A.s:336: Error: immediate out of range at operand 3 -- `eor x13,x13,9'
permutations.c: /tmp/ccRvgi8A.s:353: Error: immediate out of range at operand 3 -- `eor x8,x8,9'
permutations.c: /tmp/ccRvgi8A.s:614: Error: immediate out of range at operand 3 -- `eor x8,x8,9'
permutations.c: /tmp/ccRvgi8A.s:701: Error: immediate out of range at operand 3 -- `eor x8,x8,9'
permutations.c: /tmp/ccRvgi8A.s:858: Error: immediate out of range at operand 3 -- `eor x13,x13,9'
permutations.c: /tmp/ccRvgi8A.s:1032: Error: immediate out of range at operand 3 -- `eor x13,x13,9'
permutations.c: /tmp/ccRvgi8A.s:1381: Error: immediate out of range at operand 3 -- `eor x8,x8,9'
permutations.c: /tmp/ccRvgi8A.s:1468: Error: immediate out of range at operand 3 -- `eor x8,x8,9'
permutations.c: /tmp/ccRvgi8A.s:1625: Error: immediate out of range at operand 3 -- `eor x13,x13,9'
permutations.c: /tmp/ccRvgi8A.s:1799: Error: immediate out of range at operand 3 -- `eor x13,x13,9'

Number of similar (implementation,compiler) pairs: 1, namely:
ImplementationCompiler
bi32_armv6gcc -march=native -mtune=native -O3 -fwrapv -fPIC -fPIE -gdwarf-4 -Wall (16.2.0)

Compiler output


hash.c: In file included from permutations.h:11,
hash.c:                  from hash.c:4:
hash.c: round.h: In function 'ROUND_LOOP':
hash.c: round.h:12:12: warning: unused variable 'tmp0' [-Wunused-variable]
hash.c:    12 |   uint32_t tmp0, tmp1;
hash.c:       |            ^~~~
hash.c: In function 'ROUND_LOOP',
hash.c:     inlined from 'PROUNDS' at round.h:325:3,
hash.c:     inlined from 'P' at permutations.h:70:48,
hash.c:     inlined from 'ascon_absorb' at hash.c:54:5,
hash.c:     inlined from 'crypto_hash_asconxofav12_bi32_armv6m_constbranchindex' at hash.c:84:3:
hash.c: round.h:13:3: error: impossible constraint in 'asm'
hash.c:    13 |   __asm__ __volatile__(
hash.c:       |   ^~~~~~~
hash.c: In function 'ROUND_LOOP',
hash.c:     inlined from 'PROUNDS' at round.h:325:3,
hash.c:     inlined from 'P' at permutations.h:70:48,
hash.c:     inlined from 'ascon_squeeze' at hash.c:67:3,
hash.c:     inlined from 'crypto_hash_asconxofav12_bi32_armv6m_constbranchindex' at hash.c:85:3:
hash.c: round.h:13:3: error: impossible constraint in 'asm'
hash.c:    13 |   __asm__ __volatile__(
hash.c:       |   ^~~~~~~
hash.c: In function 'ROUND_LOOP',
hash.c:     inlined from 'PROUNDS' at round.h:325:3,
hash.c:     inlined from 'P' at permutations.h:70:48,
hash.c: ...

Number of similar (implementation,compiler) pairs: 1, namely:
ImplementationCompiler
bi32_armv6mgcc -march=native -mtune=native -O3 -fwrapv -fPIC -fPIE -gdwarf-4 -Wall (16.2.0)

Compiler output


hash.c: /tmp/ccjqh2cR.s: Assembler messages:
hash.c: /tmp/ccjqh2cR.s:683: Error: immediate out of range at operand 3 -- `eor x9,x9,9'
hash.c: /tmp/ccjqh2cR.s:768: Error: immediate out of range at operand 3 -- `eor x9,x9,9'
hash.c: /tmp/ccjqh2cR.s:940: Error: immediate out of range at operand 3 -- `eor x5,x5,9'
hash.c: /tmp/ccjqh2cR.s:1080: Error: immediate out of range at operand 3 -- `eor x5,x5,9'
hash.c: /tmp/ccjqh2cR.s:1790: Error: immediate out of range at operand 3 -- `eor x15,x15,9'
hash.c: /tmp/ccjqh2cR.s:1891: Error: immediate out of range at operand 3 -- `eor x7,x7,9'
hash.c: /tmp/ccjqh2cR.s:1960: Error: immediate out of range at operand 3 -- `eor x15,x15,9'
hash.c: /tmp/ccjqh2cR.s:1976: Error: immediate out of range at operand 3 -- `eor x7,x7,9'
hash.c: /tmp/ccjqh2cR.s:2231: Error: immediate out of range at operand 3 -- `eor x7,x7,9'
hash.c: /tmp/ccjqh2cR.s:2316: Error: immediate out of range at operand 3 -- `eor x7,x7,9'
hash.c: /tmp/ccjqh2cR.s:2470: Error: immediate out of range at operand 3 -- `eor x15,x15,9'
hash.c: /tmp/ccjqh2cR.s:2642: Error: immediate out of range at operand 3 -- `eor x3,x3,9'
hash.c: /tmp/ccjqh2cR.s:3277: Error: immediate out of range at operand 3 -- `eor x7,x7,9'
hash.c: /tmp/ccjqh2cR.s:3362: Error: immediate out of range at operand 3 -- `eor x7,x7,9'
hash.c: /tmp/ccjqh2cR.s:3525: Error: immediate out of range at operand 3 -- `eor x4,x4,9'
hash.c: /tmp/ccjqh2cR.s:3665: Error: immediate out of range at operand 3 -- `eor x4,x4,9'

Number of similar (implementation,compiler) pairs: 1, namely:
ImplementationCompiler
bi32_armv7mgcc -march=native -mtune=native -O3 -fwrapv -fPIC -fPIE -gdwarf-4 -Wall (16.2.0)

Compiler output


permutations.c: /tmp/ccrREpdR.s: Assembler messages:
permutations.c: /tmp/ccrREpdR.s:63: Error: operand mismatch -- `ldrb x14,[x1],#1'
permutations.c: /tmp/ccrREpdR.s:63: Info:    did you mean this?
permutations.c: /tmp/ccrREpdR.s:63: Info:    	ldrb w14, [x1], #1
permutations.c: /tmp/ccrREpdR.s:78: Error: operand mismatch -- `ldrb x14,[x1],#1'
permutations.c: /tmp/ccrREpdR.s:78: Info:    did you mean this?
permutations.c: /tmp/ccrREpdR.s:78: Info:    	ldrb w14, [x1], #1

Number of similar (implementation,compiler) pairs: 1, namely:
ImplementationCompiler
bi32_armv7m_smallgcc -march=native -mtune=native -O3 -fwrapv -fPIC -fPIE -gdwarf-4 -Wall (16.2.0)

Compiler output


try.c: /usr/bin/aarch64-linux-gnu-ld.bfd: /tmp/ccz3uE0f.o: in function `doit':
try.c: .../supercop-data/cfarm425/aarch64/try/c/gcc_-march=native_-mtune=native_-O3_-fwrapv_-fPIC_-fPIE_-gdwarf-4_-Wall/timingleaks/crypto_hash/asconxofav12/esp32/work/try.c:76:(.text+0x...): undefined reference to `crypto_hash_asconxofav12_esp32_timingleaks'
try.c: /usr/bin/aarch64-linux-gnu-ld.bfd: /tmp/ccz3uE0f.o: in function `test':
try.c: .../supercop-data/cfarm425/aarch64/try/c/gcc_-march=native_-mtune=native_-O3_-fwrapv_-fPIC_-fPIE_-gdwarf-4_-Wall/timingleaks/crypto_hash/asconxofav12/esp32/work/try.c:90:(.text+0x...): undefined reference to `crypto_hash_asconxofav12_esp32_timingleaks'
try.c: /usr/bin/aarch64-linux-gnu-ld.bfd: .../supercop-data/cfarm425/aarch64/try/c/gcc_-march=native_-mtune=native_-O3_-fwrapv_-fPIC_-fPIE_-gdwarf-4_-Wall/timingleaks/crypto_hash/asconxofav12/esp32/work/try.c:102:(.text+0x...): undefined reference to `crypto_hash_asconxofav12_esp32_timingleaks'
try.c: /usr/bin/aarch64-linux-gnu-ld.bfd: .../supercop-data/cfarm425/aarch64/try/c/gcc_-march=native_-mtune=native_-O3_-fwrapv_-fPIC_-fPIE_-gdwarf-4_-Wall/timingleaks/crypto_hash/asconxofav12/esp32/work/try.c:112:(.text+0x...): undefined reference to `crypto_hash_asconxofav12_esp32_timingleaks'
try.c: collect2: error: ld returned 1 exit status

Number of similar (implementation,compiler) pairs: 1, namely:
ImplementationCompiler
T:esp32gcc -march=native -mtune=native -O3 -fwrapv -fPIC -fPIE -gdwarf-4 -Wall (16.2.0)

Namespace violations


constants.o constants R
interleave.o B R
permutations.o P12 T
permutations.o P8 T

Number of similar (implementation,compiler) pairs: 1, namely:
ImplementationCompiler
bi32gcc -march=native -mtune=native -O3 -fwrapv -fPIC -fPIE -gdwarf-4 -Wall (16.2.0)

Namespace violations


constants.o constants R
hash.o ascon_absorb T
hash.o ascon_inithash T
hash.o ascon_squeeze T
interleave.o B R

Number of similar (implementation,compiler) pairs: 1, namely:
ImplementationCompiler
bi32_lowreggcc -march=native -mtune=native -O3 -fwrapv -fPIC -fPIE -gdwarf-4 -Wall (16.2.0)

Namespace violations


constants.o constants R
interleave.o B R
interleave.o FROMBI T
interleave.o TOBI T
permutations.o P T

Number of similar (implementation,compiler) pairs: 1, namely:
ImplementationCompiler
bi32_lowsizegcc -march=native -mtune=native -O3 -fwrapv -fPIC -fPIE -gdwarf-4 -Wall (16.2.0)

Namespace violations


constants.o constants R
interleave.o FROMBI T
interleave.o TOBI T
permutations.o P T

Number of similar (implementation,compiler) pairs: 1, namely:
ImplementationCompiler
bi8gcc -march=native -mtune=native -O3 -fwrapv -fPIC -fPIE -gdwarf-4 -Wall (16.2.0)

Namespace violations


permutations.o P T

Number of similar (implementation,compiler) pairs: 2, namely:
ImplementationCompiler
opt32_lowsizegcc -march=native -mtune=native -O3 -fwrapv -fPIC -fPIE -gdwarf-4 -Wall (16.2.0)
opt64_lowsizegcc -march=native -mtune=native -O3 -fwrapv -fPIC -fPIE -gdwarf-4 -Wall (16.2.0)

Namespace violations


hash.o ascon_absorb T
hash.o ascon_inithash T
hash.o ascon_squeeze T
permutations.o P T

Number of similar (implementation,compiler) pairs: 1, namely:
ImplementationCompiler
opt8gcc -march=native -mtune=native -O3 -fwrapv -fPIC -fPIE -gdwarf-4 -Wall (16.2.0)

Namespace violations


permutations.o P T
update.o ascon_update T

Number of similar (implementation,compiler) pairs: 1, namely:
ImplementationCompiler
opt8_lowsizegcc -march=native -mtune=native -O3 -fwrapv -fPIC -fPIE -gdwarf-4 -Wall (16.2.0)

Passed TIMECOP


TIMECOP iterations: 10

Number of similar (implementation,compiler) pairs: 11, namely:
ImplementationCompiler
bi32gcc -march=native -mtune=native -O3 -fwrapv -fPIC -fPIE -gdwarf-4 -Wall (16.2.0)
bi32_lowreggcc -march=native -mtune=native -O3 -fwrapv -fPIC -fPIE -gdwarf-4 -Wall (16.2.0)
bi32_lowsizegcc -march=native -mtune=native -O3 -fwrapv -fPIC -fPIE -gdwarf-4 -Wall (16.2.0)
bi8gcc -march=native -mtune=native -O3 -fwrapv -fPIC -fPIE -gdwarf-4 -Wall (16.2.0)
opt32gcc -march=native -mtune=native -O3 -fwrapv -fPIC -fPIE -gdwarf-4 -Wall (16.2.0)
opt32_lowsizegcc -march=native -mtune=native -O3 -fwrapv -fPIC -fPIE -gdwarf-4 -Wall (16.2.0)
opt64gcc -march=native -mtune=native -O3 -fwrapv -fPIC -fPIE -gdwarf-4 -Wall (16.2.0)
opt64_lowsizegcc -march=native -mtune=native -O3 -fwrapv -fPIC -fPIE -gdwarf-4 -Wall (16.2.0)
opt8gcc -march=native -mtune=native -O3 -fwrapv -fPIC -fPIE -gdwarf-4 -Wall (16.2.0)
opt8_lowsizegcc -march=native -mtune=native -O3 -fwrapv -fPIC -fPIE -gdwarf-4 -Wall (16.2.0)
refgcc -march=native -mtune=native -O3 -fwrapv -fPIC -fPIE -gdwarf-4 -Wall (16.2.0)