Test results for aarch64, cfarm425, crypto_hash/asconhashv12

[Page version: 20261005 22:53:57]

Measurements for aarch64, cfarm425, crypto_hash Test results for aarch64, cfarm425, crypto_hash Test results for crypto_hash/asconhashv12
Computer: cfarm425
Microarchitecture: aarch64; Cortex-A76 (413fd0c1)
Architecture: aarch64
CPU ID: 413fd0c1
SUPERCOP version: 20261004
Operation: crypto_hash
Primitive: asconhashv12
TimeObject sizeTest sizeImplementationCompilerBenchmark dateSUPERCOP version
232044424 0 023948 1200 1416opt64gcc -march=native -mtune=native -O3 -fwrapv -fPIC -fPIE -gdwarf-4 -Wall2026100520261004
266245424 0 024940 1200 1416refgcc -march=native -mtune=native -O3 -fwrapv -fPIC -fPIE -gdwarf-4 -Wall2026100520261004
28306620 0 020132 1200 1416opt64_lowsizegcc -march=native -mtune=native -O3 -fwrapv -fPIC -fPIE -gdwarf-4 -Wall2026100520261004
326276280 0 025804 1200 1416opt32gcc -march=native -mtune=native -O3 -fwrapv -fPIC -fPIE -gdwarf-4 -Wall2026100520261004
36159660 0 020164 1200 1416opt32_lowsizegcc -march=native -mtune=native -O3 -fwrapv -fPIC -fPIE -gdwarf-4 -Wall2026100520261004
812525148 0 024660 1208 1416bi32gcc -march=native -mtune=native -O3 -fwrapv -fPIC -fPIE -gdwarf-4 -Wall2026100520261004
827232516 0 022124 1216 1416bi32_lowreggcc -march=native -mtune=native -O3 -fwrapv -fPIC -fPIE -gdwarf-4 -Wall2026100520261004
844481312 0 020884 1208 1416bi32_lowsizegcc -march=native -mtune=native -O3 -fwrapv -fPIC -fPIE -gdwarf-4 -Wall2026100520261004
1813262288 0 021492 1208 1416bi8gcc -march=native -mtune=native -O3 -fwrapv -fPIC -fPIE -gdwarf-4 -Wall2026100520261004
2893232188 0 021724 1200 1416opt8gcc -march=native -mtune=native -O3 -fwrapv -fPIC -fPIE -gdwarf-4 -Wall2026100520261004
2898181788 0 021300 1200 1416opt8_lowsizegcc -march=native -mtune=native -O3 -fwrapv -fPIC -fPIE -gdwarf-4 -Wall2026100520261004

Compiler output


permutations.c: /tmp/cclftT0N.s: Assembler messages:
permutations.c: /tmp/cclftT0N.s:181: Error: immediate out of range at operand 3 -- `eor x13,x13,225'
permutations.c: /tmp/cclftT0N.s:287: Error: immediate out of range at operand 3 -- `eor x13,x13,210'
permutations.c: /tmp/cclftT0N.s:393: Error: immediate out of range at operand 3 -- `eor x13,x13,195'
permutations.c: /tmp/cclftT0N.s:499: Error: immediate out of range at operand 3 -- `eor x13,x13,180'
permutations.c: /tmp/cclftT0N.s:605: Error: immediate out of range at operand 3 -- `eor x13,x13,165'
permutations.c: /tmp/cclftT0N.s:711: Error: immediate out of range at operand 3 -- `eor x13,x13,150'
permutations.c: /tmp/cclftT0N.s:817: Error: immediate out of range at operand 3 -- `eor x13,x13,135'
permutations.c: /tmp/cclftT0N.s:1029: Error: immediate out of range at operand 3 -- `eor x13,x13,105'
permutations.c: /tmp/cclftT0N.s:1135: Error: immediate out of range at operand 3 -- `eor x13,x13,90'
permutations.c: /tmp/cclftT0N.s:1241: Error: immediate out of range at operand 3 -- `eor x13,x13,75'

Number of similar (implementation,compiler) pairs: 1, namely:
ImplementationCompiler
armv6gcc -march=native -mtune=native -O3 -fwrapv -fPIC -fPIE -gdwarf-4 -Wall (16.2.0)

Compiler output


permutations.c: /tmp/ccubnh7W.s: Assembler messages:
permutations.c: /tmp/ccubnh7W.s:126: Error: expected a register at operand 2 -- `sub x1,#15'

Number of similar (implementation,compiler) pairs: 1, namely:
ImplementationCompiler
armv6_lowsizegcc -march=native -mtune=native -O3 -fwrapv -fPIC -fPIE -gdwarf-4 -Wall (16.2.0)

Compiler output


hash.c: In file included from permutations.h:11,
hash.c:                  from hash.c:4:
hash.c: In function 'ROUND_LOOP',
hash.c:     inlined from 'PROUNDS' at round.h:348:54,
hash.c:     inlined from 'P' at permutations.h:70:48,
hash.c:     inlined from 'ascon_absorb' at hash.c:54:5,
hash.c:     inlined from 'crypto_hash_asconhashv12_armv6m_constbranchindex' at hash.c:84:3:
hash.c: round.h:12:3: error: impossible constraint in 'asm'
hash.c:    12 |   __asm__ __volatile__(
hash.c:       |   ^~~~~~~
hash.c: In function 'ROUND_LOOP',
hash.c:     inlined from 'PROUNDS' at round.h:348:54,
hash.c:     inlined from 'P' at permutations.h:70:48,
hash.c:     inlined from 'ascon_squeeze' at hash.c:67:3,
hash.c:     inlined from 'crypto_hash_asconhashv12_armv6m_constbranchindex' at hash.c:85:3:
hash.c: round.h:12:3: error: impossible constraint in 'asm'
hash.c:    12 |   __asm__ __volatile__(
hash.c:       |   ^~~~~~~
hash.c: In function 'ROUND_LOOP',
hash.c:     inlined from 'PROUNDS' at round.h:348:54,
hash.c:     inlined from 'P' at permutations.h:70:48,
hash.c:     inlined from 'ascon_squeeze' at hash.c:71:5,
hash.c:     inlined from 'crypto_hash_asconhashv12_armv6m_constbranchindex' at hash.c:85:3:
hash.c: round.h:12:3: error: impossible constraint in 'asm'
hash.c:    12 |   __asm__ __volatile__(
hash.c: ...

Number of similar (implementation,compiler) pairs: 1, namely:
ImplementationCompiler
armv6mgcc -march=native -mtune=native -O3 -fwrapv -fPIC -fPIE -gdwarf-4 -Wall (16.2.0)

Compiler output


permutations.c: In file included from permutations.h:11,
permutations.c:                  from permutations.c:1:
permutations.c: In function 'ROUND_LOOP',
permutations.c:     inlined from 'PROUNDS' at round.h:348:54,
permutations.c:     inlined from 'P' at permutations.c:27:36:
permutations.c: round.h:12:3: error: impossible constraint in 'asm'
permutations.c:    12 |   __asm__ __volatile__(
permutations.c:       |   ^~~~~~~

Number of similar (implementation,compiler) pairs: 1, namely:
ImplementationCompiler
armv6m_lowsizegcc -march=native -mtune=native -O3 -fwrapv -fPIC -fPIE -gdwarf-4 -Wall (16.2.0)

Compiler output


permutations.c: /tmp/cc6gUh0j.s: Assembler messages:
permutations.c: /tmp/cc6gUh0j.s:179: Error: immediate out of range at operand 3 -- `eor x13,x13,225'
permutations.c: /tmp/cc6gUh0j.s:283: Error: immediate out of range at operand 3 -- `eor x13,x13,210'
permutations.c: /tmp/cc6gUh0j.s:387: Error: immediate out of range at operand 3 -- `eor x13,x13,195'
permutations.c: /tmp/cc6gUh0j.s:491: Error: immediate out of range at operand 3 -- `eor x13,x13,180'
permutations.c: /tmp/cc6gUh0j.s:595: Error: immediate out of range at operand 3 -- `eor x13,x13,165'
permutations.c: /tmp/cc6gUh0j.s:699: Error: immediate out of range at operand 3 -- `eor x13,x13,150'
permutations.c: /tmp/cc6gUh0j.s:803: Error: immediate out of range at operand 3 -- `eor x13,x13,135'
permutations.c: /tmp/cc6gUh0j.s:1011: Error: immediate out of range at operand 3 -- `eor x13,x13,105'
permutations.c: /tmp/cc6gUh0j.s:1115: Error: immediate out of range at operand 3 -- `eor x13,x13,90'
permutations.c: /tmp/cc6gUh0j.s:1219: Error: immediate out of range at operand 3 -- `eor x13,x13,75'

Number of similar (implementation,compiler) pairs: 1, namely:
ImplementationCompiler
armv7mgcc -march=native -mtune=native -O3 -fwrapv -fPIC -fPIE -gdwarf-4 -Wall (16.2.0)

Compiler output


permutations.c: /tmp/cc70aRqa.s: Assembler messages:
permutations.c: /tmp/cc70aRqa.s:122: Error: expected a register at operand 2 -- `sub x1,#15'

Number of similar (implementation,compiler) pairs: 1, namely:
ImplementationCompiler
armv7m_lowsizegcc -march=native -mtune=native -O3 -fwrapv -fPIC -fPIE -gdwarf-4 -Wall (16.2.0)

Compiler output


permutations.c: /tmp/ccTAoo2b.s: Assembler messages:
permutations.c: /tmp/ccTAoo2b.s:122: Error: expected a register at operand 2 -- `sub x1,#15'

Number of similar (implementation,compiler) pairs: 1, namely:
ImplementationCompiler
armv7m_smallgcc -march=native -mtune=native -O3 -fwrapv -fPIC -fPIE -gdwarf-4 -Wall (16.2.0)

Compiler output


ascon.S: ascon.S:1:10: fatal error: xtensa/coreasm.h: No such file or directory
ascon.S:     1 | #include <xtensa/coreasm.h>
ascon.S:       |          ^~~~~~~~~~~~~~~~~~
ascon.S: compilation terminated.

Number of similar (implementation,compiler) pairs: 1, namely:
ImplementationCompiler
T:asm_esp32gcc -march=native -mtune=native -O3 -fwrapv -fPIC -fPIE -gdwarf-4 -Wall (16.2.0)

Compiler output


permutations.c: /tmp/ccMBf3s4.s: Assembler messages:
permutations.c: /tmp/ccMBf3s4.s:162: Error: immediate out of range at operand 3 -- `eor x13,x13,9'
permutations.c: /tmp/ccMBf3s4.s:266: Error: immediate out of range at operand 3 -- `eor x8,x8,9'
permutations.c: /tmp/ccMBf3s4.s:336: Error: immediate out of range at operand 3 -- `eor x13,x13,9'
permutations.c: /tmp/ccMBf3s4.s:353: Error: immediate out of range at operand 3 -- `eor x8,x8,9'
permutations.c: /tmp/ccMBf3s4.s:614: Error: immediate out of range at operand 3 -- `eor x8,x8,9'
permutations.c: /tmp/ccMBf3s4.s:701: Error: immediate out of range at operand 3 -- `eor x8,x8,9'
permutations.c: /tmp/ccMBf3s4.s:858: Error: immediate out of range at operand 3 -- `eor x13,x13,9'
permutations.c: /tmp/ccMBf3s4.s:1032: Error: immediate out of range at operand 3 -- `eor x13,x13,9'

Number of similar (implementation,compiler) pairs: 1, namely:
ImplementationCompiler
bi32_armv6gcc -march=native -mtune=native -O3 -fwrapv -fPIC -fPIE -gdwarf-4 -Wall (16.2.0)

Compiler output


hash.c: In file included from permutations.h:11,
hash.c:                  from hash.c:4:
hash.c: round.h: In function 'ROUND_LOOP':
hash.c: round.h:12:12: warning: unused variable 'tmp0' [-Wunused-variable]
hash.c:    12 |   uint32_t tmp0, tmp1;
hash.c:       |            ^~~~
hash.c: In function 'ROUND_LOOP',
hash.c:     inlined from 'PROUNDS' at round.h:325:3,
hash.c:     inlined from 'P' at permutations.h:70:48,
hash.c:     inlined from 'ascon_absorb' at hash.c:54:5,
hash.c:     inlined from 'crypto_hash_asconhashv12_bi32_armv6m_constbranchindex' at hash.c:84:3:
hash.c: round.h:13:3: error: impossible constraint in 'asm'
hash.c:    13 |   __asm__ __volatile__(
hash.c:       |   ^~~~~~~
hash.c: In function 'ROUND_LOOP',
hash.c:     inlined from 'PROUNDS' at round.h:325:3,
hash.c:     inlined from 'P' at permutations.h:70:48,
hash.c:     inlined from 'ascon_squeeze' at hash.c:67:3,
hash.c:     inlined from 'crypto_hash_asconhashv12_bi32_armv6m_constbranchindex' at hash.c:85:3:
hash.c: round.h:13:3: error: impossible constraint in 'asm'
hash.c:    13 |   __asm__ __volatile__(
hash.c:       |   ^~~~~~~
hash.c: In function 'ROUND_LOOP',
hash.c:     inlined from 'PROUNDS' at round.h:325:3,
hash.c:     inlined from 'P' at permutations.h:70:48,
hash.c: ...

Number of similar (implementation,compiler) pairs: 1, namely:
ImplementationCompiler
bi32_armv6mgcc -march=native -mtune=native -O3 -fwrapv -fPIC -fPIE -gdwarf-4 -Wall (16.2.0)

Compiler output


hash.c: /tmp/ccLW7WUW.s: Assembler messages:
hash.c: /tmp/ccLW7WUW.s:573: Error: immediate out of range at operand 3 -- `eor x21,x21,9'
hash.c: /tmp/ccLW7WUW.s:674: Error: immediate out of range at operand 3 -- `eor x9,x9,9'
hash.c: /tmp/ccLW7WUW.s:743: Error: immediate out of range at operand 3 -- `eor x21,x21,9'
hash.c: /tmp/ccLW7WUW.s:759: Error: immediate out of range at operand 3 -- `eor x9,x9,9'
hash.c: /tmp/ccLW7WUW.s:1014: Error: immediate out of range at operand 3 -- `eor x9,x9,9'
hash.c: /tmp/ccLW7WUW.s:1099: Error: immediate out of range at operand 3 -- `eor x9,x9,9'
hash.c: /tmp/ccLW7WUW.s:1253: Error: immediate out of range at operand 3 -- `eor x30,x30,9'
hash.c: /tmp/ccLW7WUW.s:1426: Error: immediate out of range at operand 3 -- `eor x6,x6,9'
hash.c: /tmp/ccLW7WUW.s:2137: Error: immediate out of range at operand 3 -- `eor x15,x15,9'
hash.c: /tmp/ccLW7WUW.s:2238: Error: immediate out of range at operand 3 -- `eor x7,x7,9'
hash.c: /tmp/ccLW7WUW.s:2307: Error: immediate out of range at operand 3 -- `eor x15,x15,9'
hash.c: /tmp/ccLW7WUW.s:2323: Error: immediate out of range at operand 3 -- `eor x7,x7,9'
hash.c: /tmp/ccLW7WUW.s:2578: Error: immediate out of range at operand 3 -- `eor x7,x7,9'
hash.c: /tmp/ccLW7WUW.s:2663: Error: immediate out of range at operand 3 -- `eor x7,x7,9'
hash.c: /tmp/ccLW7WUW.s:2817: Error: immediate out of range at operand 3 -- `eor x15,x15,9'
hash.c: /tmp/ccLW7WUW.s:2989: Error: immediate out of range at operand 3 -- `eor x3,x3,9'
hash.c: /tmp/ccLW7WUW.s:3522: Error: immediate out of range at operand 3 -- `eor x17,x17,9'
hash.c: /tmp/ccLW7WUW.s:3623: Error: immediate out of range at operand 3 -- `eor x7,x7,9'
hash.c: /tmp/ccLW7WUW.s:3692: Error: immediate out of range at operand 3 -- `eor x17,x17,9'
hash.c: /tmp/ccLW7WUW.s:3708: Error: immediate out of range at operand 3 -- `eor x7,x7,9'
hash.c: /tmp/ccLW7WUW.s:3963: Error: immediate out of range at operand 3 -- `eor x7,x7,9'
hash.c: /tmp/ccLW7WUW.s:4048: Error: immediate out of range at operand 3 -- `eor x7,x7,9'
hash.c: /tmp/ccLW7WUW.s:4202: Error: immediate out of range at operand 3 -- `eor x17,x17,9'
hash.c: /tmp/ccLW7WUW.s:4366: Error: immediate out of range at operand 3 -- `eor x4,x4,9'

Number of similar (implementation,compiler) pairs: 1, namely:
ImplementationCompiler
bi32_armv7mgcc -march=native -mtune=native -O3 -fwrapv -fPIC -fPIE -gdwarf-4 -Wall (16.2.0)

Compiler output


permutations.c: /tmp/cceQFEDb.s: Assembler messages:
permutations.c: /tmp/cceQFEDb.s:63: Error: operand mismatch -- `ldrb x14,[x1],#1'
permutations.c: /tmp/cceQFEDb.s:63: Info:    did you mean this?
permutations.c: /tmp/cceQFEDb.s:63: Info:    	ldrb w14, [x1], #1
permutations.c: /tmp/cceQFEDb.s:78: Error: operand mismatch -- `ldrb x14,[x1],#1'
permutations.c: /tmp/cceQFEDb.s:78: Info:    did you mean this?
permutations.c: /tmp/cceQFEDb.s:78: Info:    	ldrb w14, [x1], #1

Number of similar (implementation,compiler) pairs: 1, namely:
ImplementationCompiler
bi32_armv7m_smallgcc -march=native -mtune=native -O3 -fwrapv -fPIC -fPIE -gdwarf-4 -Wall (16.2.0)

Compiler output


try.c: /usr/bin/aarch64-linux-gnu-ld.bfd: /tmp/ccHXloOc.o: in function `doit':
try.c: .../supercop-data/cfarm425/aarch64/try/c/gcc_-march=native_-mtune=native_-O3_-fwrapv_-fPIC_-fPIE_-gdwarf-4_-Wall/timingleaks/crypto_hash/asconhashv12/esp32/work/try.c:76:(.text+0x...): undefined reference to `crypto_hash_asconhashv12_esp32_timingleaks'
try.c: /usr/bin/aarch64-linux-gnu-ld.bfd: /tmp/ccHXloOc.o: in function `test':
try.c: .../supercop-data/cfarm425/aarch64/try/c/gcc_-march=native_-mtune=native_-O3_-fwrapv_-fPIC_-fPIE_-gdwarf-4_-Wall/timingleaks/crypto_hash/asconhashv12/esp32/work/try.c:90:(.text+0x...): undefined reference to `crypto_hash_asconhashv12_esp32_timingleaks'
try.c: /usr/bin/aarch64-linux-gnu-ld.bfd: .../supercop-data/cfarm425/aarch64/try/c/gcc_-march=native_-mtune=native_-O3_-fwrapv_-fPIC_-fPIE_-gdwarf-4_-Wall/timingleaks/crypto_hash/asconhashv12/esp32/work/try.c:102:(.text+0x...): undefined reference to `crypto_hash_asconhashv12_esp32_timingleaks'
try.c: /usr/bin/aarch64-linux-gnu-ld.bfd: .../supercop-data/cfarm425/aarch64/try/c/gcc_-march=native_-mtune=native_-O3_-fwrapv_-fPIC_-fPIE_-gdwarf-4_-Wall/timingleaks/crypto_hash/asconhashv12/esp32/work/try.c:112:(.text+0x...): undefined reference to `crypto_hash_asconhashv12_esp32_timingleaks'
try.c: collect2: error: ld returned 1 exit status

Number of similar (implementation,compiler) pairs: 1, namely:
ImplementationCompiler
T:esp32gcc -march=native -mtune=native -O3 -fwrapv -fPIC -fPIE -gdwarf-4 -Wall (16.2.0)

Namespace violations


constants.o constants R
interleave.o B R
permutations.o P12 T

Number of similar (implementation,compiler) pairs: 1, namely:
ImplementationCompiler
bi32gcc -march=native -mtune=native -O3 -fwrapv -fPIC -fPIE -gdwarf-4 -Wall (16.2.0)

Namespace violations


constants.o constants R
hash.o ascon_absorb T
hash.o ascon_inithash T
hash.o ascon_squeeze T
interleave.o B R

Number of similar (implementation,compiler) pairs: 1, namely:
ImplementationCompiler
bi32_lowreggcc -march=native -mtune=native -O3 -fwrapv -fPIC -fPIE -gdwarf-4 -Wall (16.2.0)

Namespace violations


constants.o constants R
interleave.o B R
interleave.o FROMBI T
interleave.o TOBI T
permutations.o P T

Number of similar (implementation,compiler) pairs: 1, namely:
ImplementationCompiler
bi32_lowsizegcc -march=native -mtune=native -O3 -fwrapv -fPIC -fPIE -gdwarf-4 -Wall (16.2.0)

Namespace violations


constants.o constants R
interleave.o FROMBI T
interleave.o TOBI T
permutations.o P T

Number of similar (implementation,compiler) pairs: 1, namely:
ImplementationCompiler
bi8gcc -march=native -mtune=native -O3 -fwrapv -fPIC -fPIE -gdwarf-4 -Wall (16.2.0)

Namespace violations


permutations.o P T

Number of similar (implementation,compiler) pairs: 2, namely:
ImplementationCompiler
opt32_lowsizegcc -march=native -mtune=native -O3 -fwrapv -fPIC -fPIE -gdwarf-4 -Wall (16.2.0)
opt64_lowsizegcc -march=native -mtune=native -O3 -fwrapv -fPIC -fPIE -gdwarf-4 -Wall (16.2.0)

Namespace violations


hash.o ascon_absorb T
hash.o ascon_inithash T
hash.o ascon_squeeze T
permutations.o P T

Number of similar (implementation,compiler) pairs: 1, namely:
ImplementationCompiler
opt8gcc -march=native -mtune=native -O3 -fwrapv -fPIC -fPIE -gdwarf-4 -Wall (16.2.0)

Namespace violations


permutations.o P T
update.o ascon_update T

Number of similar (implementation,compiler) pairs: 1, namely:
ImplementationCompiler
opt8_lowsizegcc -march=native -mtune=native -O3 -fwrapv -fPIC -fPIE -gdwarf-4 -Wall (16.2.0)

Passed TIMECOP


TIMECOP iterations: 10

Number of similar (implementation,compiler) pairs: 11, namely:
ImplementationCompiler
bi32gcc -march=native -mtune=native -O3 -fwrapv -fPIC -fPIE -gdwarf-4 -Wall (16.2.0)
bi32_lowreggcc -march=native -mtune=native -O3 -fwrapv -fPIC -fPIE -gdwarf-4 -Wall (16.2.0)
bi32_lowsizegcc -march=native -mtune=native -O3 -fwrapv -fPIC -fPIE -gdwarf-4 -Wall (16.2.0)
bi8gcc -march=native -mtune=native -O3 -fwrapv -fPIC -fPIE -gdwarf-4 -Wall (16.2.0)
opt32gcc -march=native -mtune=native -O3 -fwrapv -fPIC -fPIE -gdwarf-4 -Wall (16.2.0)
opt32_lowsizegcc -march=native -mtune=native -O3 -fwrapv -fPIC -fPIE -gdwarf-4 -Wall (16.2.0)
opt64gcc -march=native -mtune=native -O3 -fwrapv -fPIC -fPIE -gdwarf-4 -Wall (16.2.0)
opt64_lowsizegcc -march=native -mtune=native -O3 -fwrapv -fPIC -fPIE -gdwarf-4 -Wall (16.2.0)
opt8gcc -march=native -mtune=native -O3 -fwrapv -fPIC -fPIE -gdwarf-4 -Wall (16.2.0)
opt8_lowsizegcc -march=native -mtune=native -O3 -fwrapv -fPIC -fPIE -gdwarf-4 -Wall (16.2.0)
refgcc -march=native -mtune=native -O3 -fwrapv -fPIC -fPIE -gdwarf-4 -Wall (16.2.0)