Implementation notes: armeabi, berry2, crypto_kem/frodokem640aes

Computer: berry2
Architecture: armeabi
CPU ID: unknown CPU ID
SUPERCOP version: 20201018
Operation: crypto_kem
Primitive: frodokem640aes
TimeObject sizeTest sizeImplementationCompilerBenchmark dateSUPERCOP version
8740888421764 28 046500 444 1536T:optimizedclang_-mcpu=native_-O3_-fomit-frame-pointer_-fwrapv_-Qunused-arguments_-fPIC_-fPIE2020090520200826
10347283531364 30 046878 448 1528T:optimizedgcc_-march=native_-mtune=native_-O3_-fomit-frame-pointer_-fwrapv_-fPIC_-fPIE2020090520200826
10987749014364 30 028062 448 1528T:optimizedgcc_-march=native_-mtune=native_-O2_-fomit-frame-pointer_-fwrapv_-fPIC_-fPIE2020090520200826
12914092211640 30 025410 448 1528T:optimizedgcc_-march=native_-mtune=native_-O_-fomit-frame-pointer_-fwrapv_-fPIC_-fPIE2020090520200826
14018941811100 28 024258 432 1528T:optimizedgcc_-march=native_-mtune=native_-Os_-fomit-frame-pointer_-fwrapv_-fPIC_-fPIE2020090520200826

Compiler output

Implementation: T:x64
Security model: timingleaks
Compiler: clang -mcpu=native -O3 -fomit-frame-pointer -fwrapv -Qunused-arguments -fPIC -fPIE
aes_ni.c: In file included from aes_ni.c:6:
aes_ni.c: In file included from /usr/lib/llvm-7/lib/clang/7.0.1/include/wmmintrin.h:27:
aes_ni.c: In file included from /usr/lib/llvm-7/lib/clang/7.0.1/include/emmintrin.h:27:
aes_ni.c: In file included from /usr/lib/llvm-7/lib/clang/7.0.1/include/xmmintrin.h:27:
aes_ni.c: /usr/lib/llvm-7/lib/clang/7.0.1/include/mmintrin.h:64:12: error: invalid conversion between vector type '__m64' (vector of 1 'long long' value) and integer type 'int' of different size
aes_ni.c: return (__m64)__builtin_ia32_vec_init_v2si(__i, 0);
aes_ni.c: ^~~~~~~~~~~~~~~~~~~~~~~~~~~~~~~~~~~~~~~~~~~
aes_ni.c: /usr/lib/llvm-7/lib/clang/7.0.1/include/mmintrin.h:143:12: error: invalid conversion between vector type '__m64' (vector of 1 'long long' value) and integer type 'int' of different size
aes_ni.c: return (__m64)__builtin_ia32_packsswb((__v4hi)__m1, (__v4hi)__m2);
aes_ni.c: ^~~~~~~~~~~~~~~~~~~~~~~~~~~~~~~~~~~~~~~~~~~~~~~~~~~~~~~~~~
aes_ni.c: /usr/lib/llvm-7/lib/clang/7.0.1/include/mmintrin.h:173:12: error: invalid conversion between vector type '__m64' (vector of 1 'long long' value) and integer type 'int' of different size
aes_ni.c: return (__m64)__builtin_ia32_packssdw((__v2si)__m1, (__v2si)__m2);
aes_ni.c: ^~~~~~~~~~~~~~~~~~~~~~~~~~~~~~~~~~~~~~~~~~~~~~~~~~~~~~~~~~
aes_ni.c: /usr/lib/llvm-7/lib/clang/7.0.1/include/mmintrin.h:203:12: error: invalid conversion between vector type '__m64' (vector of 1 'long long' value) and integer type 'int' of different size
aes_ni.c: return (__m64)__builtin_ia32_packuswb((__v4hi)__m1, (__v4hi)__m2);
aes_ni.c: ^~~~~~~~~~~~~~~~~~~~~~~~~~~~~~~~~~~~~~~~~~~~~~~~~~~~~~~~~~
aes_ni.c: /usr/lib/llvm-7/lib/clang/7.0.1/include/mmintrin.h:230:12: error: invalid conversion between vector type '__m64' (vector of 1 'long long' value) and integer type 'int' of different size
aes_ni.c: return (__m64)__builtin_ia32_punpckhbw((__v8qi)__m1, (__v8qi)__m2);
aes_ni.c: ^~~~~~~~~~~~~~~~~~~~~~~~~~~~~~~~~~~~~~~~~~~~~~~~~~~~~~~~~~~
aes_ni.c: /usr/lib/llvm-7/lib/clang/7.0.1/include/mmintrin.h:253:12: error: invalid conversion between vector type '__m64' (vector of 1 'long long' value) and integer type 'int' of different size
aes_ni.c: return (__m64)__builtin_ia32_punpckhwd((__v4hi)__m1, (__v4hi)__m2);
aes_ni.c: ^~~~~~~~~~~~~~~~~~~~~~~~~~~~~~~~~~~~~~~~~~~~~~~~~~~~~~~~~~~
aes_ni.c: /usr/lib/llvm-7/lib/clang/7.0.1/include/mmintrin.h:274:12: error: invalid conversion between vector type '__m64' (vector of 1 'long long' value) and integer type 'int' of different size
aes_ni.c: return (__m64)__builtin_ia32_punpckhdq((__v2si)__m1, (__v2si)__m2);
aes_ni.c: ^~~~~~~~~~~~~~~~~~~~~~~~~~~~~~~~~~~~~~~~~~~~~~~~~~~~~~~~~~~
aes_ni.c: ...

Number of similar (compiler,implementation) pairs: 1, namely:
CompilerImplementations
clang -mcpu=native -O3 -fomit-frame-pointer -fwrapv -Qunused-arguments -fPIC -fPIE T:x64

Compiler output

Implementation: T:x64
Security model: timingleaks
Compiler: gcc -march=native -mtune=native -O2 -fomit-frame-pointer -fwrapv -fPIC -fPIE
aes_ni.c: aes_ni.c:6:10: fatal error: wmmintrin.h: No such file or directory
aes_ni.c: #include <wmmintrin.h>
aes_ni.c: ^~~~~~~~~~~~~
aes_ni.c: compilation terminated.

Number of similar (compiler,implementation) pairs: 4, namely:
CompilerImplementations
gcc -march=native -mtune=native -O2 -fomit-frame-pointer -fwrapv -fPIC -fPIE T:x64
gcc -march=native -mtune=native -O3 -fomit-frame-pointer -fwrapv -fPIC -fPIE T:x64
gcc -march=native -mtune=native -O -fomit-frame-pointer -fwrapv -fPIC -fPIE T:x64
gcc -march=native -mtune=native -Os -fomit-frame-pointer -fwrapv -fPIC -fPIE T:x64

Namespace violations

Implementation: T:optimized
Security model: timingleaks
Compiler: clang -mcpu=native -O3 -fomit-frame-pointer -fwrapv -Qunused-arguments -fPIC -fPIE
aes.o AES128_free_schedule T
aes.o AES256_free_schedule T
aes.o handleErrors T
fips202.o KeccakF1600_StatePermute T
fips202.o shake128 T
fips202.o shake128_absorb T
fips202.o shake128_squeezeblocks T
fips202.o shake256 T
fips202.o shake256_absorb T
fips202.o shake256_squeezeblocks T
frodo640.o CDF_TABLE D
frodo640.o CDF_TABLE_LEN D
frodo640.o frodo_add T
frodo640.o frodo_key_decode T
frodo640.o frodo_key_encode T
frodo640.o frodo_mul_add_as_plus_e T
frodo640.o frodo_mul_add_sa_plus_e T
frodo640.o frodo_mul_add_sb_plus_e T
frodo640.o frodo_mul_bs T
frodo640.o frodo_sample_n T
frodo640.o frodo_sub T
util.o clear_bytes T
util.o frodo_pack T
util.o frodo_unpack T

Number of similar (compiler,implementation) pairs: 5, namely:
CompilerImplementations
clang -mcpu=native -O3 -fomit-frame-pointer -fwrapv -Qunused-arguments -fPIC -fPIE T:optimized
gcc -march=native -mtune=native -O2 -fomit-frame-pointer -fwrapv -fPIC -fPIE T:optimized
gcc -march=native -mtune=native -O3 -fomit-frame-pointer -fwrapv -fPIC -fPIE T:optimized
gcc -march=native -mtune=native -O -fomit-frame-pointer -fwrapv -fPIC -fPIE T:optimized
gcc -march=native -mtune=native -Os -fomit-frame-pointer -fwrapv -fPIC -fPIE T:optimized