Implementation notes: armeabi, berry2, crypto_aead/aes128cpfbv1

Computer: berry2
Microarchitecture: armeabi; Cortex-A7 (410fc075)
Architecture: armeabi
CPU ID: unknown CPU ID
SUPERCOP version: 20240425
Operation: crypto_aead
Primitive: aes128cpfbv1
TimeObject sizeTest sizeImplementationCompilerBenchmark dateSUPERCOP version
40850619424 0 038160 408 816T:gladmangcc_-march=native_-mtune=native_-O3_-fomit-frame-pointer_-fwrapv_-fPIC_-fPIE2024050220240425
40926918596 0 035463 404 816T:gladmangcc_-march=native_-mtune=native_-O2_-fomit-frame-pointer_-fwrapv_-fPIC_-fPIE2024050220240425
45045816500 0 032603 396 816T:gladmangcc_-march=native_-mtune=native_-Os_-fomit-frame-pointer_-fwrapv_-fPIC_-fPIE2024050220240425
5302813740 0 022698 404 816T:refgcc_-march=native_-mtune=native_-O3_-fomit-frame-pointer_-fwrapv_-fPIC_-fPIE2024050220240425
53511518964 0 049202 396 832T:gladmanclang_-mcpu=native_-O3_-fomit-frame-pointer_-fwrapv_-Qunused-arguments_-fPIC_-fPIE2024050220240425
55108419948 0 038680 396 816T:aesrefgcc_-march=native_-mtune=native_-O3_-fomit-frame-pointer_-fwrapv_-fPIC_-fPIE2024050220240425
57661817144 0 034007 392 816T:aesrefgcc_-march=native_-mtune=native_-O2_-fomit-frame-pointer_-fwrapv_-fPIC_-fPIE2024050220240425
5927963212 0 033712 392 832T:refclang_-mcpu=native_-O3_-fomit-frame-pointer_-fwrapv_-Qunused-arguments_-fPIC_-fPIE2024050220240425
59379717632 0 035247 404 816T:gladmangcc_-march=native_-mtune=native_-O_-fomit-frame-pointer_-fwrapv_-fPIC_-fPIE2024050220240425
63747618108 0 048346 384 832T:aesrefclang_-mcpu=native_-O3_-fomit-frame-pointer_-fwrapv_-Qunused-arguments_-fPIC_-fPIE2024050220240425
6520182332 0 019421 400 816T:refgcc_-march=native_-mtune=native_-O2_-fomit-frame-pointer_-fwrapv_-fPIC_-fPIE2024050220240425
6718331856 0 018234 392 816T:refgcc_-march=native_-mtune=native_-Os_-fomit-frame-pointer_-fwrapv_-fPIC_-fPIE2024050220240425
6798492168 0 020005 400 816T:refgcc_-march=native_-mtune=native_-O_-fomit-frame-pointer_-fwrapv_-fPIC_-fPIE2024050220240425
73766316608 0 032707 384 816T:aesrefgcc_-march=native_-mtune=native_-Os_-fomit-frame-pointer_-fwrapv_-fPIC_-fPIE2024050220240425
76272916964 0 034575 392 816T:aesrefgcc_-march=native_-mtune=native_-O_-fomit-frame-pointer_-fwrapv_-fPIC_-fPIE2024050220240425

Compiler output

Implementation: T:aesni
Security model: timingleaks
Compiler: clang -mcpu=native -O3 -fomit-frame-pointer -fwrapv -Qunused-arguments -fPIC -fPIE
cpfbkey.c: In file included from cpfbkey.c:15:
cpfbkey.c: In file included from /usr/lib/llvm-7/lib/clang/7.0.1/include/wmmintrin.h:27:
cpfbkey.c: In file included from /usr/lib/llvm-7/lib/clang/7.0.1/include/emmintrin.h:27:
cpfbkey.c: In file included from /usr/lib/llvm-7/lib/clang/7.0.1/include/xmmintrin.h:27:
cpfbkey.c: /usr/lib/llvm-7/lib/clang/7.0.1/include/mmintrin.h:64:12: error: invalid conversion between vector type '__m64' (vector of 1 'long long' value) and integer type 'int' of different size
cpfbkey.c: return (__m64)__builtin_ia32_vec_init_v2si(__i, 0);
cpfbkey.c: ^~~~~~~~~~~~~~~~~~~~~~~~~~~~~~~~~~~~~~~~~~~
cpfbkey.c: /usr/lib/llvm-7/lib/clang/7.0.1/include/mmintrin.h:143:12: error: invalid conversion between vector type '__m64' (vector of 1 'long long' value) and integer type 'int' of different size
cpfbkey.c: return (__m64)__builtin_ia32_packsswb((__v4hi)__m1, (__v4hi)__m2);
cpfbkey.c: ^~~~~~~~~~~~~~~~~~~~~~~~~~~~~~~~~~~~~~~~~~~~~~~~~~~~~~~~~~
cpfbkey.c: /usr/lib/llvm-7/lib/clang/7.0.1/include/mmintrin.h:173:12: error: invalid conversion between vector type '__m64' (vector of 1 'long long' value) and integer type 'int' of different size
cpfbkey.c: return (__m64)__builtin_ia32_packssdw((__v2si)__m1, (__v2si)__m2);
cpfbkey.c: ^~~~~~~~~~~~~~~~~~~~~~~~~~~~~~~~~~~~~~~~~~~~~~~~~~~~~~~~~~
cpfbkey.c: /usr/lib/llvm-7/lib/clang/7.0.1/include/mmintrin.h:203:12: error: invalid conversion between vector type '__m64' (vector of 1 'long long' value) and integer type 'int' of different size
cpfbkey.c: return (__m64)__builtin_ia32_packuswb((__v4hi)__m1, (__v4hi)__m2);
cpfbkey.c: ^~~~~~~~~~~~~~~~~~~~~~~~~~~~~~~~~~~~~~~~~~~~~~~~~~~~~~~~~~
cpfbkey.c: /usr/lib/llvm-7/lib/clang/7.0.1/include/mmintrin.h:230:12: error: invalid conversion between vector type '__m64' (vector of 1 'long long' value) and integer type 'int' of different size
cpfbkey.c: return (__m64)__builtin_ia32_punpckhbw((__v8qi)__m1, (__v8qi)__m2);
cpfbkey.c: ^~~~~~~~~~~~~~~~~~~~~~~~~~~~~~~~~~~~~~~~~~~~~~~~~~~~~~~~~~~
cpfbkey.c: /usr/lib/llvm-7/lib/clang/7.0.1/include/mmintrin.h:253:12: error: invalid conversion between vector type '__m64' (vector of 1 'long long' value) and integer type 'int' of different size
cpfbkey.c: return (__m64)__builtin_ia32_punpckhwd((__v4hi)__m1, (__v4hi)__m2);
cpfbkey.c: ^~~~~~~~~~~~~~~~~~~~~~~~~~~~~~~~~~~~~~~~~~~~~~~~~~~~~~~~~~~
cpfbkey.c: /usr/lib/llvm-7/lib/clang/7.0.1/include/mmintrin.h:274:12: error: invalid conversion between vector type '__m64' (vector of 1 'long long' value) and integer type 'int' of different size
cpfbkey.c: return (__m64)__builtin_ia32_punpckhdq((__v2si)__m1, (__v2si)__m2);
cpfbkey.c: ^~~~~~~~~~~~~~~~~~~~~~~~~~~~~~~~~~~~~~~~~~~~~~~~~~~~~~~~~~~
cpfbkey.c: ...

Number of similar (compiler,implementation) pairs: 1, namely:
CompilerImplementations
clang -mcpu=native -O3 -fomit-frame-pointer -fwrapv -Qunused-arguments -fPIC -fPIE T:aesni

Compiler output

Implementation: T:aesni
Security model: timingleaks
Compiler: gcc -march=native -mtune=native -O2 -fomit-frame-pointer -fwrapv -fPIC -fPIE
cpfbkey.c: cpfbkey.c:15:10: fatal error: wmmintrin.h: No such file or directory
cpfbkey.c: #include <wmmintrin.h>
cpfbkey.c: ^~~~~~~~~~~~~
cpfbkey.c: compilation terminated.

Number of similar (compiler,implementation) pairs: 4, namely:
CompilerImplementations
gcc -march=native -mtune=native -O2 -fomit-frame-pointer -fwrapv -fPIC -fPIE T:aesni
gcc -march=native -mtune=native -O3 -fomit-frame-pointer -fwrapv -fPIC -fPIE T:aesni
gcc -march=native -mtune=native -O -fomit-frame-pointer -fwrapv -fPIC -fPIE T:aesni
gcc -march=native -mtune=native -Os -fomit-frame-pointer -fwrapv -fPIC -fPIE T:aesni

Compiler output

Implementation: T:evp
Security model: timingleaks
Compiler: clang -mcpu=native -O3 -fomit-frame-pointer -fwrapv -Qunused-arguments -fPIC -fPIE
encrypt.c: encrypt.c:170:89: error: array has incomplete element type 'EVP_CIPHER_CTX' (aka 'struct evp_cipher_ctx_st')
encrypt.c: static void gen_kappa(unsigned char* nonce, unsigned char* kappa, EVP_CIPHER_CTX ctx_key[1]){
encrypt.c: ^
encrypt.c: /usr/include/openssl/ossl_typ.h:90:16: note: forward declaration of 'struct evp_cipher_ctx_st'
encrypt.c: typedef struct evp_cipher_ctx_st EVP_CIPHER_CTX;
encrypt.c: ^
encrypt.c: encrypt.c:188:25: error: array has incomplete element type 'EVP_CIPHER_CTX' (aka 'struct evp_cipher_ctx_st')
encrypt.c: EVP_CIPHER_CTX ctx_k[1];
encrypt.c: ^
encrypt.c: /usr/include/openssl/ossl_typ.h:90:16: note: forward declaration of 'struct evp_cipher_ctx_st'
encrypt.c: typedef struct evp_cipher_ctx_st EVP_CIPHER_CTX;
encrypt.c: ^
encrypt.c: encrypt.c:189:31: error: array has incomplete element type 'EVP_CIPHER_CTX' (aka 'struct evp_cipher_ctx_st')
encrypt.c: EVP_CIPHER_CTX ctx_kappa_0[1];
encrypt.c: ^
encrypt.c: /usr/include/openssl/ossl_typ.h:90:16: note: forward declaration of 'struct evp_cipher_ctx_st'
encrypt.c: typedef struct evp_cipher_ctx_st EVP_CIPHER_CTX;
encrypt.c: ^
encrypt.c: encrypt.c:190:31: error: array has incomplete element type 'EVP_CIPHER_CTX' (aka 'struct evp_cipher_ctx_st')
encrypt.c: EVP_CIPHER_CTX ctx_kappa_m[1];
encrypt.c: ^
encrypt.c: /usr/include/openssl/ossl_typ.h:90:16: note: forward declaration of 'struct evp_cipher_ctx_st'
encrypt.c: typedef struct evp_cipher_ctx_st EVP_CIPHER_CTX;
encrypt.c: ^
encrypt.c: encrypt.c:330:25: error: array has incomplete element type 'EVP_CIPHER_CTX' (aka 'struct evp_cipher_ctx_st')
encrypt.c: ...

Number of similar (compiler,implementation) pairs: 1, namely:
CompilerImplementations
clang -mcpu=native -O3 -fomit-frame-pointer -fwrapv -Qunused-arguments -fPIC -fPIE T:evp

Compiler output

Implementation: T:evp
Security model: timingleaks
Compiler: gcc -march=native -mtune=native -O2 -fomit-frame-pointer -fwrapv -fPIC -fPIE
encrypt.c: encrypt.c:170:82: error: array type has incomplete element type 'EVP_CIPHER_CTX' {aka 'struct evp_cipher_ctx_st'}
encrypt.c: static void gen_kappa(unsigned char* nonce, unsigned char* kappa, EVP_CIPHER_CTX ctx_key[1]){
encrypt.c: ^~~~~~~
encrypt.c: encrypt.c: In function 'crypto_aead_aes128cpfbv1_evp_timingleaks_encrypt':
encrypt.c: encrypt.c:188:20: error: array type has incomplete element type 'EVP_CIPHER_CTX' {aka 'struct evp_cipher_ctx_st'}
encrypt.c: EVP_CIPHER_CTX ctx_k[1];
encrypt.c: ^~~~~
encrypt.c: encrypt.c:189:20: error: array type has incomplete element type 'EVP_CIPHER_CTX' {aka 'struct evp_cipher_ctx_st'}
encrypt.c: EVP_CIPHER_CTX ctx_kappa_0[1];
encrypt.c: ^~~~~~~~~~~
encrypt.c: encrypt.c:190:20: error: array type has incomplete element type 'EVP_CIPHER_CTX' {aka 'struct evp_cipher_ctx_st'}
encrypt.c: EVP_CIPHER_CTX ctx_kappa_m[1];
encrypt.c: ^~~~~~~~~~~
encrypt.c: encrypt.c:204:31: error: type of formal parameter 3 is incomplete
encrypt.c: gen_kappa(nonce, kappa_0, ctx_k);
encrypt.c: ^~~~~
encrypt.c: encrypt.c:265:28: error: type of formal parameter 3 is incomplete
encrypt.c: gen_kappa(nonce, kappa_m, ctx_k);
encrypt.c: ^~~~~
encrypt.c: encrypt.c: In function 'crypto_aead_aes128cpfbv1_evp_timingleaks_decrypt':
encrypt.c: encrypt.c:330:20: error: array type has incomplete element type 'EVP_CIPHER_CTX' {aka 'struct evp_cipher_ctx_st'}
encrypt.c: EVP_CIPHER_CTX ctx_k[1];
encrypt.c: ^~~~~
encrypt.c: encrypt.c:331:20: error: array type has incomplete element type 'EVP_CIPHER_CTX' {aka 'struct evp_cipher_ctx_st'}
encrypt.c: EVP_CIPHER_CTX ctx_kappa_0[1];
encrypt.c: ...

Number of similar (compiler,implementation) pairs: 4, namely:
CompilerImplementations
gcc -march=native -mtune=native -O2 -fomit-frame-pointer -fwrapv -fPIC -fPIE T:evp
gcc -march=native -mtune=native -O3 -fomit-frame-pointer -fwrapv -fPIC -fPIE T:evp
gcc -march=native -mtune=native -O -fomit-frame-pointer -fwrapv -fPIC -fPIE T:evp
gcc -march=native -mtune=native -Os -fomit-frame-pointer -fwrapv -fPIC -fPIE T:evp

Namespace violations

Implementation: T:aesref
Security model: timingleaks
Compiler: clang -mcpu=native -O3 -fomit-frame-pointer -fwrapv -Qunused-arguments -fPIC -fPIE
rijndael-alg-fst.o rijndaelDecrypt T
rijndael-alg-fst.o rijndaelEncrypt T
rijndael-alg-fst.o rijndaelKeySetupDec T
rijndael-alg-fst.o rijndaelKeySetupEnc T

Number of similar (compiler,implementation) pairs: 5, namely:
CompilerImplementations
clang -mcpu=native -O3 -fomit-frame-pointer -fwrapv -Qunused-arguments -fPIC -fPIE T:aesref
gcc -march=native -mtune=native -O2 -fomit-frame-pointer -fwrapv -fPIC -fPIE T:aesref
gcc -march=native -mtune=native -O3 -fomit-frame-pointer -fwrapv -fPIC -fPIE T:aesref
gcc -march=native -mtune=native -O -fomit-frame-pointer -fwrapv -fPIC -fPIE T:aesref
gcc -march=native -mtune=native -Os -fomit-frame-pointer -fwrapv -fPIC -fPIE T:aesref

Namespace violations

Implementation: T:gladman
Security model: timingleaks
Compiler: clang -mcpu=native -O3 -fomit-frame-pointer -fwrapv -Qunused-arguments -fPIC -fPIE
aescrypt.o aes_encrypt T
aeskey.o aes_encrypt_key128 T
aeskey.o aes_encrypt_key256 T
aestab.o aes_init T
aestab.o t_fl R
aestab.o t_fn R
aestab.o t_rc R

Number of similar (compiler,implementation) pairs: 5, namely:
CompilerImplementations
clang -mcpu=native -O3 -fomit-frame-pointer -fwrapv -Qunused-arguments -fPIC -fPIE T:gladman
gcc -march=native -mtune=native -O2 -fomit-frame-pointer -fwrapv -fPIC -fPIE T:gladman
gcc -march=native -mtune=native -O3 -fomit-frame-pointer -fwrapv -fPIC -fPIE T:gladman
gcc -march=native -mtune=native -O -fomit-frame-pointer -fwrapv -fPIC -fPIE T:gladman
gcc -march=native -mtune=native -Os -fomit-frame-pointer -fwrapv -fPIC -fPIE T:gladman