Test results for armeabi, berry0, crypto_hash/blake2s

[Page version: 20250206 00:27:24]

Measurements for armeabi, berry0, crypto_hash Test results for armeabi, berry0, crypto_hash Test results for crypto_hash/blake2s
Computer: berry0
Microarchitecture: armeabi; ARM1176 (410fb767)
Architecture: armeabi
CPU ID: unknown CPU ID
SUPERCOP version: 20240909
Operation: crypto_hash
Primitive: blake2s
TimeObject sizeTest sizeImplementationCompilerBenchmark dateSUPERCOP version
385289684 0 018071 348 744T:regsgcc -march=native -mtune=native -Os -fwrapv -fPIC -fPIE -gdwarf-4 -Wall2024093020240909
4230011140 0 023248 384 752T:regsclang -mcpu=native -O3 -fwrapv -Qunused-arguments -fPIC -fPIE -gdwarf-4 -Wall2024093020240909
4280711052 0 020678 380 744T:regsclang -march=native -Os -fwrapv -Qunused-arguments -fPIC -fPIE -gdwarf-4 -Wall2024093020240909
4281511052 0 023112 384 752T:regsclang -march=native -O3 -fwrapv -Qunused-arguments -fPIC -fPIE -gdwarf-4 -Wall2024093020240909
4283711052 0 022580 384 744T:regsclang -march=native -O2 -fwrapv -Qunused-arguments -fPIC -fPIE -gdwarf-4 -Wall2024093020240909
436095948 0 014335 348 744T:refgcc -march=native -mtune=native -Os -fwrapv -fPIC -fPIE -gdwarf-4 -Wall2024093020240909
4379811788 0 020927 356 744T:regsgcc -march=native -mtune=native -O2 -fwrapv -fPIC -fPIE -gdwarf-4 -Wall2024093020240909
4432111788 0 022587 356 744T:regsgcc -march=native -mtune=native -O3 -fwrapv -fPIC -fPIE -gdwarf-4 -Wall2024093020240909
455389808 0 018823 356 744T:regsgcc -march=native -mtune=native -O -fwrapv -fPIC -fPIE -gdwarf-4 -Wall2024093020240909
500507848 0 018643 356 744T:refgcc -march=native -mtune=native -O3 -fwrapv -fPIC -fPIE -gdwarf-4 -Wall2024093020240909
510627176 0 016311 356 744T:refgcc -march=native -mtune=native -O2 -fwrapv -fPIC -fPIE -gdwarf-4 -Wall2024093020240909
521809408 0 021416 384 752T:refclang -march=native -O3 -fwrapv -Qunused-arguments -fPIC -fPIE -gdwarf-4 -Wall2024093020240909
539429360 0 021416 384 752T:refclang -mcpu=native -O3 -fwrapv -Qunused-arguments -fPIC -fPIE -gdwarf-4 -Wall2024093020240909
539888536 0 020012 384 744T:refclang -march=native -O2 -fwrapv -Qunused-arguments -fPIC -fPIE -gdwarf-4 -Wall2024093020240909
5482211500 0 021114 380 744T:regsclang -march=native -O -fwrapv -Qunused-arguments -fPIC -fPIE -gdwarf-4 -Wall2024093020240909
555717296 0 016870 380 744T:refclang -march=native -Os -fwrapv -Qunused-arguments -fPIC -fPIE -gdwarf-4 -Wall2024093020240909
583756088 0 015099 356 744T:refgcc -march=native -mtune=native -O -fwrapv -fPIC -fPIE -gdwarf-4 -Wall2024093020240909
19059513728 0 023234 380 744T:refclang -march=native -O -fwrapv -Qunused-arguments -fPIC -fPIE -gdwarf-4 -Wall2024093020240909

Compiler output


blake2s.S: blake2s.S:13:14: error: unexpected token in operand
blake2s.S:         xorl %r11d, %r11d
blake2s.S:              ^
blake2s.S: blake2s.S:14:14: error: unexpected token in operand
blake2s.S:         xorl %ecx, %ecx
blake2s.S:              ^
blake2s.S: blake2s.S:15:14: error: unexpected token in operand
blake2s.S:         movq %rsi, %r9
blake2s.S:              ^
blake2s.S: blake2s.S:16:39: error: unexpected token in variant, expected ')'
blake2s.S:         vmovdqu .L_2il0floatpacket.10(%rip), %xmm4
blake2s.S:                                       ^
blake2s.S: blake2s.S:17:14: error: unexpected token in operand
blake2s.S:         xorl %eax, %eax
blake2s.S:              ^
blake2s.S: blake2s.S:18:38: error: unexpected token in variant, expected ')'
blake2s.S:         vmovdqu .L_2il0floatpacket.7(%rip), %xmm0
blake2s.S:                                      ^
blake2s.S: blake2s.S:19:17: error: unexpected token in operand
blake2s.S:         vmovdqa %xmm4, %xmm2
blake2s.S:                 ^
blake2s.S: blake2s.S:20:38: error: unexpected token in variant, expected ')'
blake2s.S:         vmovdqu .L_2il0floatpacket.8(%rip), %xmm1
blake2s.S:                                      ^
blake2s.S: blake2s.S:21:14: error: unexpected token in operand
blake2s.S: ...

Number of similar (implementation,compiler) pairs: 5, namely:
ImplementationCompiler
T:avxiccclang -march=native -O2 -fwrapv -Qunused-arguments -fPIC -fPIE -gdwarf-4 -Wall (Raspbian_Clang_11.0.1)
T:avxiccclang -march=native -O3 -fwrapv -Qunused-arguments -fPIC -fPIE -gdwarf-4 -Wall (Raspbian_Clang_11.0.1)
T:avxiccclang -march=native -O -fwrapv -Qunused-arguments -fPIC -fPIE -gdwarf-4 -Wall (Raspbian_Clang_11.0.1)
T:avxiccclang -march=native -Os -fwrapv -Qunused-arguments -fPIC -fPIE -gdwarf-4 -Wall (Raspbian_Clang_11.0.1)
T:avxiccclang -mcpu=native -O3 -fwrapv -Qunused-arguments -fPIC -fPIE -gdwarf-4 -Wall (Raspbian_Clang_11.0.1)

Compiler output


blake2s.S: blake2s.c: Assembler messages:
blake2s.S: blake2s.c:13: Error: bad instruction `xorl %r11d,%r11d'
blake2s.S: blake2s.c:14: Error: bad instruction `xorl %ecx,%ecx'
blake2s.S: blake2s.c:15: Error: bad instruction `movq %rsi,%r9'
blake2s.S: blake2s.c:16: Error: bad instruction `vmovdqu .L_2il0floatpacket.10(%rip),%xmm4'
blake2s.S: blake2s.c:17: Error: bad instruction `xorl %eax,%eax'
blake2s.S: blake2s.c:18: Error: bad instruction `vmovdqu .L_2il0floatpacket.7(%rip),%xmm0'
blake2s.S: blake2s.c:19: Error: bad instruction `vmovdqa %xmm4,%xmm2'
blake2s.S: blake2s.c:20: Error: bad instruction `vmovdqu .L_2il0floatpacket.8(%rip),%xmm1'
blake2s.S: blake2s.c:21: Error: bad instruction `movq %rdx,%r8'
blake2s.S: blake2s.c:22: Error: bad instruction `vmovdqu .L_2il0floatpacket.9(%rip),%xmm3'
blake2s.S: blake2s.c:23: Error: bad instruction `xorl %r10d,%r10d'
blake2s.S: blake2s.c:24: Error: bad instruction `vmovdqu .L_2il0floatpacket.11(%rip),%xmm5'
blake2s.S: blake2s.c:25: Error: bad instruction `cmpq $64,%rdx'
blake2s.S: blake2s.c:26: Error: bad instruction `jbe ..B1.5'
blake2s.S: blake2s.c:28: Error: bad instruction `movq %rbp,-104(%rsp)'
blake2s.S: blake2s.c:29: Error: bad instruction `lea -1(%rdx),%rsi'
blake2s.S: blake2s.c:30: Error: bad instruction `sarq $5,%rsi'
blake2s.S: blake2s.c:32: Error: bad instruction `movq %rcx,%rbp'
blake2s.S: blake2s.c:33: Error: bad instruction `shrq $58,%rsi'
blake2s.S: blake2s.c:34: Error: bad instruction `movq %rax,%rcx'
blake2s.S: blake2s.c:35: Error: bad instruction `lea -1(%rsi,%rdx),%rdx'
blake2s.S: blake2s.c:36: Error: bad instruction `sarq $6,%rdx'
blake2s.S: blake2s.c:37: Error: bad instruction `movq %rdx,%rax'
blake2s.S: blake2s.c:39: Error: bad instruction `vmovdqu (%rcx,%r9),%xmm9'
blake2s.S: ...

Number of similar (implementation,compiler) pairs: 4, namely:
ImplementationCompiler
T:avxiccgcc -march=native -mtune=native -O2 -fwrapv -fPIC -fPIE -gdwarf-4 -Wall (10.2.1_20210110)
T:avxiccgcc -march=native -mtune=native -O3 -fwrapv -fPIC -fPIE -gdwarf-4 -Wall (10.2.1_20210110)
T:avxiccgcc -march=native -mtune=native -O -fwrapv -fPIC -fPIE -gdwarf-4 -Wall (10.2.1_20210110)
T:avxiccgcc -march=native -mtune=native -Os -fwrapv -fPIC -fPIE -gdwarf-4 -Wall (10.2.1_20210110)

Compiler output


blake2s.S: blake2s.S:1627:29: error: expected '%<type>' or "<type>"
blake2s.S: .section .note.GNU-stack,"",@progbits
blake2s.S:                             ^

Number of similar (implementation,compiler) pairs: 5, namely:
ImplementationCompiler
T:moon/armv6/32clang -march=native -O2 -fwrapv -Qunused-arguments -fPIC -fPIE -gdwarf-4 -Wall (Raspbian_Clang_11.0.1)
T:moon/armv6/32clang -march=native -O3 -fwrapv -Qunused-arguments -fPIC -fPIE -gdwarf-4 -Wall (Raspbian_Clang_11.0.1)
T:moon/armv6/32clang -march=native -O -fwrapv -Qunused-arguments -fPIC -fPIE -gdwarf-4 -Wall (Raspbian_Clang_11.0.1)
T:moon/armv6/32clang -march=native -Os -fwrapv -Qunused-arguments -fPIC -fPIE -gdwarf-4 -Wall (Raspbian_Clang_11.0.1)
T:moon/armv6/32clang -mcpu=native -O3 -fwrapv -Qunused-arguments -fPIC -fPIE -gdwarf-4 -Wall (Raspbian_Clang_11.0.1)

Compiler output


blake2s.S: blake2s.S: Assembler messages:
blake2s.S: blake2s.S:1627: Error: junk at end of line, first unrecognized character is `,'

Number of similar (implementation,compiler) pairs: 4, namely:
ImplementationCompiler
T:moon/armv6/32gcc -march=native -mtune=native -O2 -fwrapv -fPIC -fPIE -gdwarf-4 -Wall (10.2.1_20210110)
T:moon/armv6/32gcc -march=native -mtune=native -O3 -fwrapv -fPIC -fPIE -gdwarf-4 -Wall (10.2.1_20210110)
T:moon/armv6/32gcc -march=native -mtune=native -O -fwrapv -fPIC -fPIE -gdwarf-4 -Wall (10.2.1_20210110)
T:moon/armv6/32gcc -march=native -mtune=native -Os -fwrapv -fPIC -fPIE -gdwarf-4 -Wall (10.2.1_20210110)

Compiler output


blake2s-ref.c: blake2s-ref.c:63:19: warning: unused function 'blake2s_clear_lastblock' [-Wunused-function]
blake2s-ref.c: static inline int blake2s_clear_lastblock( blake2s_state *S )
blake2s-ref.c:                   ^
blake2s-ref.c: blake2s-ref.c:79:19: warning: unused function 'blake2s_param_set_digest_length' [-Wunused-function]
blake2s-ref.c: static inline int blake2s_param_set_digest_length( blake2s_param *P, const uint8_t digest_length )
blake2s-ref.c:                   ^
blake2s-ref.c: blake2s-ref.c:85:19: warning: unused function 'blake2s_param_set_fanout' [-Wunused-function]
blake2s-ref.c: static inline int blake2s_param_set_fanout( blake2s_param *P, const uint8_t fanout )
blake2s-ref.c:                   ^
blake2s-ref.c: blake2s-ref.c:91:19: warning: unused function 'blake2s_param_set_max_depth' [-Wunused-function]
blake2s-ref.c: static inline int blake2s_param_set_max_depth( blake2s_param *P, const uint8_t depth )
blake2s-ref.c:                   ^
blake2s-ref.c: blake2s-ref.c:97:19: warning: unused function 'blake2s_param_set_leaf_length' [-Wunused-function]
blake2s-ref.c: static inline int blake2s_param_set_leaf_length( blake2s_param *P, const uint32_t leaf_length )
blake2s-ref.c:                   ^
blake2s-ref.c: blake2s-ref.c:103:19: warning: unused function 'blake2s_param_set_node_offset' [-Wunused-function]
blake2s-ref.c: static inline int blake2s_param_set_node_offset( blake2s_param *P, const uint64_t node_offset )
blake2s-ref.c:                   ^
blake2s-ref.c: blake2s-ref.c:109:19: warning: unused function 'blake2s_param_set_node_depth' [-Wunused-function]
blake2s-ref.c: static inline int blake2s_param_set_node_depth( blake2s_param *P, const uint8_t node_depth )
blake2s-ref.c:                   ^
blake2s-ref.c: blake2s-ref.c:115:19: warning: unused function 'blake2s_param_set_inner_length' [-Wunused-function]
blake2s-ref.c: static inline int blake2s_param_set_inner_length( blake2s_param *P, const uint8_t inner_length )
blake2s-ref.c:                   ^
blake2s-ref.c: blake2s-ref.c:121:19: warning: unused function 'blake2s_param_set_salt' [-Wunused-function]
blake2s-ref.c: ...

Number of similar (implementation,compiler) pairs: 5, namely:
ImplementationCompiler
T:refclang -march=native -O2 -fwrapv -Qunused-arguments -fPIC -fPIE -gdwarf-4 -Wall (Raspbian_Clang_11.0.1)
T:refclang -march=native -O3 -fwrapv -Qunused-arguments -fPIC -fPIE -gdwarf-4 -Wall (Raspbian_Clang_11.0.1)
T:refclang -march=native -O -fwrapv -Qunused-arguments -fPIC -fPIE -gdwarf-4 -Wall (Raspbian_Clang_11.0.1)
T:refclang -march=native -Os -fwrapv -Qunused-arguments -fPIC -fPIE -gdwarf-4 -Wall (Raspbian_Clang_11.0.1)
T:refclang -mcpu=native -O3 -fwrapv -Qunused-arguments -fPIC -fPIE -gdwarf-4 -Wall (Raspbian_Clang_11.0.1)

Compiler output


blake2s.c: In file included from blake2s.c:21:
blake2s.c: ./blake2-config.h:68:2: error: "This code requires at least SSE2."
blake2s.c: #error "This code requires at least SSE2."
blake2s.c:  ^
blake2s.c: In file included from blake2s.c:24:
blake2s.c: In file included from /usr/lib/llvm-11/lib/clang/11.0.1/include/emmintrin.h:13:
blake2s.c: In file included from /usr/lib/llvm-11/lib/clang/11.0.1/include/xmmintrin.h:13:
blake2s.c: /usr/lib/llvm-11/lib/clang/11.0.1/include/mmintrin.h:50:12: error: invalid conversion between vector type '__m64' (vector of 1 'long long' value) and integer type 'int' of different size
blake2s.c:     return (__m64)__builtin_ia32_vec_init_v2si(__i, 0);
blake2s.c:            ^~~~~~~~~~~~~~~~~~~~~~~~~~~~~~~~~~~~~~~~~~~
blake2s.c: /usr/lib/llvm-11/lib/clang/11.0.1/include/mmintrin.h:129:12: error: invalid conversion between vector type '__m64' (vector of 1 'long long' value) and integer type 'int' of different size
blake2s.c:     return (__m64)__builtin_ia32_packsswb((__v4hi)__m1, (__v4hi)__m2);
blake2s.c:            ^~~~~~~~~~~~~~~~~~~~~~~~~~~~~~~~~~~~~~~~~~~~~~~~~~~~~~~~~~
blake2s.c: /usr/lib/llvm-11/lib/clang/11.0.1/include/mmintrin.h:159:12: error: invalid conversion between vector type '__m64' (vector of 1 'long long' value) and integer type 'int' of different size
blake2s.c:     return (__m64)__builtin_ia32_packssdw((__v2si)__m1, (__v2si)__m2);
blake2s.c:            ^~~~~~~~~~~~~~~~~~~~~~~~~~~~~~~~~~~~~~~~~~~~~~~~~~~~~~~~~~
blake2s.c: /usr/lib/llvm-11/lib/clang/11.0.1/include/mmintrin.h:189:12: error: invalid conversion between vector type '__m64' (vector of 1 'long long' value) and integer type 'int' of different size
blake2s.c:     return (__m64)__builtin_ia32_packuswb((__v4hi)__m1, (__v4hi)__m2);
blake2s.c:            ^~~~~~~~~~~~~~~~~~~~~~~~~~~~~~~~~~~~~~~~~~~~~~~~~~~~~~~~~~
blake2s.c: /usr/lib/llvm-11/lib/clang/11.0.1/include/mmintrin.h:216:12: error: invalid conversion between vector type '__m64' (vector of 1 'long long' value) and integer type 'int' of different size
blake2s.c:     return (__m64)__builtin_ia32_punpckhbw((__v8qi)__m1, (__v8qi)__m2);
blake2s.c:            ^~~~~~~~~~~~~~~~~~~~~~~~~~~~~~~~~~~~~~~~~~~~~~~~~~~~~~~~~~~
blake2s.c: /usr/lib/llvm-11/lib/clang/11.0.1/include/mmintrin.h:239:12: error: invalid conversion between vector type '__m64' (vector of 1 'long long' value) and integer type 'int' of different size
blake2s.c:     return (__m64)__builtin_ia32_punpckhwd((__v4hi)__m1, (__v4hi)__m2);
blake2s.c:            ^~~~~~~~~~~~~~~~~~~~~~~~~~~~~~~~~~~~~~~~~~~~~~~~~~~~~~~~~~~
blake2s.c: ...

Number of similar (implementation,compiler) pairs: 5, namely:
ImplementationCompiler
T:xmmclang -march=native -O2 -fwrapv -Qunused-arguments -fPIC -fPIE -gdwarf-4 -Wall (Raspbian_Clang_11.0.1)
T:xmmclang -march=native -O3 -fwrapv -Qunused-arguments -fPIC -fPIE -gdwarf-4 -Wall (Raspbian_Clang_11.0.1)
T:xmmclang -march=native -O -fwrapv -Qunused-arguments -fPIC -fPIE -gdwarf-4 -Wall (Raspbian_Clang_11.0.1)
T:xmmclang -march=native -Os -fwrapv -Qunused-arguments -fPIC -fPIE -gdwarf-4 -Wall (Raspbian_Clang_11.0.1)
T:xmmclang -mcpu=native -O3 -fwrapv -Qunused-arguments -fPIC -fPIE -gdwarf-4 -Wall (Raspbian_Clang_11.0.1)

Compiler output


blake2s.c: In file included from blake2s.c:21:
blake2s.c: blake2-config.h:68:2: error: #error "This code requires at least SSE2."
blake2s.c:    68 | #error "This code requires at least SSE2."
blake2s.c:       |  ^~~~~
blake2s.c: blake2s.c:24:10: fatal error: emmintrin.h: No such file or directory
blake2s.c:    24 | #include <emmintrin.h>
blake2s.c:       |          ^~~~~~~~~~~~~
blake2s.c: compilation terminated.

Number of similar (implementation,compiler) pairs: 4, namely:
ImplementationCompiler
T:xmmgcc -march=native -mtune=native -O2 -fwrapv -fPIC -fPIE -gdwarf-4 -Wall (10.2.1_20210110)
T:xmmgcc -march=native -mtune=native -O3 -fwrapv -fPIC -fPIE -gdwarf-4 -Wall (10.2.1_20210110)
T:xmmgcc -march=native -mtune=native -O -fwrapv -fPIC -fPIE -gdwarf-4 -Wall (10.2.1_20210110)
T:xmmgcc -march=native -mtune=native -Os -fwrapv -fPIC -fPIE -gdwarf-4 -Wall (10.2.1_20210110)

Namespace violations


blake2s-ref.o N 0
blake2s-ref.o N 107
blake2s-ref.o N 112
blake2s-ref.o N 11b
blake2s-ref.o N 12f
blake2s-ref.o N 13d
blake2s-ref.o N 14b
blake2s-ref.o N 155
blake2s-ref.o N 15d
blake2s-ref.o N 170
blake2s-ref.o N 181
blake2s-ref.o N 192
blake2s-ref.o N 1a4
blake2s-ref.o N 1ba
blake2s-ref.o N 1cb
blake2s-ref.o N 1d9
blake2s-ref.o N 1dd
blake2s-ref.o N 1df
blake2s-ref.o N 1e1
blake2s-ref.o N 1e3
blake2s-ref.o N 1e5
blake2s-ref.o N 1e9
blake2s-ref.o N 1f0
blake2s-ref.o N 1f7
blake2s-ref.o N 201
blake2s-ref.o N 211
blake2s-ref.o N 21f
blake2s-ref.o N 221
blake2s-ref.o N 228
blake2s-ref.o N 22c
blake2s-ref.o N 22e
blake2s-ref.o N 230
blake2s-ref.o N 243
blake2s-ref.o N 245
blake2s-ref.o N 25
blake2s-ref.o N 253
blake2s-ref.o N 25e
blake2s-ref.o N 265
blake2s-ref.o N 26b
blake2s-ref.o N 277
blake2s-ref.o N 283
blake2s-ref.o N 28e
blake2s-ref.o N 29b
blake2s-ref.o N 2a0
blake2s-ref.o N 2a9
blake2s-ref.o N 2b9
blake2s-ref.o N 2c7
blake2s-ref.o N 2d6
blake2s-ref.o N 2d9
blake2s-ref.o N 2df
blake2s-ref.o N 2f6
blake2s-ref.o N 301
blake2s-ref.o N 30a
blake2s-ref.o N 30f
blake2s-ref.o N 314
blake2s-ref.o N 327
blake2s-ref.o N 329
blake2s-ref.o N 32b
blake2s-ref.o N 33
blake2s-ref.o N 345
blake2s-ref.o N 349
blake2s-ref.o N 350
blake2s-ref.o N 352
blake2s-ref.o N 368
blake2s-ref.o N 37d
blake2s-ref.o N 385
blake2s-ref.o N 389
blake2s-ref.o N 396
blake2s-ref.o N 39d
blake2s-ref.o N 3ae
blake2s-ref.o N 3bf
blake2s-ref.o N 3cd
blake2s-ref.o N 3d5
blake2s-ref.o N 3f9
blake2s-ref.o N 3ff
blake2s-ref.o N 403
blake2s-ref.o N 40a
blake2s-ref.o N 40c
blake2s-ref.o N 413
blake2s-ref.o N ef
blake2s-ref.o N fa
blake2s-ref.o blake2s T
blake2s-ref.o blake2s_final T
blake2s-ref.o blake2s_init T
blake2s-ref.o blake2s_init_key T
blake2s-ref.o blake2s_init_param T
blake2s-ref.o blake2s_update T

Number of similar (implementation,compiler) pairs: 1, namely:
ImplementationCompiler
T:refclang -march=native -O2 -fwrapv -Qunused-arguments -fPIC -fPIE -gdwarf-4 -Wall (Raspbian_Clang_11.0.1)

Namespace violations


blake2s-ref.o N 0
blake2s-ref.o N 107
blake2s-ref.o N 112
blake2s-ref.o N 11b
blake2s-ref.o N 12f
blake2s-ref.o N 13d
blake2s-ref.o N 14b
blake2s-ref.o N 155
blake2s-ref.o N 15d
blake2s-ref.o N 170
blake2s-ref.o N 181
blake2s-ref.o N 192
blake2s-ref.o N 1a4
blake2s-ref.o N 1ba
blake2s-ref.o N 1cb
blake2s-ref.o N 1d9
blake2s-ref.o N 1dd
blake2s-ref.o N 1df
blake2s-ref.o N 1e1
blake2s-ref.o N 1e3
blake2s-ref.o N 1e5
blake2s-ref.o N 1e9
blake2s-ref.o N 1f0
blake2s-ref.o N 1f7
blake2s-ref.o N 201
blake2s-ref.o N 211
blake2s-ref.o N 21f
blake2s-ref.o N 221
blake2s-ref.o N 228
blake2s-ref.o N 22c
blake2s-ref.o N 22e
blake2s-ref.o N 230
blake2s-ref.o N 243
blake2s-ref.o N 245
blake2s-ref.o N 25
blake2s-ref.o N 253
blake2s-ref.o N 25e
blake2s-ref.o N 265
blake2s-ref.o N 26b
blake2s-ref.o N 277
blake2s-ref.o N 283
blake2s-ref.o N 28e
blake2s-ref.o N 29b
blake2s-ref.o N 2a0
blake2s-ref.o N 2a9
blake2s-ref.o N 2b9
blake2s-ref.o N 2c7
blake2s-ref.o N 2d6
blake2s-ref.o N 2d9
blake2s-ref.o N 2df
blake2s-ref.o N 2f6
blake2s-ref.o N 301
blake2s-ref.o N 30a
blake2s-ref.o N 30f
blake2s-ref.o N 314
blake2s-ref.o N 327
blake2s-ref.o N 329
blake2s-ref.o N 32b
blake2s-ref.o N 33
blake2s-ref.o N 345
blake2s-ref.o N 349
blake2s-ref.o N 350
blake2s-ref.o N 352
blake2s-ref.o N 368
blake2s-ref.o N 37d
blake2s-ref.o N 385
blake2s-ref.o N 389
blake2s-ref.o N 396
blake2s-ref.o N 39d
blake2s-ref.o N 3a5
blake2s-ref.o N 3a9
blake2s-ref.o N 3ad
blake2s-ref.o N 3b4
blake2s-ref.o N 3c5
blake2s-ref.o N 3d6
blake2s-ref.o N 3e4
blake2s-ref.o N 408
blake2s-ref.o N 40e
blake2s-ref.o N 410
blake2s-ref.o N ef
blake2s-ref.o N fa
blake2s-ref.o blake2s T
blake2s-ref.o blake2s_final T
blake2s-ref.o blake2s_init T
blake2s-ref.o blake2s_init_key T
blake2s-ref.o blake2s_init_param T
blake2s-ref.o blake2s_update T

Number of similar (implementation,compiler) pairs: 1, namely:
ImplementationCompiler
T:refclang -march=native -O3 -fwrapv -Qunused-arguments -fPIC -fPIE -gdwarf-4 -Wall (Raspbian_Clang_11.0.1)

Namespace violations


blake2s-ref.o N 0
blake2s-ref.o N 106
blake2s-ref.o N 111
blake2s-ref.o N 11a
blake2s-ref.o N 12e
blake2s-ref.o N 13c
blake2s-ref.o N 14a
blake2s-ref.o N 154
blake2s-ref.o N 15c
blake2s-ref.o N 16f
blake2s-ref.o N 180
blake2s-ref.o N 191
blake2s-ref.o N 1a3
blake2s-ref.o N 1b9
blake2s-ref.o N 1ca
blake2s-ref.o N 1dd
blake2s-ref.o N 1e1
blake2s-ref.o N 1ef
blake2s-ref.o N 1f6
blake2s-ref.o N 203
blake2s-ref.o N 20b
blake2s-ref.o N 213
blake2s-ref.o N 224
blake2s-ref.o N 233
blake2s-ref.o N 246
blake2s-ref.o N 25
blake2s-ref.o N 260
blake2s-ref.o N 271
blake2s-ref.o N 27f
blake2s-ref.o N 295
blake2s-ref.o N 29d
blake2s-ref.o N 2c1
blake2s-ref.o N 2c8
blake2s-ref.o N 2dd
blake2s-ref.o N 2df
blake2s-ref.o N 2e1
blake2s-ref.o N 2e3
blake2s-ref.o N 2e5
blake2s-ref.o N 2e9
blake2s-ref.o N 2f0
blake2s-ref.o N 2f7
blake2s-ref.o N 301
blake2s-ref.o N 311
blake2s-ref.o N 31f
blake2s-ref.o N 321
blake2s-ref.o N 32f
blake2s-ref.o N 33
blake2s-ref.o N 33a
blake2s-ref.o N 341
blake2s-ref.o N 347
blake2s-ref.o N 353
blake2s-ref.o N 35f
blake2s-ref.o N 36a
blake2s-ref.o N 377
blake2s-ref.o N 37c
blake2s-ref.o N 385
blake2s-ref.o N 395
blake2s-ref.o N 3a3
blake2s-ref.o N 3a5
blake2s-ref.o N 3a7
blake2s-ref.o N 3ab
blake2s-ref.o N 3ad
blake2s-ref.o N 3b4
blake2s-ref.o N 3b8
blake2s-ref.o N 3cf
blake2s-ref.o N 3da
blake2s-ref.o N 3e3
blake2s-ref.o N 3e9
blake2s-ref.o N 3ed
blake2s-ref.o N 3f4
blake2s-ref.o N 3f7
blake2s-ref.o N 3fd
blake2s-ref.o N 402
blake2s-ref.o N 407
blake2s-ref.o N 409
blake2s-ref.o N 40b
blake2s-ref.o N 40f
blake2s-ref.o N 411
blake2s-ref.o N 418
blake2s-ref.o N 41c
blake2s-ref.o N ee
blake2s-ref.o N f9
blake2s-ref.o blake2s T
blake2s-ref.o blake2s_final T
blake2s-ref.o blake2s_init T
blake2s-ref.o blake2s_init_key T
blake2s-ref.o blake2s_init_param T
blake2s-ref.o blake2s_update T

Number of similar (implementation,compiler) pairs: 1, namely:
ImplementationCompiler
T:refclang -march=native -O -fwrapv -Qunused-arguments -fPIC -fPIE -gdwarf-4 -Wall (Raspbian_Clang_11.0.1)

Namespace violations


blake2s-ref.o N 0
blake2s-ref.o N 107
blake2s-ref.o N 112
blake2s-ref.o N 11b
blake2s-ref.o N 12f
blake2s-ref.o N 13d
blake2s-ref.o N 14b
blake2s-ref.o N 155
blake2s-ref.o N 15d
blake2s-ref.o N 170
blake2s-ref.o N 181
blake2s-ref.o N 192
blake2s-ref.o N 1a4
blake2s-ref.o N 1ba
blake2s-ref.o N 1cb
blake2s-ref.o N 1d9
blake2s-ref.o N 1dd
blake2s-ref.o N 1df
blake2s-ref.o N 1e1
blake2s-ref.o N 1e3
blake2s-ref.o N 1e5
blake2s-ref.o N 1e9
blake2s-ref.o N 1f0
blake2s-ref.o N 1f7
blake2s-ref.o N 201
blake2s-ref.o N 211
blake2s-ref.o N 21f
blake2s-ref.o N 221
blake2s-ref.o N 228
blake2s-ref.o N 22c
blake2s-ref.o N 22e
blake2s-ref.o N 230
blake2s-ref.o N 238
blake2s-ref.o N 23c
blake2s-ref.o N 24f
blake2s-ref.o N 25
blake2s-ref.o N 251
blake2s-ref.o N 253
blake2s-ref.o N 26d
blake2s-ref.o N 271
blake2s-ref.o N 278
blake2s-ref.o N 27a
blake2s-ref.o N 290
blake2s-ref.o N 2a5
blake2s-ref.o N 2b2
blake2s-ref.o N 2b9
blake2s-ref.o N 2bb
blake2s-ref.o N 2c9
blake2s-ref.o N 2d4
blake2s-ref.o N 2db
blake2s-ref.o N 2e1
blake2s-ref.o N 2ed
blake2s-ref.o N 2f9
blake2s-ref.o N 304
blake2s-ref.o N 311
blake2s-ref.o N 316
blake2s-ref.o N 31f
blake2s-ref.o N 32f
blake2s-ref.o N 33
blake2s-ref.o N 33d
blake2s-ref.o N 350
blake2s-ref.o N 361
blake2s-ref.o N 370
blake2s-ref.o N 381
blake2s-ref.o N 38f
blake2s-ref.o N 397
blake2s-ref.o N 3bb
blake2s-ref.o N 3c1
blake2s-ref.o N 3c5
blake2s-ref.o N 3cc
blake2s-ref.o N 3cf
blake2s-ref.o N 3d5
blake2s-ref.o N 3ec
blake2s-ref.o N 3f7
blake2s-ref.o N 400
blake2s-ref.o N 405
blake2s-ref.o N 40a
blake2s-ref.o N 40c
blake2s-ref.o N 413
blake2s-ref.o N ef
blake2s-ref.o N fa
blake2s-ref.o blake2s T
blake2s-ref.o blake2s_final T
blake2s-ref.o blake2s_init T
blake2s-ref.o blake2s_init_key T
blake2s-ref.o blake2s_init_param T
blake2s-ref.o blake2s_update T

Number of similar (implementation,compiler) pairs: 1, namely:
ImplementationCompiler
T:refclang -march=native -Os -fwrapv -Qunused-arguments -fPIC -fPIE -gdwarf-4 -Wall (Raspbian_Clang_11.0.1)

Namespace violations


blake2s-ref.o N 0
blake2s-ref.o N 106
blake2s-ref.o N 111
blake2s-ref.o N 11a
blake2s-ref.o N 12e
blake2s-ref.o N 13c
blake2s-ref.o N 14a
blake2s-ref.o N 154
blake2s-ref.o N 15c
blake2s-ref.o N 16f
blake2s-ref.o N 180
blake2s-ref.o N 191
blake2s-ref.o N 1a3
blake2s-ref.o N 1b9
blake2s-ref.o N 1ca
blake2s-ref.o N 1d8
blake2s-ref.o N 1dc
blake2s-ref.o N 1de
blake2s-ref.o N 1e0
blake2s-ref.o N 1e2
blake2s-ref.o N 1e4
blake2s-ref.o N 1e8
blake2s-ref.o N 1ef
blake2s-ref.o N 1f6
blake2s-ref.o N 200
blake2s-ref.o N 210
blake2s-ref.o N 21e
blake2s-ref.o N 220
blake2s-ref.o N 227
blake2s-ref.o N 22b
blake2s-ref.o N 22d
blake2s-ref.o N 22f
blake2s-ref.o N 242
blake2s-ref.o N 244
blake2s-ref.o N 25
blake2s-ref.o N 252
blake2s-ref.o N 25d
blake2s-ref.o N 264
blake2s-ref.o N 26a
blake2s-ref.o N 276
blake2s-ref.o N 282
blake2s-ref.o N 28d
blake2s-ref.o N 29a
blake2s-ref.o N 29f
blake2s-ref.o N 2a8
blake2s-ref.o N 2b8
blake2s-ref.o N 2c6
blake2s-ref.o N 2d5
blake2s-ref.o N 2d8
blake2s-ref.o N 2de
blake2s-ref.o N 2f5
blake2s-ref.o N 300
blake2s-ref.o N 309
blake2s-ref.o N 30e
blake2s-ref.o N 313
blake2s-ref.o N 326
blake2s-ref.o N 328
blake2s-ref.o N 32a
blake2s-ref.o N 33
blake2s-ref.o N 344
blake2s-ref.o N 348
blake2s-ref.o N 34f
blake2s-ref.o N 351
blake2s-ref.o N 367
blake2s-ref.o N 37c
blake2s-ref.o N 384
blake2s-ref.o N 388
blake2s-ref.o N 395
blake2s-ref.o N 39c
blake2s-ref.o N 3a4
blake2s-ref.o N 3a8
blake2s-ref.o N 3ac
blake2s-ref.o N 3b3
blake2s-ref.o N 3c4
blake2s-ref.o N 3d5
blake2s-ref.o N 3e3
blake2s-ref.o N 407
blake2s-ref.o N 40d
blake2s-ref.o N 40f
blake2s-ref.o N ee
blake2s-ref.o N f9
blake2s-ref.o blake2s T
blake2s-ref.o blake2s_final T
blake2s-ref.o blake2s_init T
blake2s-ref.o blake2s_init_key T
blake2s-ref.o blake2s_init_param T
blake2s-ref.o blake2s_update T

Number of similar (implementation,compiler) pairs: 1, namely:
ImplementationCompiler
T:refclang -mcpu=native -O3 -fwrapv -Qunused-arguments -fPIC -fPIE -gdwarf-4 -Wall (Raspbian_Clang_11.0.1)

Namespace violations


blake2s-ref.o blake2s T
blake2s-ref.o blake2s_final T
blake2s-ref.o blake2s_init T
blake2s-ref.o blake2s_init_key T
blake2s-ref.o blake2s_init_param T
blake2s-ref.o blake2s_update T

Number of similar (implementation,compiler) pairs: 4, namely:
ImplementationCompiler
T:refgcc -march=native -mtune=native -O2 -fwrapv -fPIC -fPIE -gdwarf-4 -Wall (10.2.1_20210110)
T:refgcc -march=native -mtune=native -O3 -fwrapv -fPIC -fPIE -gdwarf-4 -Wall (10.2.1_20210110)
T:refgcc -march=native -mtune=native -O -fwrapv -fPIC -fPIE -gdwarf-4 -Wall (10.2.1_20210110)
T:refgcc -march=native -mtune=native -Os -fwrapv -fPIC -fPIE -gdwarf-4 -Wall (10.2.1_20210110)

Namespace violations


blake2s.o N 0
blake2s.o N 104
blake2s.o N 10d
blake2s.o N 114
blake2s.o N 118
blake2s.o N 120
blake2s.o N 124
blake2s.o N 126
blake2s.o N 14b
blake2s.o N 14f
blake2s.o N 156
blake2s.o N 164
blake2s.o N 16e
blake2s.o N 176
blake2s.o N 18a
blake2s.o N 18e
blake2s.o N 191
blake2s.o N 197
blake2s.o N 1ae
blake2s.o N 1b1
blake2s.o N 1b4
blake2s.o N 1b7
blake2s.o N 1ba
blake2s.o N 1bd
blake2s.o N 1c0
blake2s.o N 1c3
blake2s.o N 1c6
blake2s.o N 1ca
blake2s.o N 1d5
blake2s.o N 1de
blake2s.o N 1e2
blake2s.o N 1e6
blake2s.o N 1ea
blake2s.o N 1ee
blake2s.o N 1f2
blake2s.o N 1f6
blake2s.o N 1fa
blake2s.o N 1fe
blake2s.o N 201
blake2s.o N 205
blake2s.o N 208
blake2s.o N 20b
blake2s.o N 20e
blake2s.o N 211
blake2s.o N 215
blake2s.o N 219
blake2s.o N 21c
blake2s.o N 220
blake2s.o N 224
blake2s.o N 228
blake2s.o N 22b
blake2s.o N 22e
blake2s.o N 232
blake2s.o N 235
blake2s.o N 238
blake2s.o N 23c
blake2s.o N 240
blake2s.o N 244
blake2s.o N 247
blake2s.o N 24a
blake2s.o N 24e
blake2s.o N 25
blake2s.o N 2f
blake2s.o N ec
blake2s.o N f9

Number of similar (implementation,compiler) pairs: 3, namely:
ImplementationCompiler
T:regsclang -march=native -O2 -fwrapv -Qunused-arguments -fPIC -fPIE -gdwarf-4 -Wall (Raspbian_Clang_11.0.1)
T:regsclang -march=native -O3 -fwrapv -Qunused-arguments -fPIC -fPIE -gdwarf-4 -Wall (Raspbian_Clang_11.0.1)
T:regsclang -march=native -Os -fwrapv -Qunused-arguments -fPIC -fPIE -gdwarf-4 -Wall (Raspbian_Clang_11.0.1)

Namespace violations


blake2s.o N 0
blake2s.o N 103
blake2s.o N 10c
blake2s.o N 131
blake2s.o N 135
blake2s.o N 13c
blake2s.o N 144
blake2s.o N 14b
blake2s.o N 159
blake2s.o N 163
blake2s.o N 16b
blake2s.o N 17f
blake2s.o N 183
blake2s.o N 186
blake2s.o N 18c
blake2s.o N 1a3
blake2s.o N 1a6
blake2s.o N 1a9
blake2s.o N 1ac
blake2s.o N 1af
blake2s.o N 1b2
blake2s.o N 1b5
blake2s.o N 1b8
blake2s.o N 1bb
blake2s.o N 1bf
blake2s.o N 1ca
blake2s.o N 1d3
blake2s.o N 1d7
blake2s.o N 1db
blake2s.o N 1df
blake2s.o N 1e3
blake2s.o N 1e7
blake2s.o N 1eb
blake2s.o N 1ef
blake2s.o N 1f3
blake2s.o N 1f7
blake2s.o N 1fa
blake2s.o N 1fd
blake2s.o N 200
blake2s.o N 203
blake2s.o N 206
blake2s.o N 20a
blake2s.o N 20e
blake2s.o N 212
blake2s.o N 216
blake2s.o N 219
blake2s.o N 21d
blake2s.o N 220
blake2s.o N 223
blake2s.o N 226
blake2s.o N 229
blake2s.o N 22c
blake2s.o N 22f
blake2s.o N 233
blake2s.o N 237
blake2s.o N 23b
blake2s.o N 23f
blake2s.o N 243
blake2s.o N 247
blake2s.o N 24b
blake2s.o N 24f
blake2s.o N 25
blake2s.o N 2f
blake2s.o N eb
blake2s.o N f8

Number of similar (implementation,compiler) pairs: 1, namely:
ImplementationCompiler
T:regsclang -march=native -O -fwrapv -Qunused-arguments -fPIC -fPIE -gdwarf-4 -Wall (Raspbian_Clang_11.0.1)

Namespace violations


blake2s.o N 0
blake2s.o N 103
blake2s.o N 10c
blake2s.o N 113
blake2s.o N 117
blake2s.o N 11f
blake2s.o N 123
blake2s.o N 125
blake2s.o N 14a
blake2s.o N 14e
blake2s.o N 155
blake2s.o N 163
blake2s.o N 16d
blake2s.o N 175
blake2s.o N 189
blake2s.o N 18d
blake2s.o N 190
blake2s.o N 196
blake2s.o N 1ad
blake2s.o N 1b0
blake2s.o N 1b3
blake2s.o N 1b6
blake2s.o N 1b9
blake2s.o N 1bc
blake2s.o N 1bf
blake2s.o N 1c2
blake2s.o N 1c5
blake2s.o N 1c9
blake2s.o N 1d4
blake2s.o N 1dd
blake2s.o N 1e1
blake2s.o N 1e5
blake2s.o N 1e8
blake2s.o N 1eb
blake2s.o N 1ee
blake2s.o N 1f1
blake2s.o N 1f5
blake2s.o N 1f9
blake2s.o N 1fc
blake2s.o N 1ff
blake2s.o N 203
blake2s.o N 207
blake2s.o N 20b
blake2s.o N 20f
blake2s.o N 213
blake2s.o N 217
blake2s.o N 21b
blake2s.o N 21f
blake2s.o N 223
blake2s.o N 227
blake2s.o N 22b
blake2s.o N 22e
blake2s.o N 231
blake2s.o N 234
blake2s.o N 237
blake2s.o N 23b
blake2s.o N 23f
blake2s.o N 243
blake2s.o N 246
blake2s.o N 249
blake2s.o N 24d
blake2s.o N 25
blake2s.o N 2f
blake2s.o N eb
blake2s.o N f8

Number of similar (implementation,compiler) pairs: 1, namely:
ImplementationCompiler
T:regsclang -mcpu=native -O3 -fwrapv -Qunused-arguments -fPIC -fPIE -gdwarf-4 -Wall (Raspbian_Clang_11.0.1)