Test results for armeabi, berry0, crypto_aead/aes256cpfbv1
[Page version: 20250206 00:27:24]
Measurements for armeabi, berry0, crypto_aead
Test results for armeabi, berry0, crypto_aead
Test results for crypto_aead/aes256cpfbv1
Computer: berry0
Microarchitecture: armeabi; ARM1176 (410fb767)
Architecture: armeabi
CPU ID: unknown CPU ID
SUPERCOP version: 20240909
Operation: crypto_aead
Primitive: aes256cpfbv1
Time | Object size | Test size | Implementation | Compiler | Benchmark date | SUPERCOP version |
774254 | 18548 0 0 | 36843 368 816 | T:gladman | gcc -march=native -mtune=native -O2 -fwrapv -fPIC -fPIE -gdwarf-4 -Wall | 20241004 | 20240909 |
786231 | 19432 0 0 | 39375 368 816 | T:gladman | gcc -march=native -mtune=native -O3 -fwrapv -fPIC -fPIE -gdwarf-4 -Wall | 20241004 | 20240909 |
796647 | 19548 0 0 | 39487 356 816 | T:aesref | gcc -march=native -mtune=native -O3 -fwrapv -fPIC -fPIE -gdwarf-4 -Wall | 20241004 | 20240909 |
804246 | 4796 0 0 | 25076 372 816 | T:ref | gcc -march=native -mtune=native -O3 -fwrapv -fPIC -fPIE -gdwarf-4 -Wall | 20241004 | 20240909 |
824215 | 17180 0 0 | 34319 360 816 | T:gladman | gcc -march=native -mtune=native -Os -fwrapv -fPIC -fPIE -gdwarf-4 -Wall | 20241004 | 20240909 |
833191 | 18692 0 0 | 44704 396 816 | T:gladman | clang -march=native -O2 -fwrapv -Qunused-arguments -fPIC -fPIE -gdwarf-4 -Wall | 20241004 | 20240909 |
834595 | 18700 0 0 | 39588 396 824 | T:gladman | clang -march=native -O3 -fwrapv -Qunused-arguments -fPIC -fPIE -gdwarf-4 -Wall | 20241004 | 20240909 |
836107 | 18196 0 0 | 42314 392 816 | T:gladman | clang -march=native -Os -fwrapv -Qunused-arguments -fPIC -fPIE -gdwarf-4 -Wall | 20241004 | 20240909 |
840088 | 17076 0 0 | 35363 356 816 | T:aesref | gcc -march=native -mtune=native -O2 -fwrapv -fPIC -fPIE -gdwarf-4 -Wall | 20241004 | 20240909 |
855355 | 4244 0 0 | 30526 392 816 | T:ref | clang -march=native -O2 -fwrapv -Qunused-arguments -fPIC -fPIE -gdwarf-4 -Wall | 20241004 | 20240909 |
858199 | 2612 0 0 | 21240 372 816 | T:ref | gcc -march=native -mtune=native -O2 -fwrapv -fPIC -fPIE -gdwarf-4 -Wall | 20241004 | 20240909 |
858255 | 4244 0 0 | 25402 392 824 | T:ref | clang -march=native -O3 -fwrapv -Qunused-arguments -fPIC -fPIE -gdwarf-4 -Wall | 20241004 | 20240909 |
860981 | 18736 0 0 | 39680 396 824 | T:gladman | clang -mcpu=native -O3 -fwrapv -Qunused-arguments -fPIC -fPIE -gdwarf-4 -Wall | 20241004 | 20240909 |
868730 | 4232 0 0 | 25446 392 824 | T:ref | clang -mcpu=native -O3 -fwrapv -Qunused-arguments -fPIC -fPIE -gdwarf-4 -Wall | 20241004 | 20240909 |
927319 | 17648 0 0 | 43660 384 816 | T:aesref | clang -march=native -O2 -fwrapv -Qunused-arguments -fPIC -fPIE -gdwarf-4 -Wall | 20241004 | 20240909 |
930506 | 19136 0 0 | 40024 384 824 | T:aesref | clang -march=native -O3 -fwrapv -Qunused-arguments -fPIC -fPIE -gdwarf-4 -Wall | 20241004 | 20240909 |
936555 | 2648 0 0 | 27036 388 816 | T:ref | clang -march=native -Os -fwrapv -Qunused-arguments -fPIC -fPIE -gdwarf-4 -Wall | 20241004 | 20240909 |
938611 | 2080 0 0 | 26080 388 816 | T:ref | clang -march=native -O -fwrapv -Qunused-arguments -fPIC -fPIE -gdwarf-4 -Wall | 20241004 | 20240909 |
939765 | 2248 0 0 | 20663 368 816 | T:ref | gcc -march=native -mtune=native -O -fwrapv -fPIC -fPIE -gdwarf-4 -Wall | 20241004 | 20240909 |
942277 | 1716 0 0 | 19192 364 816 | T:ref | gcc -march=native -mtune=native -Os -fwrapv -fPIC -fPIE -gdwarf-4 -Wall | 20241004 | 20240909 |
947040 | 17292 0 0 | 41406 380 816 | T:aesref | clang -march=native -Os -fwrapv -Qunused-arguments -fPIC -fPIE -gdwarf-4 -Wall | 20241004 | 20240909 |
1011816 | 18372 0 0 | 36450 364 816 | T:gladman | gcc -march=native -mtune=native -O -fwrapv -fPIC -fPIE -gdwarf-4 -Wall | 20241004 | 20240909 |
1036047 | 17784 0 0 | 41466 392 816 | T:gladman | clang -march=native -O -fwrapv -Qunused-arguments -fPIC -fPIE -gdwarf-4 -Wall | 20241004 | 20240909 |
1044705 | 19024 0 0 | 39968 384 824 | T:aesref | clang -mcpu=native -O3 -fwrapv -Qunused-arguments -fPIC -fPIE -gdwarf-4 -Wall | 20241004 | 20240909 |
1156382 | 17508 0 0 | 35582 352 816 | T:aesref | gcc -march=native -mtune=native -O -fwrapv -fPIC -fPIE -gdwarf-4 -Wall | 20241004 | 20240909 |
1217110 | 16560 0 0 | 33695 348 816 | T:aesref | gcc -march=native -mtune=native -Os -fwrapv -fPIC -fPIE -gdwarf-4 -Wall | 20241004 | 20240909 |
1258131 | 16800 0 0 | 40510 380 816 | T:aesref | clang -march=native -O -fwrapv -Qunused-arguments -fPIC -fPIE -gdwarf-4 -Wall | 20241004 | 20240909 |
Compiler output
cpfbkey.c: In file included from cpfbkey.c:15:
cpfbkey.c: In file included from /usr/lib/llvm-11/lib/clang/11.0.1/include/wmmintrin.h:13:
cpfbkey.c: In file included from /usr/lib/llvm-11/lib/clang/11.0.1/include/emmintrin.h:13:
cpfbkey.c: In file included from /usr/lib/llvm-11/lib/clang/11.0.1/include/xmmintrin.h:13:
cpfbkey.c: /usr/lib/llvm-11/lib/clang/11.0.1/include/mmintrin.h:50:12: error: invalid conversion between vector type '__m64' (vector of 1 'long long' value) and integer type 'int' of different size
cpfbkey.c: return (__m64)__builtin_ia32_vec_init_v2si(__i, 0);
cpfbkey.c: ^~~~~~~~~~~~~~~~~~~~~~~~~~~~~~~~~~~~~~~~~~~
cpfbkey.c: /usr/lib/llvm-11/lib/clang/11.0.1/include/mmintrin.h:129:12: error: invalid conversion between vector type '__m64' (vector of 1 'long long' value) and integer type 'int' of different size
cpfbkey.c: return (__m64)__builtin_ia32_packsswb((__v4hi)__m1, (__v4hi)__m2);
cpfbkey.c: ^~~~~~~~~~~~~~~~~~~~~~~~~~~~~~~~~~~~~~~~~~~~~~~~~~~~~~~~~~
cpfbkey.c: /usr/lib/llvm-11/lib/clang/11.0.1/include/mmintrin.h:159:12: error: invalid conversion between vector type '__m64' (vector of 1 'long long' value) and integer type 'int' of different size
cpfbkey.c: return (__m64)__builtin_ia32_packssdw((__v2si)__m1, (__v2si)__m2);
cpfbkey.c: ^~~~~~~~~~~~~~~~~~~~~~~~~~~~~~~~~~~~~~~~~~~~~~~~~~~~~~~~~~
cpfbkey.c: /usr/lib/llvm-11/lib/clang/11.0.1/include/mmintrin.h:189:12: error: invalid conversion between vector type '__m64' (vector of 1 'long long' value) and integer type 'int' of different size
cpfbkey.c: return (__m64)__builtin_ia32_packuswb((__v4hi)__m1, (__v4hi)__m2);
cpfbkey.c: ^~~~~~~~~~~~~~~~~~~~~~~~~~~~~~~~~~~~~~~~~~~~~~~~~~~~~~~~~~
cpfbkey.c: /usr/lib/llvm-11/lib/clang/11.0.1/include/mmintrin.h:216:12: error: invalid conversion between vector type '__m64' (vector of 1 'long long' value) and integer type 'int' of different size
cpfbkey.c: return (__m64)__builtin_ia32_punpckhbw((__v8qi)__m1, (__v8qi)__m2);
cpfbkey.c: ^~~~~~~~~~~~~~~~~~~~~~~~~~~~~~~~~~~~~~~~~~~~~~~~~~~~~~~~~~~
cpfbkey.c: /usr/lib/llvm-11/lib/clang/11.0.1/include/mmintrin.h:239:12: error: invalid conversion between vector type '__m64' (vector of 1 'long long' value) and integer type 'int' of different size
cpfbkey.c: return (__m64)__builtin_ia32_punpckhwd((__v4hi)__m1, (__v4hi)__m2);
cpfbkey.c: ^~~~~~~~~~~~~~~~~~~~~~~~~~~~~~~~~~~~~~~~~~~~~~~~~~~~~~~~~~~
cpfbkey.c: /usr/lib/llvm-11/lib/clang/11.0.1/include/mmintrin.h:260:12: error: invalid conversion between vector type '__m64' (vector of 1 'long long' value) and integer type 'int' of different size
cpfbkey.c: return (__m64)__builtin_ia32_punpckhdq((__v2si)__m1, (__v2si)__m2);
cpfbkey.c: ^~~~~~~~~~~~~~~~~~~~~~~~~~~~~~~~~~~~~~~~~~~~~~~~~~~~~~~~~~~
cpfbkey.c: ...
Number of similar (implementation,compiler) pairs: 5, namely:
Implementation | Compiler |
T:aesni | clang -march=native -O2 -fwrapv -Qunused-arguments -fPIC -fPIE -gdwarf-4 -Wall (Raspbian_Clang_11.0.1) |
T:aesni | clang -march=native -O3 -fwrapv -Qunused-arguments -fPIC -fPIE -gdwarf-4 -Wall (Raspbian_Clang_11.0.1) |
T:aesni | clang -march=native -O -fwrapv -Qunused-arguments -fPIC -fPIE -gdwarf-4 -Wall (Raspbian_Clang_11.0.1) |
T:aesni | clang -march=native -Os -fwrapv -Qunused-arguments -fPIC -fPIE -gdwarf-4 -Wall (Raspbian_Clang_11.0.1) |
T:aesni | clang -mcpu=native -O3 -fwrapv -Qunused-arguments -fPIC -fPIE -gdwarf-4 -Wall (Raspbian_Clang_11.0.1) |
Compiler output
cpfbkey.c: cpfbkey.c:15:10: fatal error: wmmintrin.h: No such file or directory
cpfbkey.c: 15 | #include <wmmintrin.h>
cpfbkey.c: | ^~~~~~~~~~~~~
cpfbkey.c: compilation terminated.
Number of similar (implementation,compiler) pairs: 4, namely:
Implementation | Compiler |
T:aesni | gcc -march=native -mtune=native -O2 -fwrapv -fPIC -fPIE -gdwarf-4 -Wall (10.2.1_20210110) |
T:aesni | gcc -march=native -mtune=native -O3 -fwrapv -fPIC -fPIE -gdwarf-4 -Wall (10.2.1_20210110) |
T:aesni | gcc -march=native -mtune=native -O -fwrapv -fPIC -fPIE -gdwarf-4 -Wall (10.2.1_20210110) |
T:aesni | gcc -march=native -mtune=native -Os -fwrapv -fPIC -fPIE -gdwarf-4 -Wall (10.2.1_20210110) |
Compiler output
encrypt.c: encrypt.c:170:89: error: array has incomplete element type 'EVP_CIPHER_CTX' (aka 'struct evp_cipher_ctx_st')
encrypt.c: static void gen_kappa(unsigned char* nonce, unsigned char* kappa, EVP_CIPHER_CTX ctx_key[1]){
encrypt.c: ^
encrypt.c: /usr/include/openssl/ossl_typ.h:90:16: note: forward declaration of 'struct evp_cipher_ctx_st'
encrypt.c: typedef struct evp_cipher_ctx_st EVP_CIPHER_CTX;
encrypt.c: ^
encrypt.c: encrypt.c:188:25: error: array has incomplete element type 'EVP_CIPHER_CTX' (aka 'struct evp_cipher_ctx_st')
encrypt.c: EVP_CIPHER_CTX ctx_k[1];
encrypt.c: ^
encrypt.c: /usr/include/openssl/ossl_typ.h:90:16: note: forward declaration of 'struct evp_cipher_ctx_st'
encrypt.c: typedef struct evp_cipher_ctx_st EVP_CIPHER_CTX;
encrypt.c: ^
encrypt.c: encrypt.c:189:31: error: array has incomplete element type 'EVP_CIPHER_CTX' (aka 'struct evp_cipher_ctx_st')
encrypt.c: EVP_CIPHER_CTX ctx_kappa_0[1];
encrypt.c: ^
encrypt.c: /usr/include/openssl/ossl_typ.h:90:16: note: forward declaration of 'struct evp_cipher_ctx_st'
encrypt.c: typedef struct evp_cipher_ctx_st EVP_CIPHER_CTX;
encrypt.c: ^
encrypt.c: encrypt.c:190:31: error: array has incomplete element type 'EVP_CIPHER_CTX' (aka 'struct evp_cipher_ctx_st')
encrypt.c: EVP_CIPHER_CTX ctx_kappa_m[1];
encrypt.c: ^
encrypt.c: /usr/include/openssl/ossl_typ.h:90:16: note: forward declaration of 'struct evp_cipher_ctx_st'
encrypt.c: typedef struct evp_cipher_ctx_st EVP_CIPHER_CTX;
encrypt.c: ^
encrypt.c: encrypt.c:330:25: error: array has incomplete element type 'EVP_CIPHER_CTX' (aka 'struct evp_cipher_ctx_st')
encrypt.c: ...
Number of similar (implementation,compiler) pairs: 5, namely:
Implementation | Compiler |
T:evp | clang -march=native -O2 -fwrapv -Qunused-arguments -fPIC -fPIE -gdwarf-4 -Wall (Raspbian_Clang_11.0.1) |
T:evp | clang -march=native -O3 -fwrapv -Qunused-arguments -fPIC -fPIE -gdwarf-4 -Wall (Raspbian_Clang_11.0.1) |
T:evp | clang -march=native -O -fwrapv -Qunused-arguments -fPIC -fPIE -gdwarf-4 -Wall (Raspbian_Clang_11.0.1) |
T:evp | clang -march=native -Os -fwrapv -Qunused-arguments -fPIC -fPIE -gdwarf-4 -Wall (Raspbian_Clang_11.0.1) |
T:evp | clang -mcpu=native -O3 -fwrapv -Qunused-arguments -fPIC -fPIE -gdwarf-4 -Wall (Raspbian_Clang_11.0.1) |
Compiler output
encrypt.c: encrypt.c:170:82: error: array type has incomplete element type 'EVP_CIPHER_CTX' {aka 'struct evp_cipher_ctx_st'}
encrypt.c: 170 | static void gen_kappa(unsigned char* nonce, unsigned char* kappa, EVP_CIPHER_CTX ctx_key[1]){
encrypt.c: | ^~~~~~~
encrypt.c: encrypt.c: In function 'crypto_aead_aes256cpfbv1_evp_timingleaks_encrypt':
encrypt.c: encrypt.c:188:20: error: array type has incomplete element type 'EVP_CIPHER_CTX' {aka 'struct evp_cipher_ctx_st'}
encrypt.c: 188 | EVP_CIPHER_CTX ctx_k[1];
encrypt.c: | ^~~~~
encrypt.c: encrypt.c:189:20: error: array type has incomplete element type 'EVP_CIPHER_CTX' {aka 'struct evp_cipher_ctx_st'}
encrypt.c: 189 | EVP_CIPHER_CTX ctx_kappa_0[1];
encrypt.c: | ^~~~~~~~~~~
encrypt.c: encrypt.c:190:20: error: array type has incomplete element type 'EVP_CIPHER_CTX' {aka 'struct evp_cipher_ctx_st'}
encrypt.c: 190 | EVP_CIPHER_CTX ctx_kappa_m[1];
encrypt.c: | ^~~~~~~~~~~
encrypt.c: encrypt.c:204:31: error: type of formal parameter 3 is incomplete
encrypt.c: 204 | gen_kappa(nonce, kappa_0, ctx_k);
encrypt.c: | ^~~~~
encrypt.c: encrypt.c:265:28: error: type of formal parameter 3 is incomplete
encrypt.c: 265 | gen_kappa(nonce, kappa_m, ctx_k);
encrypt.c: | ^~~~~
encrypt.c: encrypt.c:190:20: warning: unused variable 'ctx_kappa_m' [-Wunused-variable]
encrypt.c: 190 | EVP_CIPHER_CTX ctx_kappa_m[1];
encrypt.c: | ^~~~~~~~~~~
encrypt.c: encrypt.c:189:20: warning: unused variable 'ctx_kappa_0' [-Wunused-variable]
encrypt.c: 189 | EVP_CIPHER_CTX ctx_kappa_0[1];
encrypt.c: | ^~~~~~~~~~~
encrypt.c: ...
Number of similar (implementation,compiler) pairs: 4, namely:
Implementation | Compiler |
T:evp | gcc -march=native -mtune=native -O2 -fwrapv -fPIC -fPIE -gdwarf-4 -Wall (10.2.1_20210110) |
T:evp | gcc -march=native -mtune=native -O3 -fwrapv -fPIC -fPIE -gdwarf-4 -Wall (10.2.1_20210110) |
T:evp | gcc -march=native -mtune=native -O -fwrapv -fPIC -fPIE -gdwarf-4 -Wall (10.2.1_20210110) |
T:evp | gcc -march=native -mtune=native -Os -fwrapv -fPIC -fPIE -gdwarf-4 -Wall (10.2.1_20210110) |
Namespace violations
encrypt.o N 0
encrypt.o N 100
encrypt.o N 104
encrypt.o N 112
encrypt.o N 115
encrypt.o N 129
encrypt.o N 12d
encrypt.o N 144
encrypt.o N 14f
encrypt.o N 158
encrypt.o N 15d
encrypt.o N 162
encrypt.o N 167
encrypt.o N 16f
encrypt.o N 177
encrypt.o N 17c
encrypt.o N 187
encrypt.o N 190
encrypt.o N 198
encrypt.o N 19c
encrypt.o N 1a2
encrypt.o N 1ad
encrypt.o N 1af
encrypt.o N 1b3
encrypt.o N 1bd
encrypt.o N 1c3
encrypt.o N 1ca
encrypt.o N 1d2
encrypt.o N 1d4
encrypt.o N 1d6
encrypt.o N 1de
encrypt.o N 1e6
encrypt.o N 1e8
encrypt.o N 1ea
encrypt.o N 1ed
encrypt.o N 1f0
encrypt.o N 1f3
encrypt.o N 1fd
encrypt.o N 20c
encrypt.o N 220
encrypt.o N 230
encrypt.o N 23b
encrypt.o N 23f
encrypt.o N 25
encrypt.o N 273
encrypt.o N 2a7
encrypt.o N 2af
encrypt.o N 2b1
encrypt.o N 2b3
encrypt.o N 2ba
encrypt.o N 2bc
encrypt.o N 2c1
encrypt.o N 2c3
encrypt.o N 2c5
encrypt.o N 2ca
encrypt.o N 2d0
encrypt.o N 2d3
encrypt.o N 2d8
encrypt.o N 2e0
encrypt.o N 2e9
encrypt.o N 2f
encrypt.o N f3
rijndael-alg-fst.o N 0
rijndael-alg-fst.o N 100
rijndael-alg-fst.o N 10d
rijndael-alg-fst.o N 111
rijndael-alg-fst.o N 125
rijndael-alg-fst.o N 12a
rijndael-alg-fst.o N 12e
rijndael-alg-fst.o N 132
rijndael-alg-fst.o N 136
rijndael-alg-fst.o N 13a
rijndael-alg-fst.o N 13e
rijndael-alg-fst.o N 142
rijndael-alg-fst.o N 146
rijndael-alg-fst.o N 14a
rijndael-alg-fst.o N 14e
rijndael-alg-fst.o N 15c
rijndael-alg-fst.o N 15f
rijndael-alg-fst.o N 173
rijndael-alg-fst.o N 177
rijndael-alg-fst.o N 18b
rijndael-alg-fst.o N 19b
rijndael-alg-fst.o N 1ab
rijndael-alg-fst.o N 1ae
rijndael-alg-fst.o N 1b8
rijndael-alg-fst.o N 1c0
rijndael-alg-fst.o N 1c2
rijndael-alg-fst.o N 1c7
rijndael-alg-fst.o N 1ca
rijndael-alg-fst.o N 1cc
rijndael-alg-fst.o N 1cf
rijndael-alg-fst.o N 1d2
rijndael-alg-fst.o N 1d5
rijndael-alg-fst.o N 1d7
rijndael-alg-fst.o N 1da
rijndael-alg-fst.o N 1dd
rijndael-alg-fst.o N 1e0
rijndael-alg-fst.o N 1e3
rijndael-alg-fst.o N 1e6
rijndael-alg-fst.o N 1e9
rijndael-alg-fst.o N 25
rijndael-alg-fst.o N 38
rijndael-alg-fst.o N fc
rijndael-alg-fst.o rijndaelDecrypt T
rijndael-alg-fst.o rijndaelEncrypt T
rijndael-alg-fst.o rijndaelKeySetupDec T
rijndael-alg-fst.o rijndaelKeySetupEnc T
Number of similar (implementation,compiler) pairs: 3, namely:
Implementation | Compiler |
T:aesref | clang -march=native -O2 -fwrapv -Qunused-arguments -fPIC -fPIE -gdwarf-4 -Wall (Raspbian_Clang_11.0.1) |
T:aesref | clang -march=native -O3 -fwrapv -Qunused-arguments -fPIC -fPIE -gdwarf-4 -Wall (Raspbian_Clang_11.0.1) |
T:aesref | clang -march=native -Os -fwrapv -Qunused-arguments -fPIC -fPIE -gdwarf-4 -Wall (Raspbian_Clang_11.0.1) |
Namespace violations
encrypt.o N 0
encrypt.o N 103
encrypt.o N 111
encrypt.o N 114
encrypt.o N 128
encrypt.o N 12c
encrypt.o N 143
encrypt.o N 14e
encrypt.o N 157
encrypt.o N 15c
encrypt.o N 16c
encrypt.o N 170
encrypt.o N 184
encrypt.o N 1b8
encrypt.o N 1bd
encrypt.o N 1c5
encrypt.o N 1cd
encrypt.o N 1d5
encrypt.o N 1e4
encrypt.o N 218
encrypt.o N 223
encrypt.o N 22e
encrypt.o N 238
encrypt.o N 242
encrypt.o N 246
encrypt.o N 24b
encrypt.o N 25
encrypt.o N 256
encrypt.o N 25f
encrypt.o N 267
encrypt.o N 26f
encrypt.o N 277
encrypt.o N 27d
encrypt.o N 27f
encrypt.o N 281
encrypt.o N 288
encrypt.o N 28a
encrypt.o N 28f
encrypt.o N 291
encrypt.o N 293
encrypt.o N 298
encrypt.o N 29d
encrypt.o N 2a3
encrypt.o N 2a6
encrypt.o N 2ab
encrypt.o N 2b3
encrypt.o N 2bc
encrypt.o N 2be
encrypt.o N 2c6
encrypt.o N 2c8
encrypt.o N 2ca
encrypt.o N 2cc
encrypt.o N 2ce
encrypt.o N 2d1
encrypt.o N 2d4
encrypt.o N 2d7
encrypt.o N 2dd
encrypt.o N 2e8
encrypt.o N 2ec
encrypt.o N 2f
encrypt.o N f2
encrypt.o N ff
rijndael-alg-fst.o N 0
rijndael-alg-fst.o N 10c
rijndael-alg-fst.o N 110
rijndael-alg-fst.o N 124
rijndael-alg-fst.o N 129
rijndael-alg-fst.o N 12d
rijndael-alg-fst.o N 131
rijndael-alg-fst.o N 135
rijndael-alg-fst.o N 139
rijndael-alg-fst.o N 13d
rijndael-alg-fst.o N 141
rijndael-alg-fst.o N 145
rijndael-alg-fst.o N 149
rijndael-alg-fst.o N 14d
rijndael-alg-fst.o N 15b
rijndael-alg-fst.o N 15e
rijndael-alg-fst.o N 172
rijndael-alg-fst.o N 176
rijndael-alg-fst.o N 18a
rijndael-alg-fst.o N 19a
rijndael-alg-fst.o N 1aa
rijndael-alg-fst.o N 1ad
rijndael-alg-fst.o N 1b7
rijndael-alg-fst.o N 1bf
rijndael-alg-fst.o N 1c1
rijndael-alg-fst.o N 1c6
rijndael-alg-fst.o N 1c9
rijndael-alg-fst.o N 1cb
rijndael-alg-fst.o N 1ce
rijndael-alg-fst.o N 1d1
rijndael-alg-fst.o N 1d4
rijndael-alg-fst.o N 1d7
rijndael-alg-fst.o N 1da
rijndael-alg-fst.o N 1dc
rijndael-alg-fst.o N 1df
rijndael-alg-fst.o N 1e2
rijndael-alg-fst.o N 1e5
rijndael-alg-fst.o N 1e8
rijndael-alg-fst.o N 25
rijndael-alg-fst.o N 38
rijndael-alg-fst.o N fb
rijndael-alg-fst.o N ff
rijndael-alg-fst.o rijndaelDecrypt T
rijndael-alg-fst.o rijndaelEncrypt T
rijndael-alg-fst.o rijndaelKeySetupDec T
rijndael-alg-fst.o rijndaelKeySetupEnc T
Number of similar (implementation,compiler) pairs: 1, namely:
Implementation | Compiler |
T:aesref | clang -march=native -O -fwrapv -Qunused-arguments -fPIC -fPIE -gdwarf-4 -Wall (Raspbian_Clang_11.0.1) |
Namespace violations
encrypt.o N 0
encrypt.o N 103
encrypt.o N 111
encrypt.o N 114
encrypt.o N 128
encrypt.o N 12c
encrypt.o N 143
encrypt.o N 14e
encrypt.o N 157
encrypt.o N 15c
encrypt.o N 161
encrypt.o N 166
encrypt.o N 16e
encrypt.o N 176
encrypt.o N 17b
encrypt.o N 186
encrypt.o N 18f
encrypt.o N 197
encrypt.o N 19b
encrypt.o N 1a1
encrypt.o N 1ac
encrypt.o N 1ae
encrypt.o N 1b2
encrypt.o N 1bc
encrypt.o N 1c2
encrypt.o N 1c9
encrypt.o N 1d1
encrypt.o N 1d3
encrypt.o N 1d5
encrypt.o N 1dd
encrypt.o N 1e5
encrypt.o N 1e7
encrypt.o N 1e9
encrypt.o N 1ec
encrypt.o N 1ef
encrypt.o N 1f2
encrypt.o N 1fc
encrypt.o N 20b
encrypt.o N 21f
encrypt.o N 22f
encrypt.o N 23a
encrypt.o N 23e
encrypt.o N 25
encrypt.o N 272
encrypt.o N 2a6
encrypt.o N 2ae
encrypt.o N 2b0
encrypt.o N 2b2
encrypt.o N 2b9
encrypt.o N 2bb
encrypt.o N 2c0
encrypt.o N 2c2
encrypt.o N 2c4
encrypt.o N 2c9
encrypt.o N 2cf
encrypt.o N 2d2
encrypt.o N 2d7
encrypt.o N 2df
encrypt.o N 2e8
encrypt.o N 2f
encrypt.o N f2
encrypt.o N ff
rijndael-alg-fst.o N 0
rijndael-alg-fst.o N 10c
rijndael-alg-fst.o N 110
rijndael-alg-fst.o N 124
rijndael-alg-fst.o N 129
rijndael-alg-fst.o N 12d
rijndael-alg-fst.o N 131
rijndael-alg-fst.o N 135
rijndael-alg-fst.o N 139
rijndael-alg-fst.o N 13d
rijndael-alg-fst.o N 141
rijndael-alg-fst.o N 145
rijndael-alg-fst.o N 149
rijndael-alg-fst.o N 14d
rijndael-alg-fst.o N 15b
rijndael-alg-fst.o N 15e
rijndael-alg-fst.o N 172
rijndael-alg-fst.o N 176
rijndael-alg-fst.o N 18a
rijndael-alg-fst.o N 19a
rijndael-alg-fst.o N 1aa
rijndael-alg-fst.o N 1ad
rijndael-alg-fst.o N 1b7
rijndael-alg-fst.o N 1bf
rijndael-alg-fst.o N 1c1
rijndael-alg-fst.o N 1c6
rijndael-alg-fst.o N 1c9
rijndael-alg-fst.o N 1cb
rijndael-alg-fst.o N 1ce
rijndael-alg-fst.o N 1d1
rijndael-alg-fst.o N 1d4
rijndael-alg-fst.o N 1d6
rijndael-alg-fst.o N 1d9
rijndael-alg-fst.o N 1dc
rijndael-alg-fst.o N 1df
rijndael-alg-fst.o N 1e2
rijndael-alg-fst.o N 1e5
rijndael-alg-fst.o N 1e8
rijndael-alg-fst.o N 25
rijndael-alg-fst.o N 38
rijndael-alg-fst.o N fb
rijndael-alg-fst.o N ff
rijndael-alg-fst.o rijndaelDecrypt T
rijndael-alg-fst.o rijndaelEncrypt T
rijndael-alg-fst.o rijndaelKeySetupDec T
rijndael-alg-fst.o rijndaelKeySetupEnc T
Number of similar (implementation,compiler) pairs: 1, namely:
Implementation | Compiler |
T:aesref | clang -mcpu=native -O3 -fwrapv -Qunused-arguments -fPIC -fPIE -gdwarf-4 -Wall (Raspbian_Clang_11.0.1) |
Namespace violations
rijndael-alg-fst.o rijndaelDecrypt T
rijndael-alg-fst.o rijndaelEncrypt T
rijndael-alg-fst.o rijndaelKeySetupDec T
rijndael-alg-fst.o rijndaelKeySetupEnc T
Number of similar (implementation,compiler) pairs: 4, namely:
Implementation | Compiler |
T:aesref | gcc -march=native -mtune=native -O2 -fwrapv -fPIC -fPIE -gdwarf-4 -Wall (10.2.1_20210110) |
T:aesref | gcc -march=native -mtune=native -O3 -fwrapv -fPIC -fPIE -gdwarf-4 -Wall (10.2.1_20210110) |
T:aesref | gcc -march=native -mtune=native -O -fwrapv -fPIC -fPIE -gdwarf-4 -Wall (10.2.1_20210110) |
T:aesref | gcc -march=native -mtune=native -Os -fwrapv -fPIC -fPIE -gdwarf-4 -Wall (10.2.1_20210110) |
Namespace violations
aescrypt.o N 0
aescrypt.o N 102
aescrypt.o N 10b
aescrypt.o N 119
aescrypt.o N 121
aescrypt.o N 12d
aescrypt.o N 131
aescrypt.o N 134
aescrypt.o N 138
aescrypt.o N 13b
aescrypt.o N 13e
aescrypt.o N 152
aescrypt.o N 156
aescrypt.o N 158
aescrypt.o N 15a
aescrypt.o N 162
aescrypt.o N 172
aescrypt.o N 175
aescrypt.o N 178
aescrypt.o N 25
aescrypt.o N 30
aescrypt.o N f5
aescrypt.o aes_encrypt T
aeskey.o N 0
aeskey.o N 100
aeskey.o N 109
aeskey.o N 117
aeskey.o N 11f
aeskey.o N 132
aeskey.o N 136
aeskey.o N 149
aeskey.o N 14d
aeskey.o N 150
aeskey.o N 153
aeskey.o N 167
aeskey.o N 16b
aeskey.o N 16d
aeskey.o N 16f
aeskey.o N 177
aeskey.o N 187
aeskey.o N 25
aeskey.o N 2e
aeskey.o N f3
aeskey.o aes_encrypt_key128 T
aeskey.o aes_encrypt_key256 T
aestab.o N 0
aestab.o N 105
aestab.o N 10e
aestab.o N 122
aestab.o N 127
aestab.o N 12c
aestab.o N 135
aestab.o N 25
aestab.o N 2e
aestab.o N f3
aestab.o N f8
aestab.o aes_init T
aestab.o t_fl R
aestab.o t_fn R
aestab.o t_rc R
encrypt.o N 0
encrypt.o N 101
encrypt.o N 10c
encrypt.o N 115
encrypt.o N 118
encrypt.o N 126
encrypt.o N 13a
encrypt.o N 13e
encrypt.o N 146
encrypt.o N 14a
encrypt.o N 161
encrypt.o N 16c
encrypt.o N 175
encrypt.o N 180
encrypt.o N 185
encrypt.o N 18a
encrypt.o N 192
encrypt.o N 19a
encrypt.o N 19d
encrypt.o N 1a6
encrypt.o N 1aa
encrypt.o N 1ac
encrypt.o N 1ae
encrypt.o N 1b6
encrypt.o N 1be
encrypt.o N 1ce
encrypt.o N 1d2
encrypt.o N 1d8
encrypt.o N 1e3
encrypt.o N 1e5
encrypt.o N 1e9
encrypt.o N 1f3
encrypt.o N 1f9
encrypt.o N 200
encrypt.o N 208
encrypt.o N 20a
encrypt.o N 20c
encrypt.o N 217
encrypt.o N 21d
encrypt.o N 225
encrypt.o N 227
encrypt.o N 233
encrypt.o N 239
encrypt.o N 24a
encrypt.o N 24e
encrypt.o N 25
encrypt.o N 258
encrypt.o N 267
encrypt.o N 274
encrypt.o N 276
encrypt.o N 288
encrypt.o N 29b
encrypt.o N 2a7
encrypt.o N 2b2
encrypt.o N 2b6
encrypt.o N 2eb
encrypt.o N 2f
encrypt.o N 320
encrypt.o N 328
encrypt.o N 32a
encrypt.o N 32c
encrypt.o N 333
encrypt.o N 338
encrypt.o N 33a
encrypt.o N 33c
encrypt.o N 341
encrypt.o N 347
encrypt.o N 34a
encrypt.o N 34f
encrypt.o N f4
Number of similar (implementation,compiler) pairs: 3, namely:
Implementation | Compiler |
T:gladman | clang -march=native -O2 -fwrapv -Qunused-arguments -fPIC -fPIE -gdwarf-4 -Wall (Raspbian_Clang_11.0.1) |
T:gladman | clang -march=native -O3 -fwrapv -Qunused-arguments -fPIC -fPIE -gdwarf-4 -Wall (Raspbian_Clang_11.0.1) |
T:gladman | clang -march=native -Os -fwrapv -Qunused-arguments -fPIC -fPIE -gdwarf-4 -Wall (Raspbian_Clang_11.0.1) |
Namespace violations
aescrypt.o N 0
aescrypt.o N 101
aescrypt.o N 10a
aescrypt.o N 118
aescrypt.o N 120
aescrypt.o N 12c
aescrypt.o N 130
aescrypt.o N 133
aescrypt.o N 137
aescrypt.o N 13a
aescrypt.o N 13d
aescrypt.o N 151
aescrypt.o N 155
aescrypt.o N 157
aescrypt.o N 159
aescrypt.o N 161
aescrypt.o N 171
aescrypt.o N 174
aescrypt.o N 177
aescrypt.o N 25
aescrypt.o N 30
aescrypt.o N f4
aescrypt.o aes_encrypt T
aeskey.o N 0
aeskey.o N 108
aeskey.o N 116
aeskey.o N 11e
aeskey.o N 131
aeskey.o N 135
aeskey.o N 148
aeskey.o N 14c
aeskey.o N 14f
aeskey.o N 152
aeskey.o N 166
aeskey.o N 16a
aeskey.o N 16c
aeskey.o N 16e
aeskey.o N 176
aeskey.o N 186
aeskey.o N 25
aeskey.o N 2e
aeskey.o N f2
aeskey.o N ff
aeskey.o aes_encrypt_key128 T
aeskey.o aes_encrypt_key256 T
aestab.o N 0
aestab.o N 104
aestab.o N 10d
aestab.o N 121
aestab.o N 126
aestab.o N 12b
aestab.o N 134
aestab.o N 25
aestab.o N 2e
aestab.o N f2
aestab.o N f7
aestab.o aes_init T
aestab.o t_fl R
aestab.o t_fn R
aestab.o t_rc R
encrypt.o N 0
encrypt.o N 100
encrypt.o N 10b
encrypt.o N 114
encrypt.o N 117
encrypt.o N 125
encrypt.o N 139
encrypt.o N 13d
encrypt.o N 145
encrypt.o N 149
encrypt.o N 160
encrypt.o N 16b
encrypt.o N 174
encrypt.o N 17f
encrypt.o N 18b
encrypt.o N 18f
encrypt.o N 192
encrypt.o N 19b
encrypt.o N 19f
encrypt.o N 1a1
encrypt.o N 1a3
encrypt.o N 1ab
encrypt.o N 1b3
encrypt.o N 1c6
encrypt.o N 1fb
encrypt.o N 200
encrypt.o N 208
encrypt.o N 213
encrypt.o N 21f
encrypt.o N 227
encrypt.o N 238
encrypt.o N 247
encrypt.o N 25
encrypt.o N 254
encrypt.o N 266
encrypt.o N 29b
encrypt.o N 2a6
encrypt.o N 2b1
encrypt.o N 2bb
encrypt.o N 2c5
encrypt.o N 2c9
encrypt.o N 2d9
encrypt.o N 2e1
encrypt.o N 2e9
encrypt.o N 2ef
encrypt.o N 2f
encrypt.o N 2f1
encrypt.o N 2f3
encrypt.o N 2fa
encrypt.o N 2fc
encrypt.o N 301
encrypt.o N 303
encrypt.o N 305
encrypt.o N 30a
encrypt.o N 30f
encrypt.o N 315
encrypt.o N 318
encrypt.o N 31d
encrypt.o N 31f
encrypt.o N 327
encrypt.o N 329
encrypt.o N 32b
encrypt.o N 331
encrypt.o N 337
encrypt.o N 339
encrypt.o N 33d
encrypt.o N 343
encrypt.o N 34e
encrypt.o N 352
encrypt.o N f3
Number of similar (implementation,compiler) pairs: 1, namely:
Implementation | Compiler |
T:gladman | clang -march=native -O -fwrapv -Qunused-arguments -fPIC -fPIE -gdwarf-4 -Wall (Raspbian_Clang_11.0.1) |
Namespace violations
aescrypt.o N 0
aescrypt.o N 101
aescrypt.o N 10a
aescrypt.o N 118
aescrypt.o N 120
aescrypt.o N 12c
aescrypt.o N 130
aescrypt.o N 133
aescrypt.o N 137
aescrypt.o N 13a
aescrypt.o N 13d
aescrypt.o N 151
aescrypt.o N 155
aescrypt.o N 157
aescrypt.o N 159
aescrypt.o N 161
aescrypt.o N 171
aescrypt.o N 174
aescrypt.o N 177
aescrypt.o N 25
aescrypt.o N 30
aescrypt.o N f4
aescrypt.o aes_encrypt T
aeskey.o N 0
aeskey.o N 108
aeskey.o N 116
aeskey.o N 11e
aeskey.o N 131
aeskey.o N 135
aeskey.o N 148
aeskey.o N 14c
aeskey.o N 14f
aeskey.o N 152
aeskey.o N 166
aeskey.o N 16a
aeskey.o N 16c
aeskey.o N 16e
aeskey.o N 176
aeskey.o N 186
aeskey.o N 25
aeskey.o N 2e
aeskey.o N f2
aeskey.o N ff
aeskey.o aes_encrypt_key128 T
aeskey.o aes_encrypt_key256 T
aestab.o N 0
aestab.o N 104
aestab.o N 10d
aestab.o N 121
aestab.o N 126
aestab.o N 12b
aestab.o N 134
aestab.o N 25
aestab.o N 2e
aestab.o N f2
aestab.o N f7
aestab.o aes_init T
aestab.o t_fl R
aestab.o t_fn R
aestab.o t_rc R
encrypt.o N 0
encrypt.o N 100
encrypt.o N 10b
encrypt.o N 114
encrypt.o N 117
encrypt.o N 125
encrypt.o N 139
encrypt.o N 13d
encrypt.o N 145
encrypt.o N 149
encrypt.o N 160
encrypt.o N 16b
encrypt.o N 174
encrypt.o N 17f
encrypt.o N 184
encrypt.o N 189
encrypt.o N 191
encrypt.o N 199
encrypt.o N 19c
encrypt.o N 1a5
encrypt.o N 1a9
encrypt.o N 1ab
encrypt.o N 1ad
encrypt.o N 1b5
encrypt.o N 1bd
encrypt.o N 1cd
encrypt.o N 1d1
encrypt.o N 1d7
encrypt.o N 1e2
encrypt.o N 1e4
encrypt.o N 1e8
encrypt.o N 1f2
encrypt.o N 1f8
encrypt.o N 1ff
encrypt.o N 207
encrypt.o N 209
encrypt.o N 20b
encrypt.o N 216
encrypt.o N 21c
encrypt.o N 224
encrypt.o N 226
encrypt.o N 232
encrypt.o N 238
encrypt.o N 249
encrypt.o N 24d
encrypt.o N 25
encrypt.o N 257
encrypt.o N 266
encrypt.o N 273
encrypt.o N 275
encrypt.o N 287
encrypt.o N 29a
encrypt.o N 2a6
encrypt.o N 2b1
encrypt.o N 2b5
encrypt.o N 2ea
encrypt.o N 2f
encrypt.o N 31f
encrypt.o N 327
encrypt.o N 329
encrypt.o N 32b
encrypt.o N 332
encrypt.o N 337
encrypt.o N 339
encrypt.o N 33b
encrypt.o N 340
encrypt.o N 346
encrypt.o N 349
encrypt.o N 34e
encrypt.o N f3
Number of similar (implementation,compiler) pairs: 1, namely:
Implementation | Compiler |
T:gladman | clang -mcpu=native -O3 -fwrapv -Qunused-arguments -fPIC -fPIE -gdwarf-4 -Wall (Raspbian_Clang_11.0.1) |
Namespace violations
aescrypt.o aes_encrypt T
aeskey.o aes_encrypt_key128 T
aeskey.o aes_encrypt_key256 T
aestab.o aes_init T
aestab.o t_fl R
aestab.o t_fn R
aestab.o t_rc R
Number of similar (implementation,compiler) pairs: 4, namely:
Implementation | Compiler |
T:gladman | gcc -march=native -mtune=native -O2 -fwrapv -fPIC -fPIE -gdwarf-4 -Wall (10.2.1_20210110) |
T:gladman | gcc -march=native -mtune=native -O3 -fwrapv -fPIC -fPIE -gdwarf-4 -Wall (10.2.1_20210110) |
T:gladman | gcc -march=native -mtune=native -O -fwrapv -fPIC -fPIE -gdwarf-4 -Wall (10.2.1_20210110) |
T:gladman | gcc -march=native -mtune=native -Os -fwrapv -fPIC -fPIE -gdwarf-4 -Wall (10.2.1_20210110) |
Namespace violations
encrypt.o N 0
encrypt.o N 109
encrypt.o N 10f
encrypt.o N 114
encrypt.o N 116
encrypt.o N 11a
encrypt.o N 124
encrypt.o N 12a
encrypt.o N 12e
encrypt.o N 136
encrypt.o N 138
encrypt.o N 13a
encrypt.o N 151
encrypt.o N 159
encrypt.o N 160
encrypt.o N 162
encrypt.o N 164
encrypt.o N 16e
encrypt.o N 19c
encrypt.o N 1a7
encrypt.o N 1ab
encrypt.o N 1dc
encrypt.o N 20d
encrypt.o N 215
encrypt.o N 229
encrypt.o N 231
encrypt.o N 233
encrypt.o N 235
encrypt.o N 23c
encrypt.o N 23e
encrypt.o N 243
encrypt.o N 245
encrypt.o N 247
encrypt.o N 24c
encrypt.o N 25
encrypt.o N 252
encrypt.o N 255
encrypt.o N 25a
encrypt.o N 262
encrypt.o N 26f
encrypt.o N 27a
encrypt.o N 283
encrypt.o N 28c
encrypt.o N 2f
encrypt.o N f0
encrypt.o N fe
Number of similar (implementation,compiler) pairs: 3, namely:
Implementation | Compiler |
T:ref | clang -march=native -O2 -fwrapv -Qunused-arguments -fPIC -fPIE -gdwarf-4 -Wall (Raspbian_Clang_11.0.1) |
T:ref | clang -march=native -O3 -fwrapv -Qunused-arguments -fPIC -fPIE -gdwarf-4 -Wall (Raspbian_Clang_11.0.1) |
T:ref | clang -march=native -Os -fwrapv -Qunused-arguments -fPIC -fPIE -gdwarf-4 -Wall (Raspbian_Clang_11.0.1) |
Namespace violations
encrypt.o N 0
encrypt.o N 12b
encrypt.o N 12f
encrypt.o N 160
encrypt.o N 16b
encrypt.o N 175
encrypt.o N 17d
encrypt.o N 185
encrypt.o N 18c
encrypt.o N 196
encrypt.o N 1c7
encrypt.o N 1d2
encrypt.o N 1da
encrypt.o N 1ee
encrypt.o N 1f6
encrypt.o N 1fc
encrypt.o N 1fe
encrypt.o N 200
encrypt.o N 207
encrypt.o N 209
encrypt.o N 20e
encrypt.o N 225
encrypt.o N 227
encrypt.o N 229
encrypt.o N 22e
encrypt.o N 233
encrypt.o N 239
encrypt.o N 23c
encrypt.o N 241
encrypt.o N 249
encrypt.o N 25
encrypt.o N 256
encrypt.o N 261
encrypt.o N 26a
encrypt.o N 273
encrypt.o N 275
encrypt.o N 27b
encrypt.o N 27f
encrypt.o N 281
encrypt.o N 283
encrypt.o N 285
encrypt.o N 287
encrypt.o N 292
encrypt.o N 2f
encrypt.o N ef
encrypt.o N fd
Number of similar (implementation,compiler) pairs: 1, namely:
Implementation | Compiler |
T:ref | clang -march=native -O -fwrapv -Qunused-arguments -fPIC -fPIE -gdwarf-4 -Wall (Raspbian_Clang_11.0.1) |
Namespace violations
encrypt.o N 0
encrypt.o N 108
encrypt.o N 10e
encrypt.o N 113
encrypt.o N 115
encrypt.o N 119
encrypt.o N 123
encrypt.o N 129
encrypt.o N 12d
encrypt.o N 135
encrypt.o N 137
encrypt.o N 139
encrypt.o N 150
encrypt.o N 158
encrypt.o N 15f
encrypt.o N 161
encrypt.o N 163
encrypt.o N 16d
encrypt.o N 19b
encrypt.o N 1a6
encrypt.o N 1aa
encrypt.o N 1db
encrypt.o N 20c
encrypt.o N 214
encrypt.o N 228
encrypt.o N 230
encrypt.o N 232
encrypt.o N 234
encrypt.o N 23b
encrypt.o N 23d
encrypt.o N 242
encrypt.o N 244
encrypt.o N 246
encrypt.o N 24b
encrypt.o N 25
encrypt.o N 251
encrypt.o N 254
encrypt.o N 259
encrypt.o N 261
encrypt.o N 26e
encrypt.o N 279
encrypt.o N 282
encrypt.o N 28b
encrypt.o N 2f
encrypt.o N ef
encrypt.o N fd
Number of similar (implementation,compiler) pairs: 1, namely:
Implementation | Compiler |
T:ref | clang -mcpu=native -O3 -fwrapv -Qunused-arguments -fPIC -fPIE -gdwarf-4 -Wall (Raspbian_Clang_11.0.1) |