Implementation notes: armeabi, artik, crypto_sign/sphincsf128harakarobust

Computer: artik
Architecture: armeabi
CPU ID: unknown CPU ID
SUPERCOP version: 20191221
Operation: crypto_sign
Primitive: sphincsf128harakarobust
TimeObject sizeTest sizeImplementationCompilerBenchmark dateSUPERCOP version
274374135518708 0 128038221 456 2936refclang_-mcpu=native_-O3_-fomit-frame-pointer_-fwrapv_-Qunused-arguments_-fPIC_-fPIE2020011220191221
287135600618796 0 128038301 456 2936refclang_-march=native_-O3_-fomit-frame-pointer_-fwrapv_-Qunused-arguments_-fPIC_-fPIE2020011220191221
287519698818796 0 128037293 456 2904refclang_-march=native_-O2_-fomit-frame-pointer_-fwrapv_-Qunused-arguments_-fPIC_-fPIE2020011220191221
287650269318796 0 128037293 456 2904refclang_-march=native_-O_-fomit-frame-pointer_-fwrapv_-Qunused-arguments_-fPIC_-fPIE2020011220191221
293910250815748 0 128033131 452 2904refclang_-march=native_-Os_-fomit-frame-pointer_-fwrapv_-Qunused-arguments_-fPIC_-fPIE2020011220191221
482904067214696 0 128029549 440 2904refgcc_-march=native_-mtune=native_-O2_-fomit-frame-pointer_-fwrapv_-fPIC_-fPIE2020011220191221
491025134512658 0 128026945 432 2904refgcc_-march=native_-mtune=native_-Os_-fomit-frame-pointer_-fwrapv_-fPIC_-fPIE2020011220191221
507871699613796 0 128028549 440 2904refgcc_-march=native_-mtune=native_-O_-fomit-frame-pointer_-fwrapv_-fPIC_-fPIE2020011220191221
526532692426020 0 128042973 440 2904refgcc_-march=native_-mtune=native_-O3_-fomit-frame-pointer_-fwrapv_-fPIC_-fPIE2020011220191221

Compiler output

Implementation: aesni
Security model: unknown
Compiler: clang -march=native -O2 -fomit-frame-pointer -fwrapv -Qunused-arguments -fPIC -fPIE
haraka.c: In file included from haraka.c:11:
haraka.c: In file included from /usr/lib/llvm-3.8/bin/../lib/clang/3.8.0/include/immintrin.h:27:
haraka.c: /usr/lib/llvm-3.8/bin/../lib/clang/3.8.0/include/mmintrin.h:45:12: error: invalid conversion between vector type '__m64' (vector of 1 'long long' value) and integer type 'int' of different size
haraka.c: return (__m64)__builtin_ia32_vec_init_v2si(__i, 0);
haraka.c: ^~~~~~~~~~~~~~~~~~~~~~~~~~~~~~~~~~~~~~~~~~~
haraka.c: /usr/lib/llvm-3.8/bin/../lib/clang/3.8.0/include/mmintrin.h:69:12: error: invalid conversion between vector type '__m64' (vector of 1 'long long' value) and integer type 'int' of different size
haraka.c: return (__m64)__builtin_ia32_packsswb((__v4hi)__m1, (__v4hi)__m2);
haraka.c: ^~~~~~~~~~~~~~~~~~~~~~~~~~~~~~~~~~~~~~~~~~~~~~~~~~~~~~~~~~
haraka.c: /usr/lib/llvm-3.8/bin/../lib/clang/3.8.0/include/mmintrin.h:75:12: error: invalid conversion between vector type '__m64' (vector of 1 'long long' value) and integer type 'int' of different size
haraka.c: return (__m64)__builtin_ia32_packssdw((__v2si)__m1, (__v2si)__m2);
haraka.c: ^~~~~~~~~~~~~~~~~~~~~~~~~~~~~~~~~~~~~~~~~~~~~~~~~~~~~~~~~~
haraka.c: /usr/lib/llvm-3.8/bin/../lib/clang/3.8.0/include/mmintrin.h:81:12: error: invalid conversion between vector type '__m64' (vector of 1 'long long' value) and integer type 'int' of different size
haraka.c: return (__m64)__builtin_ia32_packuswb((__v4hi)__m1, (__v4hi)__m2);
haraka.c: ^~~~~~~~~~~~~~~~~~~~~~~~~~~~~~~~~~~~~~~~~~~~~~~~~~~~~~~~~~
haraka.c: /usr/lib/llvm-3.8/bin/../lib/clang/3.8.0/include/mmintrin.h:87:12: error: invalid conversion between vector type '__m64' (vector of 1 'long long' value) and integer type 'int' of different size
haraka.c: return (__m64)__builtin_ia32_punpckhbw((__v8qi)__m1, (__v8qi)__m2);
haraka.c: ^~~~~~~~~~~~~~~~~~~~~~~~~~~~~~~~~~~~~~~~~~~~~~~~~~~~~~~~~~~
haraka.c: /usr/lib/llvm-3.8/bin/../lib/clang/3.8.0/include/mmintrin.h:93:12: error: invalid conversion between vector type '__m64' (vector of 1 'long long' value) and integer type 'int' of different size
haraka.c: return (__m64)__builtin_ia32_punpckhwd((__v4hi)__m1, (__v4hi)__m2);
haraka.c: ^~~~~~~~~~~~~~~~~~~~~~~~~~~~~~~~~~~~~~~~~~~~~~~~~~~~~~~~~~~
haraka.c: /usr/lib/llvm-3.8/bin/../lib/clang/3.8.0/include/mmintrin.h:99:12: error: invalid conversion between vector type '__m64' (vector of 1 'long long' value) and integer type 'int' of different size
haraka.c: return (__m64)__builtin_ia32_punpckhdq((__v2si)__m1, (__v2si)__m2);
haraka.c: ^~~~~~~~~~~~~~~~~~~~~~~~~~~~~~~~~~~~~~~~~~~~~~~~~~~~~~~~~~~
haraka.c: /usr/lib/llvm-3.8/bin/../lib/clang/3.8.0/include/mmintrin.h:105:12: error: invalid conversion between vector type '__m64' (vector of 1 'long long' value) and integer type 'int' of different size
haraka.c: return (__m64)__builtin_ia32_punpcklbw((__v8qi)__m1, (__v8qi)__m2);
haraka.c: ...

Number of similar (compiler,implementation) pairs: 5, namely:
CompilerImplementations
clang -march=native -O2 -fomit-frame-pointer -fwrapv -Qunused-arguments -fPIC -fPIE aesni
clang -march=native -O3 -fomit-frame-pointer -fwrapv -Qunused-arguments -fPIC -fPIE aesni
clang -march=native -O -fomit-frame-pointer -fwrapv -Qunused-arguments -fPIC -fPIE aesni
clang -march=native -Os -fomit-frame-pointer -fwrapv -Qunused-arguments -fPIC -fPIE aesni
clang -mcpu=native -O3 -fomit-frame-pointer -fwrapv -Qunused-arguments -fPIC -fPIE aesni

Compiler output

Implementation: aesni
Security model: unknown
Compiler: gcc -march=native -mtune=native -O2 -fomit-frame-pointer -fwrapv -fPIC -fPIE
haraka.c: haraka.c:11:23: fatal error: immintrin.h: No such file or directory
haraka.c: compilation terminated.

Number of similar (compiler,implementation) pairs: 4, namely:
CompilerImplementations
gcc -march=native -mtune=native -O2 -fomit-frame-pointer -fwrapv -fPIC -fPIE aesni
gcc -march=native -mtune=native -O3 -fomit-frame-pointer -fwrapv -fPIC -fPIE aesni
gcc -march=native -mtune=native -O -fomit-frame-pointer -fwrapv -fPIC -fPIE aesni
gcc -march=native -mtune=native -Os -fomit-frame-pointer -fwrapv -fPIC -fPIE aesni